Folio,Deleg,Unidmed,Id_Unid,Fecha_Dia,Fecha_Mes,Fecha_Ano,Hr_Ini,Min_Ini,Hr_Fin,Min_Fin,Edad,Sexo,Edocivi,Recado,Escolar,Ingreso,Ocupa,Relig_A,Relig_B,Telefono,Sat1,Retro,Prospe,Confi1_A,Confi1_B,Confi1_C,Confi1_D,Confi1_E,Confi1_F,Confi1_G,Retroi,Prosi,Unidad1,Motuni1,Motuni2,Motuni3,Motuni4,Motuni5,Motuni98,Motuni99,Mot_Cons,Filtroch,Consulta,Preosad,Tmsalud,Mhclinc,Expclaa_A,Expclaa_B,Expclaa_C,Expclaa_D,Expclab_A,Expclab_B,Expclab_C,Expclab_D,Mopin,Explora,Cexplora,Mexapriv,Prevenf_A,Prevenf_B,Prevenf_C,Prevenf_D,Prevmed,Conimpa_A,Conimpa_B,Conimpa_C,Conimpa_D,Conimpa_E,Conimpa_F,Conimpa_G,Conimpa_H,Conimpa_I,Conimpa_J,Conimpa_K,Filtrourg,Tespurg,Calteurg,Mottesp,Servurg,Tobscama,Pregurg,Expurg,Clarurg,Infofamur,Califurg,Filtrocir,Progciru,Topera,Caltop,Fechaop,Suspop1,Suspop3,Motoper,Infofam,Oportiff,Calciru,Filtrohos,Nochesh,Frecrevm,Asisenf,Infamho,Opinfhos,Horarioh,Acchosp_A,Acchosp_B,Acchosp_C,Acchosp_D,Acchosp_E,Acchosp_F,Acchosp_G,Calhosp,Filtrosaux,Temsad,Calftest,Saduni,Privalrx,Faltamat,Satlarx,Btratou,Calfatna_A,Calfatna_B,Calfatna_C,Calfatna_D,Calfatna_E,Calfatna_F,Calfatna_G,Calfatna_H,Calfatna_I,Calfatna_J,Calfatna_K,Calfatna_L,Calfatna_M,Calfatna_N,Calfatna_O,Calfatna_P,Calfatnb_A,Calfatnb_B,Calfatnb_C,Calfatnb_D,Calfatnb_E,Calfatnb_F,Calfatnb_G,Calfatnb_H,Calfatnb_I,Calfatnb_J,Calfatnb_K,Calfatnb_L,Calfatnb_M,Calfatnb_N,Calfatnb_O,Calfatnb_P,Calfatnbes,Infimss,Finfimss,Continf,Atn1fam,Calfinma_A,Calfinmab1,Calfinmac1,Calfinma_D,Calfinma_E,Calfinmb_A,Calfinmb_B,Calfinmb_2,Calfinmb_3,Calfinmb_C,Calfinmbc2,Calfinmb_D,Calfinmb_E,Calfinmb_F,Calfinmb_G,Calfinmb_H,Calfinmb_I,Calfinmb_J,Segur1,Segur2,Filtrofarm,Totmed,Acnomed,Tfarsurt,Calftmed,Recomuni,Norecom,Corrup,Kilos,Torta,Confi2,Sat2,Id_Unidad,Cvedelegacion,Delegacion,Nivel,Unidad,Condiarpromjun08_May09,Estrato,Fe_Prefinal_,Deleg1,Sat1_X,Fe_Finalnr,Mot_Cons_X,Continf_X,Norecom_X,Ocupa_X,Relig_B_X,Progciru_X,Suspop3_X,Motoper_X,Fecha,Entidad
7,1,HGZ 1 Aguascalientes,11,23,11,9,16,0,16,27,46,1,4,1,3,4,2,1,2,2,2,1,1,5,2,5,2,1,5,5,3,1,2,1,,,,,,,1,1,2,1,3,1,1,1,1,0,2,2,2,,1,1,1,1,1,1,0,0,1,1,1,1,1,1,1,1,1,1,1,1,1,1,3,,3,,1,2,,2,4,2,,,,,,,,,,,2,,,,,,,,,,,,,,,1,1,1,1,2,2,2,1,0,1,1,0,0,0,1,0,0,0,0,0,0,0,1,0,,4,2,,,,3,,,,,,,,1,,,1,2,2,1,1,0,1,0,1,2,,,,4,3,,2,3,3,2,3,3,2,4,1,1,,2,4,1,,2,2,2,1,1,11,1,Aguascalientes,2,HGZ 1 Aguascalientes,843,1,5.54605263157895000000,1,1,4.44464892413237000000,6,2,,2,2,,,,2009-11-23,1
8,1,HGZ 1 Aguascalientes,11,23,11,9,16,40,17,13,48,1,4,1,5,4,1,1,1,1,1,1,1,1,4,4,1,2,4,4,3,1,2,1,,,,,,,1,1,2,1,1,2,1,1,1,1,2,2,2,2,1,1,1,1,1,1,1,1,1,1,1,1,1,1,1,1,1,1,1,1,2,,,,,,,,,,,2,,,,,,,,,,,2,,,,,,,,,,,,,,,1,3,4,1,2,2,1,1,1,1,0,1,1,0,1,0,0,0,0,0,0,0,0,0,2,2,,2,2,,2,,,,,,,,,,,1,7,9,2,1,0,1,0,1,2,,,,2,2,,2,2,2,2,2,2,2,2,2,,,,,1,,2,1,1,1,1,11,1,Aguascalientes,2,HGZ 1 Aguascalientes,843,1,5.54605263157895000000,1,1,4.44464892413237000000,6,9,,1,1,,,,2009-11-23,1
20,1,HGZ 1 Aguascalientes,11,23,11,9,12,44,13,14,58,1,2,1,2,3,5,1,1,2,1,1,1,1,1,2,1,1,1,2,3,1,2,1,,,,,,,4,1,2,1,1,1,1,1,1,1,2,1,1,1,1,2,,1,1,1,0,0,1,1,1,2,1,1,1,1,1,1,1,1,2,,,,,,,,,,,2,,,,,,,,,,,2,,,,,,,,,,,,,,,1,4,5,1,1,2,1,1,0,1,0,1,0,1,0,0,0,0,0,0,0,0,1,0,,1,,2,,1,,,,,,,,,2,,,1,5,7,1,1,1,1,1,0,2,4,3,5,2,4,2,,2,2,2,2,4,2,99,1,1,,1,3,1,,2,1,2,1,1,11,1,Aguascalientes,2,HGZ 1 Aguascalientes,843,1,5.54605263157895000000,1,1,4.44464892413237000000,4,7,,5,1,,,,2009-11-23,1
23,1,HGZ 1 Aguascalientes,11,23,11,9,8,32,8,53,29,2,1,1,5,2,1,2,,1,1,1,1,2,2,4,1,1,4,2,2,1,2,1,,,,,,,4,1,2,4,,1,1,1,1,0,2,2,2,,1,2,,2,1,1,1,0,1,4,1,2,1,1,1,1,1,1,1,1,1,2,2,,6,,1,1,2,99,2,2,,,,,,,,,,,2,,,,,,,,,,,,,,,2,,,,,,,1,0,1,0,1,0,0,0,0,0,0,0,0,0,0,1,0,,2,,2,,,,,,,,,,,2,,,2,,,1,1,0,1,0,0,2,,,,2,2,,,2,2,2,2,2,2,2,1,1,,2,2,1,,2,2,2,1,1,11,1,Aguascalientes,2,HGZ 1 Aguascalientes,843,1,5.54605263157895000000,1,1,6.73681825130582000000,4,,,1,,,,,2009-11-23,1
26,1,HGZ 1 Aguascalientes,11,23,11,9,10,5,10,37,75,1,4,1,2,99,5,1,1,2,1,2,99,4,5,5,1,1,5,5,3,3,2,1,,,,,,,1,1,2,2,1,2,0,1,0,0,,2,,,1,2,,1,0,0,0,0,2,1,1,1,1,1,1,1,1,1,1,1,2,,,,,,,,,,,2,,,,,,,,,,,2,,,,,,,,,,,,,,,1,2,2,1,2,2,1,1,0,1,0,1,0,1,0,0,0,0,0,0,0,0,0,0,,2,,2,,2,,,,,,,,,,,,2,,,2,1,1,1,0,0,2,2,2,4,2,2,,,2,2,2,5,4,2,99,2,,,,,1,,2,2,2,1,1,11,1,Aguascalientes,2,HGZ 1 Aguascalientes,843,1,5.54605263157895000000,1,1,3.97103597675621000000,6,,,5,1,,,,2009-11-23,1
30,1,HGZ 1 Aguascalientes,11,23,11,9,12,17,12,41,38,2,2,1,5,4,10,2,,2,5,3,3,1,4,5,5,5,4,5,2,3,2,1,,,,,,,4,1,2,2,1,1,1,0,0,0,2,,,,3,2,,1,0,0,0,0,1,1,1,1,1,1,1,1,1,1,1,1,1,4,4,4,4,,2,2,,2,5,2,,,,,,,,,,,2,,,,,,,,,,,,,,,1,1,4,1,2,2,5,1,0,1,0,0,1,0,0,0,0,0,0,0,0,0,0,0,,2,,,5,,,,,,,,,,,,,2,,,1,1,1,1,0,0,2,5,4,5,2,3,,,3,2,3,4,4,2,4,2,,,,,2,2,2,1,2,5,5,11,1,Aguascalientes,2,HGZ 1 Aguascalientes,843,1,5.54605263157895000000,1,3,8.80757383747477000000,4,,2,10,,,,,2009-11-23,1
33,1,HGZ 1 Aguascalientes,11,23,11,9,18,27,18,55,45,2,2,1,4,3,2,1,1,2,2,4,2,1,3,99,2,2,3,2,2,2,2,1,,,,,,,4,1,2,1,1,1,1,0,1,1,3,,2,2,3,1,2,1,1,1,1,0,1,1,1,1,1,1,1,1,1,1,1,1,1,3,3,,4,,1,1,3,1,3,2,,,,,,,,,,,2,,,,,,,,,,,,,,,1,1,1,1,2,2,1,1,0,1,0,0,0,0,0,0,0,0,0,0,0,0,1,0,,2,,,,,,,,,,,,,4,,,2,,,2,1,1,1,0,0,2,3,2,5,2,2,,,2,4,2,4,4,2,99,1,2,3,1,2,1,,2,2,2,1,1,11,1,Aguascalientes,2,HGZ 1 Aguascalientes,843,1,5.54605263157895000000,1,1,5.63287965819969000000,4,,,2,1,,,,2009-11-23,1
49,1,HGZ 1 Aguascalientes,11,23,11,9,15,40,16,3,75,2,4,1,2,2,9,1,1,2,3,2,2,4,2,3,3,99,4,5,3,2,2,1,,,,,,,3,1,2,2,3,1,1,0,0,0,1,,,,1,1,1,1,1,1,1,1,1,1,1,1,1,1,1,1,1,1,1,1,2,,,,,,,,,,,1,2,6,3,1,,,4,1,2,2,1,2,4,1,1,1,3,0,0,0,0,0,0,0,2,1,3,4,1,1,2,1,1,1,1,0,1,0,0,0,0,0,0,0,0,0,0,0,0,2,1,,1,,,,,,,,,,,,,,2,,,99,1,1,1,0,0,1,2,2,2,2,2,,,1,1,1,1,1,2,99,2,,,,,1,,2,1,1,3,3,11,1,Aguascalientes,2,HGZ 1 Aguascalientes,843,1,5.54605263157895000000,1,2,5.03265120761268000000,3,,,3,1,2,,4,2009-11-23,1
50,1,HGZ 1 Aguascalientes,11,23,11,9,17,36,17,51,68,2,2,1,3,3,9,1,1,2,1,1,1,1,3,5,1,3,4,5,3,3,2,1,,,,,,,3,1,2,1,2,1,1,0,0,1,2,,,2,2,1,4,1,0,0,0,0,1,1,1,1,1,1,1,1,1,1,1,1,1,1,99,99,6,,1,1,3,2,2,2,,,,,,,,,,,2,,,,,,,,,,,,,,,1,3,4,1,1,2,1,1,0,1,0,0,0,1,0,0,0,0,0,0,0,0,0,0,,2,,,,1,,,,,,,,,,,,2,,,1,1,0,1,0,0,2,,,,3,4,,,3,2,4,2,2,99,99,2,,,,,1,,2,1,1,1,1,11,1,Aguascalientes,2,HGZ 1 Aguascalientes,843,1,5.54605263157895000000,1,1,5.03265120761268000000,3,,,3,1,,,,2009-11-23,1
51,1,HGZ 1 Aguascalientes,11,23,11,9,17,56,18,20,32,1,2,1,5,5,10,1,1,1,1,2,3,1,1,1,2,2,2,3,2,1,2,1,,,,,,,3,1,2,1,1,1,1,1,1,1,1,1,2,5,2,2,,99,1,0,1,0,1,1,1,1,1,1,1,1,1,1,1,1,1,2,4,4,1,1,1,1,2,1,3,2,,,,,,,,,,,1,2,4,3,3,3,2,0,0,0,0,0,0,0,2,2,,,,,,,1,0,1,0,0,0,1,0,0,0,0,0,1,0,0,1,0,,2,,,,1,,,,,,2,,,1,,,2,,,1,1,0,1,0,0,2,,,,1,1,,,2,2,4,3,2,1,2,1,2,1,2,5,2,2,1,1,2,2,1,11,1,Aguascalientes,2,HGZ 1 Aguascalientes,843,1,5.54605263157895000000,1,1,6.94965558583586000000,3,,2,10,1,,,,2009-11-23,1
53,1,HGZ 1 Aguascalientes,11,23,11,9,19,49,20,17,43,2,2,1,2,3,1,1,1,2,1,1,2,2,2,5,1,1,5,5,2,99,2,1,,,,,,,3,1,1,1,1,1,1,1,0,1,1,1,,1,1,1,1,1,0,0,0,0,1,1,1,1,1,1,1,1,1,2,1,1,1,1,2,,2,,1,1,1,2,2,2,,,,,,,,,,,1,2,3,1,9,,2,0,0,9,1,0,9,0,2,1,2,4,2,2,2,1,1,0,1,0,1,0,0,1,0,0,0,0,0,0,0,0,0,,1,,1,,,1,,,,,,,,,,,2,,,1,1,1,1,0,1,1,3,2,5,2,2,,1,2,2,2,99,99,2,2,2,,,,,1,,2,1,2,1,1,11,1,Aguascalientes,2,HGZ 1 Aguascalientes,843,1,5.54605263157895000000,1,1,8.80757383747477000000,3,,,1,1,,,,2009-11-23,1
57,1,HGZ 1 Aguascalientes,11,23,11,9,10,15,10,36,65,2,2,1,2,2,9,1,1,2,1,1,1,1,1,5,1,1,5,5,3,3,2,1,,,,,,,1,1,2,1,1,99,1,1,1,1,2,2,2,2,2,1,2,1,1,1,0,0,1,1,1,1,1,1,1,1,1,1,1,1,2,,,,,,,,,,,2,,,,,,,,,,,1,9,5,1,2,2,2,0,0,0,0,1,0,0,1,1,1,2,1,1,2,2,1,0,1,0,1,0,1,0,0,0,0,0,0,0,0,0,0,,3,,3,,2,,,,,,,,,,,,1,1,1,1,1,0,1,1,0,3,,,,3,3,2,,3,3,3,3,3,2,2,2,,,,,1,,2,2,2,2,1,11,1,Aguascalientes,2,HGZ 1 Aguascalientes,843,1,5.54605263157895000000,1,1,5.03265120761268000000,6,1,,3,1,,,,2009-11-23,1
61,1,HGZ 1 Aguascalientes,11,23,11,9,12,5,12,27,36,1,2,1,3,3,5,1,1,2,3,2,2,2,4,4,2,2,5,5,3,3,2,1,,,,,13,,1,1,2,1,1,1,1,0,1,1,1,,1,1,3,1,2,1,1,1,1,0,1,1,1,1,1,1,1,1,1,1,1,1,1,4,5,5,4,,1,1,3,2,5,2,,,,,,,,,,,2,,,,,,,,,,,,,,,1,3,4,1,3,2,4,2,0,1,0,0,1,0,0,0,0,0,0,0,0,0,0,0,,1,,,3,,,,,,,,,,,,,1,2,7,1,1,0,1,0,0,3,,,,3,3,,,3,3,3,3,3,4,4,2,,,,,2,99,2,2,2,2,3,11,1,Aguascalientes,2,HGZ 1 Aguascalientes,843,1,5.54605263157895000000,1,2,6.94965558583586000000,6,7,99,5,1,,,,2009-11-23,1
65,1,HGZ 1 Aguascalientes,11,23,11,9,14,54,15,21,25,2,2,1,4,3,2,1,1,1,1,1,2,2,2,5,2,2,5,5,3,2,2,1,,,,,,,1,1,2,1,1,1,1,0,1,1,1,,1,1,1,1,2,1,1,1,1,1,1,1,1,1,1,1,1,1,1,1,1,1,2,,,,,,,,,,,2,,,,,,,,,,,2,,,,,,,,,,,,,,,1,2,3,2,2,2,2,1,0,1,0,1,0,0,0,0,0,0,0,0,0,0,1,0,,3,,2,,,,,,,,,,,3,,,2,,,1,1,1,1,0,0,2,3,3,3,2,2,,,2,2,2,2,2,2,99,1,1,,99,99,1,,2,1,2,2,1,11,1,Aguascalientes,2,HGZ 1 Aguascalientes,843,1,5.54605263157895000000,1,1,6.73681825130582000000,6,,,2,1,,,,2009-11-23,1
73,1,HGZ 1 Aguascalientes,11,23,11,9,16,45,17,10,54,2,2,1,4,3,10,1,1,1,1,2,2,2,4,5,1,1,5,5,3,3,2,1,,,,,,,4,1,1,1,1,1,1,0,1,1,2,,2,2,1,1,1,1,0,0,0,0,1,1,1,1,1,1,1,1,1,1,1,1,2,,,,,,,,,,,2,,,,,,,,,,,2,,,,,,,,,,,,,,,2,,,,,,,1,0,1,0,0,0,0,0,0,0,0,0,0,0,0,1,0,,2,,,,,,,,,,,,,1,,,2,,,1,1,1,1,0,0,2,2,2,4,2,2,,,2,2,2,99,2,2,2,1,1,,1,1,1,,2,1,1,1,1,11,1,Aguascalientes,2,HGZ 1 Aguascalientes,843,1,5.54605263157895000000,1,1,5.63287965819969000000,4,,,10,1,,,,2009-11-23,1
80,1,HGZ 1 Aguascalientes,11,23,11,9,11,1,11,32,53,2,2,1,4,3,2,1,1,2,2,1,1,1,2,2,2,2,2,2,3,3,1,1,,,4,5,,,3,1,2,1,1,1,1,0,1,1,2,,2,2,2,1,2,1,1,1,1,1,1,1,1,1,1,1,1,1,1,1,1,1,1,2,5,4,2,,1,1,2,1,3,2,,,,,,,,,,,2,,,,,,,,,,,,,,,1,4,3,1,4,2,3,1,0,1,0,1,0,1,0,0,0,0,0,0,0,0,0,0,,2,,1,,2,,,,,,,,,,,,1,7,7,99,1,1,1,1,0,2,2,2,2,2,4,2,,2,3,2,99,99,2,4,2,,,,,1,,2,1,1,2,2,11,1,Aguascalientes,2,HGZ 1 Aguascalientes,843,1,5.54605263157895000000,1,1,5.63287965819969000000,3,7,,2,1,,,,2009-11-23,1
81,1,HGZ 1 Aguascalientes,11,23,11,9,11,40,12,3,55,1,2,1,4,99,5,99,,1,1,2,1,4,2,99,2,2,4,99,3,1,2,1,,,,5,,,98,1,2,2,1,1,1,1,1,1,2,2,2,2,2,1,2,2,0,0,0,0,2,1,1,1,1,1,1,1,1,1,1,1,2,,,,,,,,,,,2,,,,,,,,,,,2,,,,,,,,,,,,,,,1,4,4,2,4,2,4,1,0,1,0,0,0,0,0,0,0,0,0,0,0,0,0,0,,2,,,,,,,,,,,,,,,,99,,,99,1,0,1,0,0,3,,,,2,2,,,3,3,2,99,99,4,99,2,,,,,1,,2,1,1,2,1,11,1,Aguascalientes,2,HGZ 1 Aguascalientes,843,1,5.54605263157895000000,1,1,4.44464892413237000000,99,,,5,,,,,2009-11-23,1
86,1,HGZ 1 Aguascalientes,11,23,11,9,16,0,16,31,35,2,2,1,6,4,10,1,1,1,4,1,1,1,2,5,2,2,4,4,2,3,2,1,,,4,5,,,2,1,2,1,1,2,1,1,1,1,2,2,2,2,2,1,2,1,1,1,1,1,1,3,3,1,1,1,1,1,1,1,1,1,1,1,1,,6,,1,1,1,2,2,2,,,,,,,,,,,2,,,,,,,,,,,,,,,1,1,2,1,2,2,1,1,0,1,0,1,0,0,0,0,0,0,0,0,0,0,0,0,,2,,3,,,,,,,,,,,,,,1,1,7,1,1,1,1,0,0,2,4,4,4,2,2,,,2,2,2,2,2,2,2,2,,,,,1,,2,1,1,2,4,11,1,Aguascalientes,2,HGZ 1 Aguascalientes,843,1,5.54605263157895000000,1,3,8.80757383747477000000,2,7,,10,1,,,,2009-11-23,1
87,1,HGZ 1 Aguascalientes,11,23,11,9,17,30,17,55,59,1,3,1,2,2,9,1,1,1,1,2,3,5,5,99,1,5,5,5,1,3,2,1,,,4,5,,,4,1,2,1,1,1,0,0,0,0,,,,,2,1,2,1,1,1,1,0,1,3,3,1,1,1,1,1,1,1,1,1,1,4,5,4,4,,2,2,,2,3,2,,,,,,,,,,,2,,,,,,,,,,,,,,,1,1,1,1,4,2,1,1,1,1,0,1,0,0,0,0,0,0,0,0,0,0,1,0,2,1,,2,,,,,,,,,,,2,,,2,,,1,1,1,1,0,0,3,5,5,5,5,5,,,5,5,3,3,3,2,3,1,1,,1,1,1,,2,1,2,1,1,11,1,Aguascalientes,2,HGZ 1 Aguascalientes,843,1,5.54605263157895000000,1,1,4.44464892413237000000,4,,,3,1,,,,2009-11-23,1
90,1,HGZ 1 Aguascalientes,11,23,11,9,19,12,19,42,49,1,2,1,5,99,5,1,1,1,1,1,1,2,2,99,2,4,4,4,1,99,2,1,,,,5,,,4,1,2,1,1,1,1,0,1,1,2,,2,2,1,1,2,1,1,1,1,1,1,1,1,1,1,1,1,1,1,1,1,1,2,,,,,,,,,,,2,,,,,,,,,,,2,,,,,,,,,,,,,,,1,4,5,1,4,2,4,1,0,1,0,0,0,1,0,0,1,0,0,0,0,0,1,0,,2,,,,2,,,2,,,,,,2,,,2,,,99,1,1,1,1,0,2,5,5,5,2,2,2,,3,3,3,3,3,5,99,1,2,3,1,2,1,,2,2,2,2,1,11,1,Aguascalientes,2,HGZ 1 Aguascalientes,843,1,5.54605263157895000000,1,1,4.44464892413237000000,4,,,5,1,,,,2009-11-23,1
92,1,HGZ 1 Aguascalientes,11,23,11,9,8,54,9,23,55,1,4,1,4,2,5,1,1,2,1,1,2,3,3,5,1,3,5,5,3,2,2,1,,,,,,,4,1,1,2,1,1,1,0,1,0,4,,4,,1,1,1,2,0,0,0,0,2,1,1,1,1,1,1,1,1,1,1,1,2,,,,,,,,,,,2,,,,,,,,,,,2,,,,,,,,,,,,,,,1,4,4,1,2,2,5,1,0,1,0,1,0,0,0,0,1,0,0,0,0,1,1,0,,2,,2,,,,,2,,,,,2,2,,,2,,,1,1,0,1,0,0,2,,,,3,2,,,4,2,2,99,2,2,3,1,1,,2,1,2,2,2,1,1,1,1,11,1,Aguascalientes,2,HGZ 1 Aguascalientes,843,1,5.54605263157895000000,1,1,4.44464892413237000000,4,,2,5,1,,,,2009-11-23,1
95,1,HGZ 1 Aguascalientes,11,23,11,9,11,37,12,0,44,1,2,2,1,3,5,1,1,2,1,1,1,5,5,99,4,1,5,4,1,3,2,1,,,,,,,4,1,1,4,,1,1,1,1,1,2,2,2,2,1,2,,1,1,1,1,1,2,1,1,1,1,1,1,1,1,1,1,1,2,,,,,,,,,,,2,,,,,,,,,,,2,,,,,,,,,,,,,,,1,4,3,1,1,1,4,1,0,0,1,0,0,0,0,0,0,0,0,0,0,0,1,0,,,2,,,,,,,,,,,,2,,,1,7,12,1,1,1,1,0,0,4,4,4,4,2,2,,,4,4,2,2,4,3,3,1,1,,99,99,1,,2,1,1,4,1,11,1,Aguascalientes,2,HGZ 1 Aguascalientes,843,1,5.54605263157895000000,1,1,6.94965558583586000000,4,1,,5,1,,,,2009-11-23,1
100,1,HGZ 1 Aguascalientes,11,23,11,9,16,3,16,32,46,1,3,1,4,3,2,1,1,1,4,1,99,5,5,5,5,1,5,5,3,3,2,1,,,,,,,3,1,2,1,1,1,1,1,1,1,1,1,1,1,2,1,2,1,1,1,1,0,1,1,3,1,1,1,1,1,1,1,1,1,2,,,,,,,,,,,2,,,,,,,,,,,2,,,,,,,,,,,,,,,1,4,5,1,2,2,1,1,0,0,1,0,0,0,0,0,0,0,0,0,1,0,1,0,,,4,,,,,,,,,,1,,2,,,2,,,1,1,1,1,0,0,3,5,5,5,4,4,,,4,4,2,99,3,4,5,1,2,1,1,1,2,3,2,1,1,5,4,11,1,Aguascalientes,2,HGZ 1 Aguascalientes,843,1,5.54605263157895000000,1,3,4.44464892413237000000,3,,3,2,1,,,,2009-11-23,1
108,1,HGZ 1 Aguascalientes,11,23,11,9,15,26,15,48,32,2,2,1,5,3,7,1,1,2,2,3,3,1,2,5,2,2,5,5,3,3,2,1,,,,,,,1,1,2,2,1,2,1,1,1,1,4,4,4,4,3,2,,99,0,0,0,0,2,1,1,1,1,1,1,1,1,1,1,1,1,4,5,5,2,,1,2,,1,3,2,,,,,,,,,,,2,,,,,,,,,,,,,,,2,,,,,,,99,0,0,1,0,0,0,0,0,0,0,0,1,0,0,1,1,,,4,,,,,,,,,2,,,4,4,SUBDIRECTOR DE LA CLINICA,1,1,1,1,0,1,1,0,0,,3,3,3,2,2,,,3,4,2,5,5,4,4,1,3,3,1,1,2,2,2,1,2,2,2,11,1,Aguascalientes,2,HGZ 1 Aguascalientes,843,1,5.54605263157895000000,1,1,8.80757383747477000000,6,1,2,7,1,,,,2009-11-23,1
110,1,HGZ 1 Aguascalientes,11,23,11,9,16,31,16,58,47,1,1,1,2,2,4,1,1,2,2,2,1,4,4,5,2,4,5,5,3,3,2,1,,,,,,,2,1,2,2,1,1,1,0,1,1,2,,2,2,1,1,1,1,0,0,0,0,1,1,1,1,1,1,1,1,1,1,1,1,2,,,,,,,,,,,2,,,,,,,,,,,2,,,,,,,,,,,,,,,2,,,,,,,1,0,0,1,0,0,0,0,0,0,0,0,0,0,0,1,0,,,1,,,,,,,,,,,,1,,,1,1,1,1,0,1,0,0,0,,5,5,5,,,,,4,2,4,2,2,2,2,2,,,,,1,,2,1,1,2,2,11,1,Aguascalientes,2,HGZ 1 Aguascalientes,843,1,5.54605263157895000000,1,1,4.44464892413237000000,2,1,,4,1,,,,2009-11-23,1
114,1,HGZ 1 Aguascalientes,11,23,11,9,19,31,19,57,18,2,1,1,5,1,6,1,2,1,2,2,3,4,2,5,2,1,2,5,1,1,2,1,,,,,,,4,1,2,3,,2,1,1,1,1,3,3,3,3,3,1,2,1,1,1,1,0,1,2,1,1,1,1,1,1,1,1,1,1,2,,,,,,,,,,,2,,,,,,,,,,,2,,,,,,,,,,,,,,,1,4,4,2,5,2,2,2,1,1,0,1,0,0,0,0,0,0,0,0,0,0,0,0,2,2,,2,,,,,,,,,,,,,,1,5,1,1,1,1,1,0,0,2,5,5,5,5,4,,,4,4,5,5,4,3,2,2,,,,,2,3,2,2,1,4,3,11,1,Aguascalientes,2,HGZ 1 Aguascalientes,843,1,5.54605263157895000000,1,1,6.73681825130582000000,4,1,3,6,2,,,,2009-11-23,1
120,1,HGZ 1 Aguascalientes,11,23,11,9,12,1,12,23,43,1,2,1,5,3,1,1,1,1,4,3,3,3,4,2,2,3,3,5,3,3,2,1,,,,,,,3,1,2,1,2,1,1,0,1,0,1,,1,,3,2,,1,0,0,0,0,2,1,1,1,1,1,1,1,1,1,1,1,2,,,,,,,,,,,2,,,,,,,,,,,2,,,,,,,,,,,,,,,1,4,4,2,1,2,2,1,1,1,0,1,0,0,0,0,0,0,0,0,0,0,1,0,4,2,,3,,,,,,,,,,,2,,,2,,,1,1,1,1,0,0,2,2,2,2,2,2,,,2,2,2,2,2,1,1,1,2,3,1,1,2,3,2,1,2,2,1,11,1,Aguascalientes,2,HGZ 1 Aguascalientes,843,1,5.54605263157895000000,1,3,6.94965558583586000000,3,,3,1,1,,,,2009-11-23,1
133,1,HGZ 1 Aguascalientes,11,23,11,9,12,15,12,39,63,1,4,1,5,2,5,1,1,1,5,2,2,1,1,4,2,1,4,5,3,3,2,1,,,4,5,,,1,1,2,1,1,1,0,0,0,0,,,,,2,2,,1,0,0,0,0,1,1,1,1,1,1,1,1,1,1,1,1,1,1,2,,2,,1,1,2,1,2,2,,,,,,,,,,,2,,,,,,,,,,,,,,,1,1,2,2,2,2,1,1,1,0,0,0,0,0,0,0,0,0,0,0,0,0,1,0,1,,,,,,,,,,,,,,2,,,1,2,1,1,0,1,0,0,0,,2,2,2,,,,,3,3,4,5,5,3,4,1,1,,1,1,1,,2,1,1,2,5,11,1,Aguascalientes,2,HGZ 1 Aguascalientes,843,1,5.54605263157895000000,1,3,3.97103597675621000000,6,1,,5,1,,,,2009-11-23,1
136,1,HGZ 1 Aguascalientes,11,23,11,9,16,23,16,49,66,2,2,1,1,1,9,1,1,1,1,1,1,2,2,4,2,1,4,5,3,1,2,1,2,3,4,5,,,3,1,1,1,1,1,1,1,1,1,2,2,2,2,1,1,1,1,1,1,1,1,1,1,1,1,1,1,1,1,1,1,1,1,1,1,1,,2,,1,1,1,1,1,1,1,5,2,1,,,31,1,1,2,1,20,5,1,1,1,1,0,0,0,0,0,0,0,1,1,1,2,2,2,2,1,1,0,1,1,1,0,1,1,0,0,0,0,1,0,0,1,0,,2,2,2,,2,2,,,,,2,,,2,,,1,2,1,2,0,0,0,0,1,,,,,,,,2,2,2,2,2,2,2,2,1,1,,1,2,1,,2,1,1,2,1,11,1,Aguascalientes,2,HGZ 1 Aguascalientes,843,1,5.54605263157895000000,1,1,5.03265120761268000000,3,1,,3,1,1,,11,2009-11-23,1
142,1,HGZ 1 Aguascalientes,11,23,11,9,8,42,9,15,49,2,2,1,3,2,9,1,99,2,2,2,1,1,5,4,2,1,4,4,2,1,2,1,,,,5,,,4,1,2,2,1,1,1,0,1,0,1,,1,,2,1,2,1,1,1,1,1,1,1,1,1,1,1,1,1,1,1,1,1,2,,,,,,,,,,,2,,,,,,,,,,,2,,,,,,,,,,,,,,,1,2,1,1,2,2,1,1,0,1,0,0,0,1,0,0,0,0,0,0,0,0,1,0,,1,,,,1,,,,,,,,,2,,,2,,,1,1,1,1,1,0,2,2,2,4,2,2,2,,2,2,2,2,2,2,2,2,,,,,1,,2,1,1,2,2,11,1,Aguascalientes,2,HGZ 1 Aguascalientes,843,1,5.54605263157895000000,1,1,5.63287965819969000000,4,,,3,99,,,,2009-11-23,1
145,1,HGZ 1 Aguascalientes,11,23,11,9,12,20,12,56,42,2,2,1,5,3,10,1,1,2,2,2,2,1,2,5,3,1,2,5,3,1,1,1,,,,,,,4,1,1,3,,1,1,1,1,0,1,1,2,,1,2,,2,0,0,0,0,1,5,2,4,1,2,1,2,1,1,1,1,1,1,1,,3,,1,1,3,1,3,2,,,,,,,,,,,1,30,2,3,3,3,4,0,0,0,1,0,0,1,3,1,1,2,1,2,2,3,1,0,1,0,0,0,1,0,0,0,0,0,0,0,0,1,0,,2,,,,2,,,,,,,,,2,,,2,,,2,1,0,1,1,0,2,,,,2,2,2,,2,2,3,2,2,2,2,1,1,,1,1,1,,2,1,1,2,2,11,1,Aguascalientes,2,HGZ 1 Aguascalientes,843,1,5.54605263157895000000,1,1,8.80757383747477000000,4,,,10,1,,,,2009-11-23,1
154,1,HGZ 1 Aguascalientes,11,23,11,9,19,40,20,6,46,1,2,1,4,3,5,1,1,1,2,2,1,1,4,5,2,1,5,5,3,2,2,,2,3,,5,,,1,2,,,,,,,,,,,,,,,,,,,,,,2,1,1,1,1,1,1,1,1,1,1,2,,,,,,,,,,,1,2,6,3,1,,,10,2,2,2,1,4,2,1,2,1,2,0,0,0,0,0,0,0,2,1,2,2,1,2,2,1,1,1,1,1,1,0,0,0,0,0,0,0,0,0,0,1,0,2,2,2,2,,,,,,,,,,,2,,,1,5,1,1,0,1,1,0,0,,2,2,4,2,2,,,2,2,2,2,2,2,2,1,1,,1,3,1,,2,1,1,2,2,11,1,Aguascalientes,2,HGZ 1 Aguascalientes,843,1,5.54605263157895000000,1,1,4.44464892413237000000,6,1,,5,1,2,,10,2009-11-23,1
6,1,HGZ 2 Aguascalientes,12,24,11,9,16,57,17,19,36,1,2,1,4,1,5,2,,2,1,1,2,1,2,5,2,1,4,5,3,3,2,1,,,,,,,4,1,2,1,1,1,1,1,1,1,1,1,1,1,1,2,,1,0,0,0,0,1,1,1,1,1,1,1,1,1,1,1,1,2,,,,,,,,,,,2,,,,,,,,,,,2,,,,,,,,,,,,,,,1,2,2,1,2,2,1,1,0,1,0,1,0,0,0,0,0,0,1,0,0,0,1,0,,1,,2,,,,,,,2,,,,2,,,2,,,1,1,1,1,0,0,2,4,4,4,2,2,,,4,4,2,4,4,2,3,1,1,,1,3,1,,2,1,1,2,1,12,1,Aguascalientes,2,HGZ 2 Aguascalientes,643,2,7.84146341463415000000,1,1,9.82599222198961000000,4,,,5,,,,,2009-11-24,1
9,1,HGZ 2 Aguascalientes,12,24,11,9,9,2,9,26,47,1,2,1,3,3,5,1,1,2,1,1,1,2,2,2,1,2,4,4,3,3,2,1,,,,,,,4,1,2,1,1,1,1,1,1,1,2,2,2,2,1,1,2,1,1,1,1,0,1,1,1,4,1,1,1,1,1,1,1,1,1,4,5,3,6,,1,2,,2,2,2,,,,,,,,,,,2,,,,,,,,,,,,,,,1,2,4,1,3,2,4,1,0,1,0,1,0,0,0,0,0,0,0,0,0,0,1,0,,2,,2,,,,,,,,,,,2,,,1,5,7,1,1,1,1,0,0,1,1,2,4,2,2,,,3,3,3,4,4,3,99,1,1,,2,2,1,,2,1,1,1,1,12,1,Aguascalientes,2,HGZ 2 Aguascalientes,643,2,7.84146341463415000000,1,1,6.28420865157830000000,4,7,,5,1,,,,2009-11-24,1
10,1,HGZ 2 Aguascalientes,12,24,11,9,10,8,10,30,38,1,2,1,4,99,5,1,1,2,2,1,1,4,2,5,4,2,5,5,3,3,2,1,,,,,,,4,1,2,2,2,1,0,0,1,0,,,2,,2,1,2,1,1,0,0,0,1,1,1,1,1,1,1,1,1,1,1,1,1,1,2,,1,4,1,1,3,2,3,2,,,,,,,,,,,1,2,2,3,3,2,5,0,0,0,0,0,0,0,2,1,2,2,1,2,2,2,1,1,1,0,0,0,0,0,0,0,0,1,1,0,0,0,0,2,2,,,,,,,,,2,2,,,,,,1,5,9,1,1,0,1,0,0,2,,,,2,2,,,3,3,3,3,3,2,99,2,,,,,1,,2,1,1,4,2,12,1,Aguascalientes,2,HGZ 2 Aguascalientes,643,2,7.84146341463415000000,1,1,9.82599222198961000000,4,9,,5,1,,,,2009-11-24,1
15,1,HGZ 2 Aguascalientes,12,24,11,9,11,26,11,48,59,2,2,1,6,4,2,1,1,1,2,1,99,2,5,5,3,2,5,5,3,3,2,1,,,,,,,4,1,2,1,1,1,1,1,0,0,1,1,,,1,1,2,2,0,0,0,0,1,2,4,1,1,1,1,1,1,1,1,1,2,,,,,,,,,,,2,,,,,,,,,,,2,,,,,,,,,,,,,,,2,,,,,,,1,0,1,0,1,0,0,0,0,0,0,1,0,0,0,0,0,,2,,2,,,,,,,2,,,,,,,2,,,2,1,0,1,0,0,2,,,,2,2,,,2,2,2,2,99,2,2,2,,,,,1,,2,1,1,2,2,12,1,Aguascalientes,2,HGZ 2 Aguascalientes,643,2,7.84146341463415000000,1,1,7.96422657572845000000,4,,,2,1,,,,2009-11-24,1
20,1,HGZ 2 Aguascalientes,12,24,11,9,12,40,13,6,66,2,2,1,6,3,8,1,1,1,4,1,3,2,5,4,3,3,5,3,3,3,2,1,,,,,,,4,1,1,1,1,1,0,1,0,1,,2,,4,4,1,2,1,0,0,0,0,1,1,2,1,1,1,1,1,1,1,1,1,2,,,,,,,,,,,2,,,,,,,,,,,2,,,,,,,,,,,,,,,1,4,5,1,2,2,5,1,0,1,0,0,0,0,0,0,0,0,0,0,0,0,1,0,,1,,,,,,,,,,,,,2,,,1,2,3,1,1,1,1,0,0,2,4,4,4,2,2,,,2,2,2,99,2,2,4,1,1,,1,2,99,,2,1,2,3,5,12,1,Aguascalientes,2,HGZ 2 Aguascalientes,643,2,7.84146341463415000000,1,3,7.11557443548351000000,4,3,,8,1,,,,2009-11-24,1
23,1,HGZ 2 Aguascalientes,12,24,11,9,10,20,10,42,47,2,2,1,4,4,2,1,1,2,3,1,2,3,4,5,3,1,5,5,2,2,2,1,,,,,,,11,1,2,1,3,1,1,1,1,0,1,1,1,,1,2,,2,0,0,0,0,2,1,1,1,1,1,1,1,1,1,1,1,2,,,,,,,,,,,2,,,,,,,,,,,2,,,,,,,,,,,,,,,1,4,5,1,1,2,1,1,0,0,1,0,0,0,0,0,0,1,1,1,1,0,1,0,,,1,,,,,,,1,1,1,1,,1,,,2,,,1,1,0,1,0,0,2,,,,2,2,,,3,3,2,2,3,1,1,1,3,3,1,1,1,,2,1,1,3,3,12,1,Aguascalientes,2,HGZ 2 Aguascalientes,643,2,7.84146341463415000000,1,2,7.96422657572845000000,3,,,2,1,,,,2009-11-24,1
24,1,HGZ 2 Aguascalientes,12,24,11,9,10,48,11,10,58,2,2,1,3,2,9,1,1,1,1,1,1,1,4,4,1,1,3,5,2,2,2,1,,3,,,,,18,1,2,1,1,1,1,1,1,0,1,1,1,,1,1,1,1,0,0,1,1,1,1,1,1,1,1,1,1,1,1,1,1,1,1,1,,1,4,1,1,1,1,1,2,,,,,,,,,,,1,9,4,1,1,1,1,0,0,0,0,0,0,0,1,1,1,1,1,1,2,1,1,1,1,0,1,1,0,0,0,0,1,1,0,0,0,1,0,1,1,,1,1,,,,,1,1,,,,1,,,1,2,1,1,0,1,0,0,0,,1,1,1,,,,,2,2,2,2,2,1,1,1,1,,99,99,1,,2,1,2,1,1,12,1,Aguascalientes,2,HGZ 2 Aguascalientes,643,2,7.84146341463415000000,1,1,7.96422657572845000000,3,1,,3,1,,,,2009-11-24,1
33,1,HGZ 2 Aguascalientes,12,24,11,9,8,7,8,41,54,1,2,1,6,5,7,1,1,1,1,1,1,4,3,4,1,2,4,4,2,2,2,,,,,5,,,99,2,,,,,,,,,,,,,,,,,,,,,,1,1,1,1,1,1,1,1,1,1,1,2,,,,,,,,,,,1,3,2,2,1,,,25,1,1,1,1,2,5,1,1,2,4,0,0,0,0,0,0,0,1,1,1,1,1,4,2,2,1,1,1,0,0,0,1,0,0,0,0,0,0,0,0,0,0,2,2,,,,2,,,,,,,,,,,,1,5,7,1,0,1,1,1,0,,5,5,5,2,2,2,,2,4,2,2,99,2,2,2,,,,,1,,2,1,1,1,1,12,1,Aguascalientes,2,HGZ 2 Aguascalientes,643,2,7.84146341463415000000,1,1,6.28420865157830000000,99,7,,7,1,3,,12,2009-11-24,1
34,1,HGZ 2 Aguascalientes,12,24,11,9,9,17,9,56,39,2,1,2,1,2,2,1,1,2,1,1,1,5,4,5,1,1,5,5,2,3,2,1,,,,,,,2,1,2,1,1,1,1,1,0,1,2,2,,2,1,1,2,1,1,1,1,0,1,1,1,1,1,1,1,1,1,1,1,1,2,,,,,,,,,,,2,,,,,,,,,,,2,,,,,,,,,,,,,,,2,,,,,,,1,0,1,0,0,0,0,0,0,0,0,0,0,0,0,1,0,,2,,,,,,,,,,,,,2,,,1,5,7,1,1,1,1,0,0,4,5,5,5,4,4,,,4,4,4,99,99,2,99,1,1,,2,2,1,,2,2,2,1,1,12,1,Aguascalientes,2,HGZ 2 Aguascalientes,643,2,7.84146341463415000000,1,1,12.45286920376460000000,2,7,,2,1,,,,2009-11-24,1
35,1,HGZ 2 Aguascalientes,12,24,11,9,10,4,10,36,58,2,2,1,3,1,9,1,1,1,1,2,2,99,99,99,1,1,2,5,3,1,2,1,,,,,,,99,1,2,2,1,1,1,1,1,1,2,2,2,2,1,1,2,1,1,1,1,0,1,1,1,1,1,1,1,1,1,1,1,1,2,,,,,,,,,,,2,,,,,,,,,,,2,,,,,,,,,,,,,,,1,2,3,1,1,2,1,1,0,1,0,1,0,0,0,0,0,0,0,1,1,0,1,0,,1,,1,,,,,,,,1,1,,2,,,2,,,99,1,1,1,0,0,2,5,5,5,2,2,,,3,2,2,99,99,2,99,2,,,,,1,,2,2,2,1,1,12,1,Aguascalientes,2,HGZ 2 Aguascalientes,643,2,7.84146341463415000000,1,1,7.96422657572845000000,99,,,3,1,,,,2009-11-24,1
36,1,HGZ 2 Aguascalientes,12,24,11,9,10,42,11,10,58,1,2,1,2,5,5,1,1,1,1,3,99,5,4,5,1,1,5,5,1,1,2,1,,,,,,,4,1,2,1,1,1,1,0,1,1,2,,2,2,1,1,2,1,1,1,1,0,1,1,1,1,1,1,1,1,1,1,1,1,2,,,,,,,,,,,2,,,,,,,,,,,2,,,,,,,,,,,,,,,2,,,,,,,1,0,1,0,1,0,0,0,0,0,0,0,0,0,0,1,0,,1,,1,,,,,,,,,,,2,,,1,2,8,99,1,0,1,0,0,1,,,,2,2,,,2,2,2,99,4,4,4,1,2,3,1,1,1,,2,1,1,1,1,12,1,Aguascalientes,2,HGZ 2 Aguascalientes,643,2,7.84146341463415000000,1,1,6.28420865157830000000,4,8,,5,1,,,,2009-11-24,1
40,1,HGZ 2 Aguascalientes,12,24,11,9,16,5,16,31,21,2,2,1,5,3,2,1,1,2,2,1,2,5,2,5,2,1,5,5,1,1,2,1,,,,,20,,4,1,2,1,1,1,1,0,1,1,2,,2,2,2,1,2,1,1,1,1,1,1,1,1,1,1,1,1,1,1,1,1,1,2,,,,,,,,,,,2,,,,,,,,,,,2,,,,,,,,,,,,,,,1,4,3,1,2,2,1,1,0,0,1,0,0,1,0,0,0,0,0,0,0,0,1,1,,,2,,,4,,,,,,,,,2,2,ASITENCIA,1,2,3,1,1,1,1,1,0,2,5,5,5,3,4,2,,2,2,2,4,2,4,2,1,1,,1,1,99,,2,1,1,2,2,12,1,Aguascalientes,2,HGZ 2 Aguascalientes,643,2,7.84146341463415000000,1,1,9.52506536772886000000,4,3,,2,1,,,,2009-11-24,1
41,1,HGZ 2 Aguascalientes,12,24,11,9,17,6,17,32,26,2,2,1,4,3,4,1,1,2,2,1,1,1,1,2,1,1,2,2,1,3,2,,,,,5,,,2,2,,,,,,,,,,,,,,,,,,,,,,2,1,1,1,1,1,1,1,1,1,1,1,1,1,,2,,1,1,2,1,1,1,3,1,1,1,,,8,1,2,1,1,1,1,2,1,2,2,0,0,0,0,0,0,0,1,1,3,3,1,2,2,1,1,0,0,1,0,0,0,1,0,0,0,0,0,0,0,0,0,,,2,,,,2,,,,,,,,,,,2,,,1,1,0,1,0,1,2,,,,3,2,,3,2,2,2,2,2,2,2,2,,,,,1,,2,1,2,2,2,12,1,Aguascalientes,2,HGZ 2 Aguascalientes,643,2,7.84146341463415000000,1,1,9.52506536772886000000,2,,,4,1,3,,8,2009-11-24,1
44,1,HGZ 2 Aguascalientes,12,24,11,9,9,56,10,17,79,2,2,1,2,1,9,1,1,1,1,1,1,1,2,2,1,1,2,2,3,3,2,1,,,,5,,,4,1,2,1,1,1,1,1,1,1,1,1,1,1,1,1,1,1,1,1,1,0,1,1,1,1,1,1,1,1,1,1,1,1,2,,,,,,,,,,,2,,,,,,,,,,,2,,,,,,,,,,,,,,,1,4,5,1,2,2,2,1,0,1,0,1,0,1,1,0,0,0,0,0,0,0,1,0,,2,,3,,3,3,,,,,,,,2,,,2,,,99,1,1,1,1,1,2,2,2,2,2,2,2,2,2,2,2,2,2,2,2,1,1,,1,2,1,,2,2,2,1,1,12,1,Aguascalientes,2,HGZ 2 Aguascalientes,643,2,7.84146341463415000000,1,1,7.11557443548351000000,4,,,3,1,,,,2009-11-24,1