folio,deleg,unidmed,fecha_d,fecha_m,fecha_a,hr_ini_h,hr_ini_m,hr_fin_h,hr_fin_m,edad,sexo,edocivi,escolar,ocupa,ingreso,traimss,sat1,sat3,cons_mf,mot_cons1,frecmf,probsal,tmedico,citapre,hrcita,tdifcons,citatel,nocitatel,retro,prospe,btratou,preosad,tmsalud,mhclinco,expclaa_a,expclaa_b,expclaa_c,expclaa_d,expclab_a,expclab_b,expclab_c,expclab_d,mopin,explora,cexplora,mexapriv,prevasis_a,prevasis_b,prevasis_c,prevmed_a,prevmed_b,calfatna_a,calfatna_b,calfatna_c,calfatna_d,calfatna_e,calfatna_f,calfatna_g,calfatna_h,calfatna_i,calfatna_j,calfatna_k,calfatna_l,calfatna_m,calfatna_n,calfatnb_a,calfatnb_b,calfatnb_c,calfatnb_d,calfatnb_e,calfatnb_f,calfatnb_g,calfatnb_h,calfatnb_i,calfatnb_j,calfatnb_k,calfatnb_l,calfatnb_m,calfatnb_n,infimss,finfimss,continf,cartel,filtrosaux,temsad,saduni,satlarx,calfinma_a,calfinmb_a1,calfinma_b,calfinmb_b1,calfinmb_b2,calfinmb_b3,calfinma_c,calfinmb_c1,calfinmb_c2,calfinma_d,calfinmb_d1,calfinma_e,calfinmb_e1,calfinmb_f,calfinmb_g,calfinmb_h,calfinmb_i,calfinmb_j,ordylim1,ordylim2,recomuni,norecom,corrup,atn1fam,caqod,sat2,filtrofarm,tfarsurt,totmed,acnomed,raznosurt,versurt,versurt2,farm1,farm2,farm3,farm4,confi1_a,confi1_b,confi1_c,confi1_d,confi1_e,confi1_f,confi1_g,id_Unidad,Cve_Delegaci�n,Delegaci�n,Nivel,Unidad,Promedio_Diario2011,estrato,MOSCondia,FE_FinalNR
5,7,UMF 89 SALTILLO C/UMAA,4,9,12,9,32,9,50,43,1,2,5,1,3,1,3,3,2,5,3,1,5,2,,,,,2,2,1,1,1,2,1,1,1,1,2,2,2,2,3,2,,,1,1,1,2,2,1,1,2,1,2,2,2,2,2,2,2,2,2,2,1,2,,2,,,,,,,,,,,2,,,2,2,,,,1,2,2,,,,2,,,2,,2,,2,2,2,2,2,97,,1,,1,2,2,3,2,,,,,,,2,,,,1,2,3,3,3,3,4,1956,7,Coahuila,1,UMF 89 SALTILLO C/UMAA,468,3,0.098796707,62.32894737
155,16,HGZMF   1 PACHUCA,30,8,12,16,22,16,40,69,2,2,2,1,2,1,2,2,2,5,1,1,1,2,,,,,2,2,1,1,1,1,2,2,2,2,,,,,2,1,2,1,1,1,2,1,1,1,1,2,2,2,2,2,2,2,2,2,2,2,2,2,2,,,,,,,,,,,,,2,,,2,2,,,,1,2,2,,,,1,2,5,2,,2,,2,2,2,2,2,2,2,1,,2,1,2,2,2,,,,,,,1,1,,,3,3,2,2,3,5,5,719,16,Hidalgo,1,HGZMF   1 PACHUCA,1165,1,1,7.28125
3,11,UMF      32 EL VERGEL,3,9,12,9,40,9,59,40,1,1,3,1,2,1,2,2,2,6,5,1,4,2,,,,,2,2,1,2,1,1,1,2,2,2,99,,,,3,1,2,1,1,1,1,1,1,1,1,2,1,2,2,2,2,2,2,2,2,2,2,2,2,,4,,,,,,,,,,,2,,,2,2,,,,1,3,1,2,2,2,2,,,2,,2,,3,3,3,3,3,3,2,1,,2,1,2,2,2,,,,,,,2,,,,1,5,5,2,1,5,5,453,11,Durango,1,UMF      32 EL VERGEL,70,4,0.053887606,10.47580645
12,19,UMF       8 VILLA AYALA,3,9,12,14,10,14,21,62,2,2,5,1,99,1,2,2,2,6,1,1,1,2,,,,,1,99,1,1,1,2,1,2,2,1,2,,,2,1,2,,,1,1,1,1,1,1,1,2,1,2,2,2,1,2,2,2,2,2,2,2,2,,2,,,,2,,,,,,,2,,,2,2,,,,1,2,2,,,,1,2,2,2,,2,,2,2,2,2,2,99,99,1,,2,2,2,1,1,1,1,,,1,1,1,1,,,1,99,99,1,1,5,5,966,19,Morelos,1,UMF       8 VILLA AYALA,169,4,0.168159204,15.703125
7,23,UMF      1 PUEBLA,3,9,12,10,47,11,3,48,2,2,4,1,1,1,2,2,2,6,2,1,2,2,,,,,2,2,1,1,1,1,1,2,1,1,2,,2,2,2,1,3,1,2,2,2,2,2,1,1,2,2,2,2,2,1,2,2,2,2,2,2,2,2,,,,,,2,,,,,,,2,,,2,2,,,,1,2,2,,,,1,3,2,2,,2,,2,2,3,3,3,97,,1,,2,2,2,2,1,1,1,,,1,1,2,,,,4,3,5,1,1,4,4,1145,23,Puebla,1,UMF      1 PUEBLA,957,1,0.176731302,22.19262295
14,35,UMF       3 GUADALUPE,31,8,12,15,44,16,0,69,2,2,9,1,3,1,1,1,2,7,1,1,2,2,,,,,2,2,1,1,1,99,1,2,2,2,1,,,,2,1,1,1,1,2,1,1,2,1,1,1,2,2,2,2,2,2,2,2,2,2,2,1,1,1,,,,,,,,,,,,2,,,1,2,,,,1,1,2,,,,2,,,2,,2,,2,2,2,2,2,1,1,1,,2,1,1,1,1,1,1,,,1,2,1,2,2,1,1,1,1,1,1,1,1,1779,35,Zacatecas,1,UMF       3 GUADALUPE,180,4,0.215053763,6.065217391
28,2,UMF  36 MESA DEL OTAY,3,9,12,19,27,19,50,55,2,2,5,2,99,1,2,2,1,5,6,1,5,2,,,,,2,2,1,1,1,2,1,1,1,1,2,2,2,2,1,1,2,1,1,1,1,1,1,1,1,2,2,2,1,2,1,2,2,2,2,2,2,2,2,,,,2,,2,,,,,,,2,,,2,2,,,,1,2,1,2,2,99,1,2,3,2,,2,,2,2,2,2,2,97,,1,,2,2,97,2,1,1,1,,,1,1,97,,,,1,1,1,1,1,1,1,23,2,Baja California,1,UMF  36 MESA DEL OTAY,532,2,0.088859195,35.63690476
21,11,UMF      32 EL VERGEL,3,9,12,9,58,10,15,53,2,2,5,2,2,1,4,2,2,5,1,1,2,2,,,,,2,1,1,1,1,1,1,2,1,1,2,,2,2,1,1,1,1,1,1,1,1,1,1,1,2,2,2,2,2,1,2,2,1,2,2,2,1,1,,,,,,2,,,2,,,,2,,,99,2,,,,1,2,1,2,2,4,1,2,2,2,,2,,2,2,2,2,2,1,1,99,,2,1,1,1,1,1,1,,,1,1,1,1,,,2,1,4,1,2,5,4,453,11,Durango,1,UMF      32 EL VERGEL,70,4,0.053887606,10.47580645
33,18,UMF 81 URUAPAN,5,9,12,14,17,14,33,59,1,1,5,2,2,1,1,1,2,5,1,1,1,2,,,,,1,1,1,1,1,1,1,1,1,1,1,1,1,1,1,1,1,1,1,1,2,1,2,1,1,2,2,2,2,2,1,2,1,1,2,2,2,1,1,,,,,,1,,1,1,,,,2,,,1,1,2,1,1,1,2,1,2,2,2,1,2,2,2,,2,,1,1,1,1,1,1,1,1,,2,2,2,1,1,1,1,,,2,,2,,,,1,2,2,1,1,3,3,1943,18,Michoac�n,1,UMF 81 URUAPAN,518,3,0.159335589,20.31875
24,21,UMF      28 MONTERREY,4,9,12,13,55,14,17,51,1,2,2,2,4,1,2,2,2,5,1,1,1,2,,,,,3,2,2,1,1,1,1,2,1,1,2,,2,2,2,2,,,2,2,2,2,1,2,1,2,2,2,2,2,1,2,1,1,2,2,2,,2,,,,,,2,,2,2,,,,2,,,2,2,,,,1,2,2,,,,1,4,4,2,,2,,2,2,2,2,2,99,2,1,,2,2,1,4,2,,,,,,,1,1,,,1,1,2,1,1,2,2,1037,21,Nuevo Le�n,1,UMF      28 MONTERREY,1180,1,0.118628732,41.44583333
1,22,UMF      27 OCOTLAN,31,8,12,8,14,8,35,68,1,2,3,2,2,1,2,2,2,5,2,1,1,1,1,,1,,1,1,1,1,1,1,1,2,1,1,2,,2,2,1,1,1,1,1,1,1,1,1,2,1,2,1,2,2,2,1,2,2,2,2,2,2,,2,,2,,,,2,,,,,,,2,,,2,2,,,,1,2,1,2,2,2,1,2,2,2,,2,,2,2,2,2,2,2,2,1,,2,2,2,1,1,1,1,,,1,1,2,,,,2,3,5,1,2,5,5,1125,22,Oaxaca,1,UMF      27 OCOTLAN,43,3,0.091101695,7.866666667
2,22,UMF      27 OCOTLAN,31,8,12,8,45,9,5,42,1,2,3,2,2,1,2,2,2,5,3,1,1,1,1,,1,,1,1,1,1,1,1,1,99,1,1,2,,2,2,1,1,1,1,1,1,1,1,1,2,1,2,1,2,2,2,1,2,2,2,2,2,2,,2,,2,,,,2,,,,,,,2,,,2,2,,,,1,2,1,2,2,2,1,2,2,2,,2,,2,2,2,2,2,1,1,1,,1,2,1,2,1,1,1,,,1,1,2,,,,2,3,5,1,2,5,5,1125,22,Oaxaca,1,UMF      27 OCOTLAN,43,3,0.091101695,7.866666667
102,30,UMF      77 CD. MADERO,30,8,12,18,58,19,19,55,1,2,9,2,4,1,2,2,2,5,1,1,1,2,,,,,1,1,1,1,1,1,1,2,1,2,1,,1,,99,2,,,1,2,2,2,1,1,1,2,2,2,2,2,1,2,99,99,99,99,99,1,1,,,,,,1,,,,,,,2,,,2,1,3,1,2,1,1,2,,,,1,1,1,2,,2,,1,1,1,1,1,1,1,1,,2,1,1,1,1,3,1,,,1,1,1,1,,,4,5,5,2,1,5,5,1486,30,Tamaulipas,1,UMF      77 CD. MADERO,1666,1,0.240369355,18.23947368
19,5,UMF      11  TAPACHULA,5,9,12,11,48,12,10,45,1,1,5,2,3,1,2,2,2,6,2,1,1,2,,,,,2,2,1,2,1,1,1,1,1,1,1,1,1,1,1,1,2,1,1,1,1,1,1,1,2,1,2,2,2,2,1,2,2,2,2,2,2,1,,1,,,,,2,,,,,,,2,,,2,2,,,,1,1,1,2,2,2,1,1,1,2,,2,,2,4,4,3,1,1,1,1,,2,2,2,2,1,2,1,,,1,1,1,1,,,2,2,2,1,2,1,2,112,5,Chiapas,1,UMF      11  TAPACHULA,738,3,1,11.35384615
5,15,UMF       2 LA GARITA,3,9,12,10,40,10,52,49,2,3,7,2,2,1,2,1,2,6,2,1,1,2,,,,,99,99,1,1,1,1,1,2,1,1,2,,2,2,1,1,2,1,1,1,2,1,1,1,1,1,2,2,2,2,1,2,2,2,1,2,2,2,2,2,,,,,2,,,,2,,,2,,,1,1,1,1,2,1,2,1,2,2,4,1,2,2,1,2,2,,2,4,2,2,2,1,1,1,,2,2,1,2,1,1,1,,,1,1,1,1,,,5,4,5,2,5,5,5,692,15,Guerrero,1,UMF       2 LA GARITA,540,3,0.26099565,8.841880342
10,19,UMF       8 VILLA AYALA,3,9,12,13,5,13,20,59,1,2,3,2,2,1,2,2,2,6,1,1,1,2,,,,,1,99,1,1,1,1,1,2,2,2,2,,,,1,1,2,1,1,2,2,1,2,1,1,2,2,2,2,2,1,2,2,2,2,2,2,1,1,,,,,,1,,,,,,,2,,,1,1,4,2,2,1,2,1,2,2,4,1,2,2,99,,99,,2,2,2,2,2,3,1,1,,2,2,3,2,1,1,1,,,1,1,1,1,,,2,1,1,1,1,1,2,966,19,Morelos,1,UMF       8 VILLA AYALA,169,4,0.168159204,15.703125
12,21,UMF      30 PINO,10,9,12,11,43,11,55,54,1,3,5,2,2,1,2,2,2,6,1,1,1,1,1,,1,,1,2,1,1,1,1,1,1,1,1,2,2,2,2,3,1,2,1,2,2,2,1,1,1,1,2,2,2,2,1,2,2,2,2,2,2,2,2,2,,,,,2,,,,,,,,2,,,2,2,,,,1,2,2,,,,1,2,2,2,,2,,2,2,2,2,99,97,,1,,2,2,2,2,1,1,1,,,2,,1,1,,,3,2,4,2,2,4,4,1042,21,Nuevo Le�n,1,UMF      30 PINO,907,2,0.134290791,39.26744186
30,22,UMF     32 PTO. ESCONDIDO,31,8,12,19,30,19,58,37,1,2,2,2,3,1,3,3,2,6,3,1,1,2,,,,,2,2,1,2,2,1,1,1,1,1,2,2,2,2,2,1,2,1,1,1,2,1,1,1,1,2,1,2,2,2,2,1,1,2,2,2,2,2,2,,2,,,,,2,2,,,,,2,,,2,1,1,1,2,1,2,2,,,,1,2,2,2,,2,,2,2,2,2,2,2,1,99,,2,1,2,2,2,,,,,,,1,1,,,1,2,5,2,2,4,5,1118,22,Oaxaca,1,UMF     32 PTO. ESCONDIDO,114,2,0.1,12.66666667
44,23,UMF       6 PUEBLA,3,9,12,19,20,19,36,58,1,2,7,2,2,1,2,2,2,6,1,1,1,2,,,,,2,2,1,1,1,1,1,2,1,1,2,,2,2,1,1,2,1,1,1,1,1,1,1,1,2,1,2,1,1,1,2,2,2,2,2,2,2,2,,2,,2,2,2,,,,,,,2,,,2,1,3,1,2,1,2,2,,,,1,2,2,2,,1,2,3,3,3,3,2,99,99,1,,2,1,2,2,1,1,1,,,1,1,2,,,,2,2,5,2,1,4,4,1144,23,Puebla,1,UMF       6 PUEBLA,1015,1,0.18744229,21.15234375
44,23,UMF      1 PUEBLA,3,9,12,9,10,9,25,38,1,2,2,2,3,1,2,2,2,6,1,1,2,2,,,,,2,1,1,2,3,2,2,2,1,2,,,4,,2,2,,,1,2,2,1,2,1,1,2,2,2,1,2,1,2,2,2,2,2,2,4,4,,,,1,,1,,,,,,,2,,,2,1,1,1,1,1,4,2,,,,1,4,4,1,4,2,,4,4,2,99,4,2,1,1,,2,2,2,2,1,1,1,,,1,1,1,1,,,1,5,5,2,99,5,5,1145,23,Puebla,1,UMF      1 PUEBLA,957,1,0.176731302,22.19262295
14,30,UMF 67 CD.VICTORIA C/REHA,4,9,12,13,28,13,40,42,1,2,2,2,3,1,2,2,2,6,1,1,1,2,,,,,1,1,1,1,1,1,1,2,1,1,2,,2,2,2,1,1,1,1,1,1,1,1,1,1,2,1,2,2,2,2,2,2,2,2,2,2,1,1,,1,,,,,,,,,,,2,,,2,2,,,,1,1,1,1,1,1,1,1,1,2,,2,,1,1,1,1,1,1,1,1,,2,2,1,2,1,1,1,,,1,1,1,1,,,5,1,2,1,2,2,2,2001,30,Tamaulipas,1,UMF 67 CD.VICTORIA C/REHA,483,2,0.123592631,20.35416667
43,23,UMF      1 PUEBLA,3,9,12,8,40,8,55,48,1,2,3,2,2,1,2,2,2,988,1,1,3,2,,,,,2,1,1,2,3,1,1,2,1,1,2,,2,2,3,1,2,1,1,2,2,1,1,2,1,2,2,2,1,2,1,2,2,2,2,2,2,,2,,,,2,,2,,,,,,,2,,,2,1,3,1,2,1,2,1,2,4,4,1,4,4,1,2,2,,2,2,2,2,2,2,2,1,,2,2,1,2,1,1,1,,,1,1,1,1,,,5,2,5,2,2,4,4,1145,23,Puebla,1,UMF      1 PUEBLA,957,1,0.176731302,22.19262295
11,10,UMF     7 CALZ. TLALPAN,29,8,12,14,52,15,13,39,1,5,5,2,2,1,4,4,2,6,1,1,3,2,,,,,2,2,1,4,,1,1,1,1,1,1,1,1,1,1,1,1,1,1,2,2,1,1,1,1,2,2,2,2,2,1,2,2,2,2,2,2,2,1,,,,,,5,,,,,,,2,,,2,1,1,1,1,1,2,1,5,5,5,1,5,5,2,,2,,4,4,2,4,99,2,2,2,2,2,1,1,1,1,1,1,,,1,1,1,1,,,5,5,5,2,5,5,5,388,10,D.F Sur,1,UMF     7 CALZ. TLALPAN,1871,1,0.179661993,28.60989011
44,19,HGZMF   5 ZACATEPEC,31,8,12,10,0,10,30,55,2,2,9,2,4,1,1,2,2,6,1,1,1,2,,,,,1,1,1,1,1,1,1,2,1,1,1,,2,2,1,1,1,1,1,1,1,1,1,1,1,2,2,2,2,2,1,2,2,2,2,2,2,2,2,,,,,,1,,,,,,,2,,,1,1,1,1,1,1,2,2,,,,1,2,2,2,,2,,2,2,2,2,2,1,1,2,2,2,1,1,1,1,1,1,,,1,1,1,1,,,3,5,5,5,2,5,5,960,19,Morelos,1,HGZMF   5 ZACATEPEC,467,3,0.295756808,9.993670886
4,34,HGSMF   3 MOTUL,5,9,12,8,35,8,50,68,2,2,2,3,2,1,1,2,2,5,1,1,3,2,,,,,1,1,1,1,1,1,1,2,1,2,2,,2,,1,1,2,1,1,1,1,1,1,1,1,2,1,2,2,2,1,2,2,2,2,2,2,2,1,,2,,,,2,,,,,,,2,,,2,1,4,1,1,1,2,2,,,,1,2,2,2,,2,,2,2,1,1,1,97,,1,,2,2,1,2,1,1,1,,,1,1,1,1,,,4,2,2,1,1,2,2,1744,34,Yucat�n,1,HGSMF   3 MOTUL,308,3,0.12586841,17.73188406
24,30,UMF 24 MANTE,3,9,12,9,21,9,39,50,2,2,3,3,4,1,1,1,2,6,1,1,1,1,2,2,1,,2,1,1,3,,1,1,1,1,1,2,2,2,2,99,2,,,1,1,1,1,1,1,1,2,2,2,2,2,1,2,2,2,2,2,2,1,1,,,,,,1,,,,,,,2,,,1,2,,,,1,1,2,,,,1,1,1,2,,2,,1,1,1,1,1,1,1,1,,2,99,1,1,1,1,1,,,1,1,1,1,,,1,4,5,1,1,5,5,1492,30,Tamaulipas,1,UMF 24 MANTE,764,1,0.110229404,30.94196429
29,33,UMF      34 JUAN DIAZ,6,9,12,17,20,17,41,67,2,2,2,3,4,1,2,2,2,6,1,1,1,2,,,,,1,1,1,1,1,1,1,1,1,1,2,2,2,2,1,1,2,1,1,2,1,1,1,1,1,99,99,99,99,99,1,99,99,99,99,99,99,2,2,,,,,,2,,,,,,,2,,,1,1,2,1,2,1,2,1,2,2,2,1,2,2,2,,2,,2,2,2,2,2,1,1,1,,2,2,2,2,1,1,1,,,1,1,1,1,,,1,1,1,1,1,1,1,1663,33,Veracruz Sur,1,UMF      34 JUAN DIAZ,126,3,0.072413793,19.33333333
3,2,HGOMF 7 TIJUANA,3,9,12,9,17,9,42,55,2,2,2,4,3,1,5,5,2,5,1,1,4,2,,,,,2,2,2,1,1,1,1,2,1,2,2,,2,,2,2,,,1,2,2,1,1,2,1,1,1,2,2,2,2,2,2,2,2,2,2,,3,3,3,,,,,,,,,,,2,,,1,1,4,2,2,1,1,2,,,,1,1,1,2,,2,,1,3,2,2,2,97,,1,,2,1,2,3,2,,,,,,,2,,,,1,1,5,3,1,5,5,20,2,Baja California,1,HGOMF 7 TIJUANA,842,2,0.140638049,27.21363636
6,2,UMF  36 MESA DEL OTAY,3,9,12,12,7,12,42,33,2,2,4,4,3,1,1,1,2,5,1,1,2,2,,,,,1,1,1,1,1,1,1,1,1,1,1,1,1,1,1,1,1,2,1,1,2,1,1,1,2,2,2,2,2,2,1,2,2,1,2,2,2,2,,,,,,,2,,,2,,,,2,,,2,2,,,,2,,1,1,1,2,1,2,2,2,,2,,2,1,2,1,2,1,1,1,,2,1,1,2,1,1,1,,,2,,2,,,,1,3,3,1,2,5,3,23,2,Baja California,1,UMF  36 MESA DEL OTAY,532,2,0.088859195,35.63690476
11,2,UMF 18 TIJUANA,31,8,12,14,18,14,50,39,1,2,2,4,99,1,2,2,2,5,1,1,5,2,,,,,1,99,1,1,1,1,1,1,1,1,2,2,2,2,1,1,1,1,1,1,1,1,1,1,1,2,1,2,2,2,1,2,1,2,2,2,2,2,2,,2,,,,2,,3,,,,,2,,,2,1,4,2,4,1,2,1,2,2,2,1,2,2,2,,2,,2,2,2,2,2,1,1,1,,2,2,1,2,1,1,1,,,1,1,1,1,,,99,1,99,1,99,99,5,2016,2,Baja California,1,UMF18 TIJUANA,491,2,0.082011024,37.41875
35,5,UMF   13 TUXTLA GUTIERREZ,3,9,12,9,49,10,13,37,2,2,2,4,2,1,3,3,2,5,1,1,1,2,,,,,2,2,1,1,1,1,1,1,1,1,2,1,2,2,1,2,,,1,1,1,1,1,1,1,2,1,2,2,2,1,2,2,2,2,2,2,2,2,,2,,,,1,,,,,,,2,,,2,1,1,1,2,1,2,2,,,,1,2,2,2,,2,,2,2,2,2,2,2,2,1,,2,1,2,2,1,1,1,,,1,1,1,1,,,2,2,3,2,1,2,3,111,5,Chiapas,1,UMF   13 TUXTLA GUTIERREZ,863,2,1,10.7875
14,7,UMF    79 PIEDRAS NEGRAS,6,9,12,15,36,15,55,22,1,1,5,4,2,1,4,4,2,5,1,1,1,2,,,,,2,99,1,2,1,2,1,2,1,1,2,,2,2,1,2,,,1,1,2,2,1,1,1,2,2,2,2,2,2,2,1,1,2,2,2,2,2,,,,,,,,2,2,,,,2,,,2,1,1,1,2,1,2,1,4,5,5,1,3,3,2,,2,,2,3,2,4,4,3,2,1,,2,1,1,2,2,,,,,,,2,,,,1,1,4,2,1,4,4,236,7,Coahuila,1,UMF    79 PIEDRAS NEGRAS,906,2,0.144659109,31.315
48,20,UMF      24 TEPIC,30,8,12,14,51,15,17,80,2,3,4,4,3,1,3,3,2,5,1,1,1,2,,,,,2,2,1,2,2,1,1,2,1,1,2,,2,2,2,1,1,1,1,1,2,1,1,1,1,2,2,2,2,2,2,2,2,2,2,2,2,3,2,,,,,,,,,,,,,2,,,2,2,,,,1,2,1,2,2,2,1,3,3,2,,2,,2,1,1,1,1,2,1,1,,2,2,1,2,2,,,,,,,2,,,,1,1,1,1,1,1,1,999,20,Nayarit,1,UMF      24 TEPIC,943,1,1,7.729508197
32,2,UMF  33 TIJUANA,31,8,12,17,8,17,25,49,2,2,5,4,4,1,2,2,2,6,1,1,1,1,2,1,1,,1,1,1,1,1,1,1,1,1,2,2,2,2,,1,1,1,1,1,1,1,1,1,1,1,2,1,2,1,1,1,1,1,1,1,1,2,2,2,,2,,2,2,2,2,2,2,2,2,,2,,,1,1,3,1,2,1,1,1,1,1,1,1,1,1,1,1,2,,1,1,1,1,1,1,1,1,,2,1,1,1,1,1,1,,,1,1,2,,,,1,3,5,1,3,3,5,22,2,Baja California,1,UMF  33 TIJUANA,755,2,0.126106564,34.01704545
12,2,UMF  19 TIJUANA,4,9,12,14,16,14,41,68,2,2,2,4,1,1,2,2,2,6,1,1,1,2,,,,,1,1,1,1,1,1,1,2,1,1,2,,2,2,2,2,,,1,2,2,1,1,1,1,2,2,2,2,2,1,2,2,2,2,2,2,2,2,,,,,,2,,,,,,,99,,,2,1,3,1,2,1,1,1,1,1,1,1,1,1,2,,2,,2,2,2,2,2,2,1,1,,2,99,2,2,1,1,1,,,1,1,1,1,,,1,1,3,1,5,1,3,27,2,Baja California,1,UMF  19 TIJUANA,388,3,0.143863552,25.68571429
25,2,UMF    37  PALMAR,7,9,12,9,38,9,57,49,2,2,3,4,3,1,2,2,2,6,1,1,1,1,1,,1,,1,99,1,1,1,1,1,1,1,2,2,2,2,,1,2,,,1,1,2,1,1,1,1,2,2,2,2,2,1,2,2,2,2,2,2,1,1,,,,,,2,,,,,,,2,,,2,2,,,,1,2,2,,,,1,1,1,2,,2,,1,1,1,2,1,97,,1,,2,2,2,2,1,1,1,,,1,1,1,1,,,2,2,3,2,2,3,2,33,2,Baja California,1,UMF    37  PALMAR,297,3,0.110122358,26.44117647
18,5,UMF      18  COMITAN,5,9,12,12,45,12,59,75,2,2,1,4,3,1,1,1,2,6,1,1,1,2,,,,,2,2,1,1,1,1,1,2,1,1,1,,1,1,1,1,1,1,1,1,1,1,1,1,1,2,2,2,2,2,2,2,2,2,2,2,2,1,1,,,,,,,,,,,,,2,,,1,2,,,,1,2,1,5,5,5,1,2,2,2,,2,,3,3,3,3,3,1,2,1,,2,1,2,1,2,,,,,,,2,,,,4,5,5,1,1,5,5,115,5,Chiapas,1,UMF      18  COMITAN,195,4,0.15258216,8.875
20,7,UMF      81  CD. ACU�A,6,9,12,19,35,19,53,54,2,2,2,4,2,1,2,2,2,6,1,1,2,1,1,,1,,1,1,1,1,1,1,1,2,2,2,2,,,,2,2,,,1,1,1,1,1,1,1,2,2,2,2,2,1,2,2,2,2,2,2,2,2,,,,,,2,,,,,,,2,,,1,2,,,,1,99,2,,,,2,,,2,,2,,99,99,99,99,99,1,2,1,,2,2,2,2,2,,,,,,,2,,,,3,3,4,1,1,1,3,240,7,Coahuila,1,UMF      81  CD. ACU�A,502,2,0.080153281,32.11794872
19,9,UMF    41  FORTUNA,29,8,12,10,27,10,45,44,1,2,3,4,99,1,4,4,2,6,1,1,3,2,,,,,2,3,2,1,1,1,1,1,1,2,2,2,2,,1,1,2,1,1,1,1,1,1,1,1,2,2,2,2,2,1,2,1,2,1,2,2,2,2,,,,,,2,,2,,5,,,2,,,2,1,4,1,2,1,2,1,4,2,2,1,2,2,2,,2,,3,2,2,99,99,2,2,1,,2,1,2,4,2,,,,,,,1,1,,,3,5,5,2,2,2,5,343,9,D.F Norte,1,UMF    41  FORTUNA,1181,1,0.134143571,25.89411765
8,17,UMF       171 ZAPOPAN,3,9,12,10,47,10,57,39,2,2,5,4,3,1,2,2,2,6,1,1,2,2,,,,,1,1,1,1,1,1,1,2,2,2,1,,,,1,1,2,1,1,1,1,1,1,1,2,2,1,2,2,2,1,2,2,2,2,2,2,1,,,1,,,,1,,,,,,,2,,,1,2,,,,1,1,1,4,4,4,1,1,2,2,,2,,1,1,1,1,1,3,2,1,,2,2,1,2,1,1,1,,,1,1,1,1,,,2,2,5,1,1,4,5,757,17,Jalisco,1,UMF       171 ZAPOPAN,1149,1,0.082513465,49.37943262
45,17,UMF       171 ZAPOPAN,3,9,12,19,23,19,40,55,2,2,3,4,3,1,1,1,2,6,1,1,1,1,1,,1,,1,1,1,1,1,1,1,1,1,1,1,2,2,2,1,2,,,1,2,2,1,1,1,1,2,2,2,2,2,1,2,2,2,2,2,2,2,1,,,,,,1,,,,,,,2,,,1,2,,,,1,1,1,2,2,2,1,1,4,2,,2,,2,2,2,2,2,1,1,1,,2,2,1,1,1,2,1,,,1,1,1,1,,,4,2,4,2,2,4,4,757,17,Jalisco,1,UMF       171 ZAPOPAN,1149,1,0.082513465,49.37943262
33,30,HGZMF   1 CD. VICTORIA,4,9,12,19,7,19,21,47,2,2,6,4,3,1,1,1,2,6,1,1,1,2,,,,,1,1,1,1,1,1,1,1,1,1,1,1,1,1,1,1,1,1,1,1,1,1,1,1,1,2,2,2,2,2,1,2,2,2,2,2,2,1,1,,,,,,1,,,,,,,2,,,2,1,3,1,1,1,1,1,99,99,99,1,1,1,2,,2,,1,1,1,1,1,1,1,1,,2,2,1,1,1,1,1,,,1,1,1,2,2,1,1,2,2,1,1,2,2,1491,30,Tamaulipas,1,HGZMF   1 CD. VICTORIA,615,2,0.157369498,19.93877551
90,31,UMF       7 SANTA INES,7,9,12,11,8,11,24,51,1,1,5,4,1,1,2,2,2,6,1,1,1,2,,,,,2,2,1,2,1,1,1,1,1,1,1,1,1,1,1,1,2,1,1,1,2,1,1,1,1,2,1,2,2,2,1,2,2,2,2,2,2,2,2,,2,,,,3,,,,,,,2,,,99,2,,,,1,3,2,,,,1,2,3,2,,2,,3,3,3,2,99,99,99,1,,2,2,2,2,1,1,1,,,1,1,1,1,,,3,3,3,3,1,4,4,1555,31,Tlaxcala,1,UMF       7 SANTA INES,246,1,0.119708029,4.628378378
2,2,HGOMF 7 TIJUANA,3,9,12,8,45,9,13,30,2,2,8,4,4,1,5,5,2,7,3,1,4,2,,,,,3,3,2,4,,2,2,2,2,2,,,,,4,2,,,2,2,2,2,2,2,1,2,2,1,2,2,2,2,2,2,2,2,2,,4,,,2,,,,,,,,,,2,,,2,2,,,,2,,1,4,2,4,1,2,4,2,,2,,4,5,2,4,4,3,2,2,2,2,1,3,5,2,,,,,,,2,,,,3,3,3,5,3,3,3,20,2,Baja California,1,HGOMF 7 TIJUANA,842,2,0.140638049,27.21363636
25,7,UMF      73  SALTILLO,4,9,12,8,59,9,8,40,1,1,1,5,1,1,2,2,2,5,1,1,1,1,1,,1,,2,1,1,1,1,1,1,2,2,2,2,,,,1,1,1,1,1,1,1,1,1,1,1,2,2,2,2,2,2,2,2,2,2,2,2,1,2,,,,,,,,,,,,,2,,,2,2,,,,1,2,2,,,,1,5,5,2,,2,,5,2,2,2,2,2,2,1,,2,1,1,2,2,,,,,,,2,,,,2,2,2,2,1,2,3,235,7,Coahuila,1,UMF      73  SALTILLO,932,2,0.148810474,21.59655172
149,16,HGZMF   1 PACHUCA,30,8,12,12,29,12,42,66,1,4,2,5,1,1,2,2,2,5,1,1,5,2,,,,,1,1,1,2,1,1,1,2,2,2,2,,,,1,1,2,1,1,1,1,1,1,1,1,2,2,2,2,2,2,2,2,2,2,2,2,2,2,,,,,,,,,,,,,2,,,1,2,,,,1,1,1,2,2,2,1,2,2,2,,2,,2,2,2,2,2,1,1,1,,2,1,1,2,1,1,1,,,2,,1,1,,,3,3,3,2,2,2,2,719,16,Hidalgo,1,HGZMF   1 PACHUCA,1165,1,1,7.28125
32,23,UMF       2 PUEBLA,31,8,12,11,30,11,49,82,2,2,2,5,1,1,2,2,2,5,1,1,1,2,,,,,2,2,1,1,1,1,1,2,2,2,2,,,,2,2,,,1,2,2,1,1,2,1,2,1,2,2,2,2,1,2,2,2,2,2,,2,,2,,,,,1,,,,,,2,,,2,2,,,,1,2,2,,,,2,,,2,,2,,2,2,2,3,3,1,2,1,,2,1,1,2,2,,,,,,,1,1,,,3,2,2,3,4,4,5,1142,23,Puebla,1,UMF       2 PUEBLA,1095,1,0.202216066,18.80208333
26,2,UMF  33 TIJUANA,31,8,12,11,18,11,40,83,1,4,3,5,1,1,1,1,2,6,1,1,1,2,,,,,2,99,1,3,,1,2,2,1,2,,,2,,4,2,,,1,2,2,1,1,2,1,2,1,1,1,1,2,1,1,1,1,1,1,,1,,1,1,1,1,,1,1,1,1,1,1,2,,,1,2,,,,1,2,2,,,,1,1,1,2,,2,,1,1,1,2,2,97,,1,,2,99,1,1,2,,,,,,,1,1,,,3,1,3,1,1,3,3,22,2,Baja California,1,UMF  33 TIJUANA,755,2,0.126106564,34.01704545
37,3,UMF 34 LA PAZ C/UMAA,31,8,12,12,6,12,20,69,1,4,1,5,4,1,1,1,2,6,1,1,3,2,,,,,1,99,1,1,1,1,1,1,1,1,2,2,2,2,1,1,2,1,1,1,1,1,1,1,1,2,2,2,2,2,1,2,2,2,2,2,2,1,1,,,,,,2,,,,,,,2,,,2,2,,,,1,2,2,,,,1,2,2,2,,2,,2,2,2,2,2,99,99,1,,2,2,1,1,1,1,1,,,1,1,1,1,,,99,99,99,99,99,99,99,73,3,Baja California Sur,1,UMF 34 LA PAZ C/UMAA,360,2,0.20385051,8.531400966
37,7,UMF 89 SALTILLO C/UMAA,4,9,12,17,30,17,49,62,1,2,3,5,2,1,1,1,2,6,1,1,1,2,,,,,2,2,1,2,1,1,1,1,1,1,1,1,1,1,1,1,1,1,1,2,2,1,1,2,1,2,2,2,2,2,1,2,2,2,2,2,2,,1,,,,,,2,,,,,,,2,,,2,2,,,,1,1,2,,,,1,2,2,2,,2,,2,2,2,2,2,1,2,1,,2,2,2,2,1,2,1,,,2,,2,,,,1,3,5,1,2,5,5,1956,7,Coahuila,1,UMF 89 SALTILLO C/UMAA,468,3,0.098796707,62.32894737
82,16,HGZMF   5 TULA DE HIDALGO,3,9,12,17,20,17,45,67,1,2,2,5,1,1,1,1,2,6,1,1,1,2,,,,,1,1,1,1,1,1,1,1,1,1,2,2,2,2,1,1,1,1,1,1,1,1,1,1,1,2,2,2,1,2,1,2,2,2,2,2,2,2,2,,,,2,,2,,,,,,,2,,,2,2,,,,1,2,2,,,,1,2,2,1,2,2,,2,2,2,2,2,1,1,1,,2,2,1,1,99,,,,,,,1,1,,,2,2,2,2,2,2,2,720,16,Hidalgo,1,HGZMF   5 TULA DE HIDALGO,431,2,0.167834891,7.925925926
11,23,UMF      1 PUEBLA,3,9,12,12,15,12,39,49,1,2,2,5,3,1,2,2,2,6,4,1,1,2,,,,,2,3,1,1,1,1,1,1,1,1,2,2,2,2,2,1,2,1,1,2,1,1,1,1,1,2,2,2,2,2,1,2,2,2,2,2,2,2,2,,,,,,2,,,,,,,2,,,2,1,3,1,2,1,2,2,,,,1,3,2,2,,2,,3,3,3,3,3,97,,1,,2,1,2,2,1,1,1,,,1,1,2,,,,1,3,5,1,1,5,5,1145,23,Puebla,1,UMF      1 PUEBLA,957,1,0.176731302,22.19262295
20,33,UMF      34 JUAN DIAZ,6,9,12,10,15,10,33,57,1,2,2,5,2,1,2,2,1,6,1,1,1,1,1,,1,,99,1,1,1,1,1,1,1,1,1,2,2,2,2,1,1,2,1,1,1,1,1,1,1,1,99,99,99,99,1,1,99,99,99,99,99,99,2,2,,,,,2,2,,,,,,,2,,,1,1,3,1,2,1,2,2,,,,1,2,2,1,2,2,,2,2,2,2,2,99,99,1,,2,2,99,2,1,1,1,,,1,1,1,1,,,2,3,5,1,1,4,4,1663,33,Veracruz Sur,1,UMF      34 JUAN DIAZ,126,3,0.072413793,19.33333333
23,35,UMF       3 GUADALUPE,31,8,12,19,50,20,6,72,2,2,2,5,1,1,1,1,2,6,1,1,1,2,,,,,1,1,1,1,1,1,1,2,2,2,1,,,,1,2,,,1,1,1,1,1,1,1,1,2,2,2,2,2,2,2,2,2,2,2,1,1,1,,,,,,,,,,,,2,,,2,2,,,,1,1,1,1,1,1,2,,,2,,2,,1,1,1,1,1,1,1,1,,2,1,1,1,1,1,1,,,1,1,1,1,,,1,1,1,1,1,1,1,1779,35,Zacatecas,1,UMF       3 GUADALUPE,180,4,0.215053763,6.065217391
23,9,UMF       2 STA.MARIA,4,9,12,10,58,11,17,71,1,3,1,5,99,1,4,4,2,6,1,1,1,1,1,,1,,2,3,1,1,1,1,2,2,2,2,,,,,3,1,3,1,1,1,2,1,1,1,1,2,2,2,1,2,1,2,2,2,2,2,2,3,3,,,,2,,2,,,,,,,99,,,2,1,3,1,3,1,3,2,,,,2,,,2,,2,,3,3,3,3,3,2,2,2,3,2,1,2,3,1,1,1,,,1,1,2,,,,5,5,5,3,3,5,5,341,9,D.F Norte,1,UMF       2 STA.MARIA,1143,1,0.129827351,28.96052632
8,30,UMF 67 CD.VICTORIA C/REHA,4,9,12,10,44,11,5,50,1,2,3,7,3,1,2,2,2,6,99,1,2,1,1,,1,,1,1,1,1,1,1,1,1,1,1,2,2,2,2,1,1,1,1,1,1,1,1,1,1,1,2,2,2,2,2,1,2,2,2,2,2,2,1,1,,,,,,1,,,,,,,2,,,2,1,1,1,1,1,2,1,2,2,2,1,2,2,2,,2,,1,1,1,1,1,1,1,1,,2,2,1,1,1,2,1,,,1,1,1,1,,,5,5,1,1,1,2,4,2001,30,Tamaulipas,1,UMF 67 CD.VICTORIA C/REHA,483,2,0.123592631,20.35416667
30,33,UMF      34 JUAN DIAZ,6,9,12,17,45,18,0,52,1,2,9,7,3,1,2,2,2,6,1,1,1,2,,,,,2,2,1,1,1,1,1,2,1,1,2,,2,2,1,1,2,1,1,1,2,1,1,1,1,99,99,99,2,2,1,99,99,99,99,99,99,2,2,,,,,,2,,,,,,,2,,,1,2,,,,1,2,2,,,,1,2,2,2,,2,,2,2,2,3,2,99,99,1,,2,2,2,2,1,1,1,,,1,1,1,1,,,1,1,99,1,1,4,5,1663,33,Veracruz Sur,1,UMF      34 JUAN DIAZ,126,3,0.072413793,19.33333333
36,13,UMF       222 TOLUCA,3,9,12,18,7,18,26,65,2,5,6,9,4,1,1,1,2,5,1,1,4,1,2,3,1,,2,1,1,1,1,1,1,1,1,2,1,1,1,,1,1,1,1,1,2,2,1,1,1,1,2,2,2,1,2,1,2,2,2,2,2,2,2,1,,,,1,,1,,,,,,,2,,,2,2,,,,1,2,1,2,4,4,1,2,2,1,2,2,,2,2,99,2,2,1,1,1,,2,2,1,1,1,1,1,,,1,1,1,1,,,5,5,5,1,5,5,5,572,13,M�xico Poniente,1,UMF       222 TOLUCA,1104,1,0.200108755,20.5858209
32,19,HGRMF   1 CUERNAVACA,30,8,12,14,10,14,30,69,2,2,3,9,3,1,2,2,2,5,1,1,4,2,,,,,1,1,1,1,1,1,1,2,1,2,1,,2,,1,2,,,1,1,1,2,2,1,1,2,2,2,2,2,1,2,2,2,2,2,2,1,1,,,,,,1,,,,,,,2,,,2,1,4,1,2,1,2,2,,,,1,1,1,2,,2,,1,1,1,1,1,1,1,1,,2,2,1,1,1,1,1,,,1,1,1,1,,,1,1,2,1,1,5,5,957,19,Morelos,1,HGRMF   1 CUERNAVACA,1064,1,1,7.766423358
10,19,HGZMF   7 CUAUTLA,3,9,12,13,28,14,0,69,2,2,1,9,3,1,2,2,2,5,1,1,2,2,,,,,1,1,1,1,1,1,1,2,2,2,1,,,,1,2,,,1,1,1,1,1,1,1,2,2,2,2,1,1,2,2,2,2,2,2,1,1,,,,,1,1,,,,,,,2,,,2,1,3,1,2,1,1,1,1,1,1,1,2,2,2,,2,,2,2,2,2,2,2,2,1,,2,2,2,2,1,1,1,,,1,1,1,1,,,1,3,5,1,1,5,5,959,19,Morelos,1,HGZMF   7 CUAUTLA,458,3,0.290056998,10.38815789
5,35,UMF       3 GUADALUPE,31,8,12,9,48,10,14,42,2,2,7,9,2,1,2,2,2,5,99,1,1,2,,,,,2,1,1,99,,99,1,1,2,2,1,1,,,1,1,2,1,1,1,1,2,1,1,1,1,1,2,2,2,2,2,2,2,2,2,2,2,1,2,1,,,,,,,,,,,2,,,1,2,,,,1,1,1,1,1,1,2,,,2,,2,,1,1,2,2,2,99,99,1,,2,1,1,1,99,,,,,,,99,,,,1,1,1,1,2,5,5,1779,35,Zacatecas,1,UMF       3 GUADALUPE,180,4,0.215053763,6.065217391
4,5,UMF      18  COMITAN,5,9,12,10,42,11,1,68,2,2,3,9,2,1,3,3,2,6,1,1,4,2,,,,,2,2,2,2,2,1,1,2,1,1,3,,2,3,2,2,,,2,2,2,2,2,1,1,2,2,2,2,2,1,2,2,2,2,2,2,3,3,,,,,,3,,,,,,,2,,,2,2,,,,1,2,2,,,,1,2,2,2,,2,,2,2,2,2,2,2,2,1,,2,2,2,3,1,1,1,,,1,1,1,1,,,5,5,5,5,5,5,5,115,5,Chiapas,1,UMF      18  COMITAN,195,4,0.15258216,8.875
9,7,UMF 89 SALTILLO C/UMAA,4,9,12,12,13,12,42,39,2,2,5,9,3,1,3,3,2,6,1,1,3,2,,,,,2,2,1,1,2,1,1,1,1,1,2,2,2,2,2,2,,,1,1,1,1,1,1,1,2,1,2,2,2,2,2,2,2,2,2,2,2,3,,2,,,,,,,,,,,2,,,2,2,,,,1,3,1,3,3,3,2,,,2,,2,,3,2,2,2,2,97,,1,,2,1,2,3,2,,,,,,,2,,,,1,2,3,3,4,4,4,1956,7,Coahuila,1,UMF 89 SALTILLO C/UMAA,468,3,0.098796707,62.32894737
41,16,HGZMF   1 PACHUCA,30,8,12,8,38,9,15,77,2,2,3,9,3,1,1,5,2,6,1,1,99,2,,,,,2,1,1,1,1,1,1,2,1,2,2,,1,,1,1,2,1,2,2,2,1,1,2,1,2,2,2,2,2,1,2,2,2,2,2,2,,1,,,,,,2,,,,,,,2,,,2,1,2,1,2,1,2,1,2,2,2,1,2,2,2,,2,,2,2,2,2,2,1,99,1,,2,1,3,1,99,,,,,,,1,1,,,1,5,2,1,1,5,2,719,16,Hidalgo,1,HGZMF   1 PACHUCA,1165,1,1,7.28125
32,17,UMF      53 ZAPOPAN,31,8,12,14,28,14,59,64,2,2,7,9,3,1,1,1,2,6,1,1,1,1,1,,1,,1,1,1,1,1,1,1,2,1,2,2,,2,,1,1,2,1,1,2,2,1,2,1,1,1,1,1,2,1,2,2,2,2,1,2,2,1,1,1,1,1,,1,,,,,1,,,2,,,2,1,2,1,2,1,1,2,,,,1,1,1,1,1,1,1,2,1,1,1,1,1,1,1,,2,2,1,1,1,1,1,,,1,1,1,2,5,2,4,4,4,1,1,4,4,751,17,Jalisco,1,UMF      53 ZAPOPAN,1379,1,0.099030521,62.72522523
27,18,UMF    78 LAZARO CARDENAS,4,9,12,15,54,16,14,59,2,2,2,9,1,1,2,2,2,6,1,1,2,2,,,,,2,2,1,1,1,1,1,1,1,1,2,2,2,2,2,1,2,1,1,2,2,1,1,1,1,2,2,2,2,2,1,2,2,2,2,2,2,2,2,,,,,,2,,,,,,,2,,,2,2,,,,1,2,2,,,,1,2,2,2,,2,,2,2,2,4,2,2,99,1,,2,2,2,2,1,1,1,,,1,1,1,1,,,99,2,5,2,1,5,5,904,18,Michoac�n,1,UMF    78 LAZARO CARDENAS,287,4,0.144511581,26.48
20,27,UMF      36 CULIACAN,30,8,12,18,50,19,5,82,2,2,3,9,2,1,1,1,2,6,1,1,2,2,,,,,1,1,1,1,1,1,1,1,1,1,2,2,2,2,1,1,1,1,1,1,1,1,1,1,1,2,1,2,2,2,1,2,2,2,1,2,2,2,2,,2,,,,2,,,,2,,,2,,,2,1,3,1,1,1,1,1,2,2,2,1,2,1,2,,2,,1,1,1,1,1,1,1,1,,2,2,1,1,1,2,1,,,1,1,1,1,,,2,2,3,2,2,2,2,1304,27,Sinaloa,1,UMF      36 CULIACAN,1100,1,0.155939892,27.5546875
40,32,UMF      57 VERACRUZ,30,8,12,16,51,17,18,74,2,2,7,9,4,1,2,2,2,6,1,1,1,2,,,,,1,1,1,1,1,1,1,1,1,1,1,1,1,1,1,1,1,1,1,1,2,1,1,1,1,2,2,2,1,2,1,2,2,2,2,2,2,1,1,,,,2,,2,,,,,,,2,,,99,1,3,1,1,1,2,2,,,,1,2,2,1,2,2,,2,4,2,2,2,1,1,1,,2,1,1,2,2,,,,,,,2,,,,2,4,5,1,1,5,5,1576,32,Veracruz Norte,1,UMF      57 VERACRUZ,1263,1,0.271204638,16.17013889