folio,deleg,unidmed,id_unid,fecha_d,fecha_m,fecha_a,hr_ini_h,hr_ini_m,hr_fin_h,hr_fin_m,edad,sexo,edocivi,escolar,ocupa,tel�fono,sat1,retro,prospe,cons_mf,mot_cons1,frecmf,probsal,tmedico,citapre,hrcita,tdifcons,citatel,nocitatel,btratou,preosad,tmsalud,mhclinco,expclaa_a,expclaa_b,expclaa_c,expclaa_d,expclab_a,expclab_b,expclab_c,expclab_d,mopin,explora,cexplora,mexapriv,prevasis_a,prevasis_b,prevasis_c,prevmed_a,prevmed_b,dpconf,calfatna_a,calfatna_b,calfatna_c,calfatna_d,calfatna_e,calfatna_f,calfatna_g,calfatna_h,calfatna_i,calfatna_j,calfatna_k,calfatna_l,calfatna_m,calfatna_n,calfatnb_a,calfatnb_b,calfatnb_c,calfatnb_d,calfatnb_e,calfatnb_f,calfatnb_g,calfatnb_h,calfatnb_i,calfatnb_j,calfatnb_k,calfatnb_l,calfatnb_m,calfatnb_n,infimss,finfimss,continf,cartel,filtroaux,temsad,saduni,privalrx,faltamat,satlarx,calfinma_a,calfinma_b,calfinma_c,calfinma_d,calfinma_e,calfinmb_a1,calfinmb_b1,calfinmb_b2,calfinmb_b3,calfinmb_c1,calfinmb_c2,calfinmb_d1,calfinmb_e1,calfinmb_f,calfinmb_g,calfinmb_h,calfinmb_i,calfinmb_j,ordylim1,ordylim2,ordylim3,recomuni,norecom,corrup,atn1fam,caqod,sat2,filtrofarm,tfarsurt,totmed,acnomed,versurt,versurt2,traimss,farm1,farm2,farm3,farm4,confi1_a,confi1_b,confi1_c,confi1_d,confi1_e,confi1_f,confi1_g,nivel_nr,edad_enc,sexo_enc,esc_enc,hora_nr,min_nr,no_entrev,no_entrev_t,entre_incom,mot_int,mot_int_t,num_pint,sexo_nr,edadd_nr,edadc_nr,FE_FinalNR
719,1,UMF ���8 ��AGUASCALIENTES,1,20,6,11,19,1,19,17,59,1,2,5,5,2,2,1,2,2,4,2,2,1,2,,,,,1,1,1,1,1,1,1,1,2,2,2,2,1,1,2,1,1,1,2,1,1,1,1,1,2,2,2,2,2,1,2,2,2,2,2,2,2,2,,,,,,2,,,,,,,1,5,3,2,1,3,1,2,2,2,1,2,1,2,2,2,,,,2,3,,,2,2,2,2,2,99,99,99,1,,2,2,1,2,1,2,1,,1,1,5,2,,,,3,3,5,3,3,5,5,,,,,,,,,,,,,0,,0,8.28345248
720,1,UMF ���8 ��AGUASCALIENTES,1,20,6,11,13,20,13,40,70,1,2,3,5,1,1,2,1,2,3,2,2,1,1,1,,2,2,1,1,1,2,2,2,1,2,,,2,,2,1,3,1,1,2,2,1,1,1,1,1,2,2,2,2,2,1,2,2,2,2,2,2,2,1,,,,,,2,,,,,,,1,8,998,2,1,4,1,2,2,2,1,2,1,2,2,2,,,,2,3,,,2,3,2,3,3,2,99,99,1,,2,2,2,2,1,1,1,,1,1,1,1,1,,,2,2,5,2,2,3,3,,,,,,,,,,,,,0,,0,8.073024601
721,1,UMF ���8 ��AGUASCALIENTES,1,20,6,11,9,40,10,5,67,2,2,2,4,2,1,1,1,2,1,2,7,1,2,,,,,1,1,1,3,1,2,1,2,2,,2,,2,1,2,1,1,1,1,1,1,2,1,1,2,2,1,1,2,2,2,2,2,2,2,2,2,2,,,2,2,,,,,,,,,2,,,2,2,,,,,,1,1,1,1,2,1,1,1,1,1,1,1,,2,2,2,1,2,1,1,1,1,,2,2,1,1,1,1,1,,1,1,5,1,1,,,1,1,3,2,1,1,2,,,,,,,,,,,,,0,,0,9.567691645
722,1,UMF ���8 ��AGUASCALIENTES,1,20,6,11,10,19,10,30,93,1,4,5,5,1,4,3,3,2,1,2,2,2,1,2,2,1,,2,2,3,2,1,2,1,2,2,,2,,2,1,2,1,1,1,1,1,1,2,1,1,2,2,2,2,2,1,2,2,2,2,2,2,4,2,,,,,,1,,,,,,,2,,,2,1,1,1,2,2,2,1,1,1,2,2,2,1,2,2,2,2,,,2,2,2,2,99,2,2,2,1,,2,2,3,2,1,1,1,,1,1,5,1,1,,,2,2,2,2,2,4,4,,,,,,,,,,,,,0,,0,8.073024601
723,1,UMF ���8 ��AGUASCALIENTES,1,20,6,11,15,15,15,40,39,1,1,3,5,2,2,2,2,2,3,3,2,1,2,,,,,1,1,1,2,2,2,2,2,,,,,2,1,2,1,1,2,2,2,2,1,1,1,2,2,2,2,2,1,2,2,2,2,2,2,2,2,,,,,,2,,,,,,,2,,,2,2,,,,,,1,2,2,2,2,2,,,,,,,,2,2,2,2,2,2,1,2,1,,2,2,2,2,1,1,1,,1,1,5,1,1,,,1,3,5,2,1,5,5,,,,,,,,,,,,,0,,0,9.350955178
724,1,UMF ���8 ��AGUASCALIENTES,1,20,6,11,13,1,13,15,73,1,1,2,5,1,1,1,99,2,3,2,1,1,1,1,,2,3,1,2,1,2,1,2,1,1,1,,2,1,1,1,2,1,2,2,2,2,1,2,2,1,2,1,2,2,2,1,2,2,2,2,2,2,,1,,1,,,,2,,,,,,,2,,,2,2,,,,,,1,2,1,2,2,2,,,,2,2,,,2,3,2,2,99,97,,,1,,2,2,3,2,1,1,1,,1,1,5,1,1,,,2,1,2,3,5,2,2,,,,,,,,,,,,,0,,0,8.073024601
725,1,UMF ���8 ��AGUASCALIENTES,1,20,6,11,8,50,9,1,28,2,2,5,4,2,2,1,2,1,1,1,2,1,2,,,,,1,1,1,1,2,2,1,2,,,2,,2,2,,,1,1,1,2,1,2,1,1,2,2,2,2,2,1,2,2,2,2,2,2,2,2,,,,,,2,,,,,,,2,,,2,2,,,,,,1,2,1,2,2,2,,,,2,2,,,2,2,2,2,99,,,,1,,2,2,3,2,1,1,1,,1,1,5,2,,,,2,2,2,2,2,4,4,,,,,,,,,,,,,0,,0,10.55476596
726,1,UMF ���8 ��AGUASCALIENTES,1,20,6,11,12,31,12,40,47,2,3,3,1,2,2,1,2,2,1,5,13,1,1,1,,2,7,1,2,1,3,1,1,1,1,2,2,2,2,1,2,,,1,1,2,1,1,1,1,1,2,2,2,1,2,1,2,2,2,2,2,2,1,1,,,,1,,1,,,,,,,1,7,1,2,1,4,1,2,2,4,1,1,1,2,2,2,3,2,5,1,2,,,2,2,2,3,2,1,1,1,1,,2,2,1,2,1,1,1,,1,1,1,1,1,,,2,2,5,2,5,5,5,,,,,,,,,,,,,0,,0,10.35330937
727,1,UMF ���8 ��AGUASCALIENTES,1,20,6,11,14,4,14,25,22,1,2,6,5,2,2,2,1,2,998,4,9,99,1,2,3,1,,1,2,3,1,1,1,1,2,1,2,2,,1,1,1,1,1,1,2,2,1,2,1,1,2,1,2,2,2,1,2,2,2,2,2,2,2,2,,2,,,,1,,,,,,,1,5,9,2,1,4,1,2,2,2,1,2,1,2,2,2,,,,2,2,,,2,4,3,2,3,99,1,2,1,,2,2,1,2,1,1,1,,1,1,5,1,1,,,2,2,4,2,99,2,4,,,,,,,,,,,,,0,,0,8.45485298
728,1,UMF ���8 ��AGUASCALIENTES,1,20,6,11,9,6,9,25,54,1,2,4,5,2,1,1,99,2,3,2,1,1,1,1,,2,6,1,2,1,2,1,1,1,1,2,1,2,2,2,1,1,1,1,1,2,1,1,2,2,1,2,1,2,2,2,1,2,2,2,2,2,2,,2,,1,,,,1,,,,,,,2,,,1,2,,,,,,1,2,1,1,2,2,,,,2,2,3,,3,3,99,99,99,97,,,1,,2,2,97,2,1,1,1,,1,1,5,2,,,,2,2,4,2,1,4,4,,,,,,,,,,,,,0,,0,8.735912944
729,1,UMF ���8 ��AGUASCALIENTES,1,20,6,11,15,14,15,27,56,1,2,2,10,1,3,2,3,2,4,2,2,2,1,2,3,2,6,1,1,1,1,2,2,1,2,,,2,,4,2,,,2,2,2,1,1,1,2,1,1,1,2,2,2,1,2,2,2,2,2,2,,2,3,4,,,,2,,,,,,,2,,,99,2,,,,,,1,2,1,2,2,2,,,,1,1,,,2,4,2,2,99,2,2,2,2,1,2,2,3,3,1,3,1,,1,1,1,2,,,,99,3,5,3,3,5,5,,,,,,,,,,,,,0,,0,8.28345248
730,1,UMF ���8 ��AGUASCALIENTES,1,20,6,11,14,14,14,28,38,1,2,6,5,2,2,2,2,2,3,4,6,1,1,1,,2,6,1,1,1,1,1,1,1,1,2,2,2,2,1,1,2,1,1,1,2,2,2,1,2,1,2,2,2,1,2,1,2,2,2,2,2,2,,2,,,,2,,2,,,,,,,2,,,1,2,,,,,,1,2,1,1,2,2,,,,2,2,2,,2,3,2,2,5,3,2,99,1,,2,2,1,2,1,1,1,,1,1,5,1,1,,,4,2,5,2,2,5,5,,,,,,,,,,,,,0,,0,9.350955178
731,1,UMF ���8 ��AGUASCALIENTES,1,20,6,11,13,11,13,22,61,1,2,3,5,1,2,2,2,2,4,2,1,1,1,99,,1,,1,1,1,1,2,2,2,2,,,,,1,1,2,1,1,1,2,2,1,1,1,1,2,2,2,2,2,1,2,2,2,2,2,2,2,1,,,,,,2,,,,,,,1,7,8,2,2,,,,,,1,2,1,2,2,2,,,,2,2,,,2,2,2,2,4,2,1,1,1,,2,1,1,2,1,1,1,,1,1,1,1,1,,,99,2,5,2,2,2,99,,,,,,,,,,,,,0,,0,8.28345248
732,1,UMF ���8 ��AGUASCALIENTES,1,20,6,11,12,33,12,46,58,1,2,9,7,1,3,2,3,2,3,3,1,1,1,1,,1,,1,1,1,1,2,2,1,2,,,2,,4,1,4,1,1,2,2,2,2,1,1,1,2,2,2,2,2,1,2,2,2,2,2,2,2,2,,,,,,2,,,,,,,1,2,8,2,2,,,,,,1,2,1,2,2,3,,,,3,4,,,2,2,2,3,3,2,2,2,1,,2,2,1,3,1,1,1,,1,1,5,1,1,,,5,5,5,3,1,5,5,,,,,,,,,,,,,0,,0,8.28345248
733,1,UMF ���8 ��AGUASCALIENTES,1,20,6,11,12,9,12,22,73,2,2,3,9,1,1,3,2,2,4,2,2,1,1,1,,1,,1,1,1,3,1,1,1,2,2,2,2,,1,1,2,1,2,2,1,1,1,2,1,1,2,2,2,2,2,1,2,2,2,2,2,2,2,2,,,,,,2,,,,,,,1,2,998,2,2,,,,,,1,1,1,2,2,3,2,2,2,2,2,,,3,4,2,2,2,1,1,99,2,4,2,99,1,2,1,1,1,,1,1,5,2,,,,1,1,3,1,99,5,3,,,,,,,,,,,,,0,,0,9.567691645
734,1,UMF ���8 ��AGUASCALIENTES,1,20,6,11,10,2,10,14,53,1,2,3,3,2,3,1,99,2,4,2,2,1,1,1,,1,,1,1,1,1,1,2,1,1,4,,2,2,2,2,,,1,2,2,1,1,3,1,1,2,2,2,2,2,1,2,2,2,2,2,2,2,2,,,,,,2,,,,,,,2,,,2,2,,,,,,1,2,2,1,2,2,,,,,,2,,2,99,4,2,99,2,2,2,1,,2,2,2,2,1,1,1,,1,1,5,2,,,,2,2,2,3,3,2,3,,,,,,,,,,,,,0,,0,8.735912944
735,1,UMF ���8 ��AGUASCALIENTES,1,20,6,11,9,7,9,23,52,1,2,1,5,1,2,1,99,2,4,2,2,1,2,,,,,1,1,1,1,1,2,1,1,1,,2,2,1,1,2,1,1,1,2,1,1,1,1,1,2,2,2,2,2,1,2,2,2,2,2,2,2,2,,,,,,2,,,,,,,1,8,999,1,2,,,,,,1,2,1,2,2,2,,,,2,2,,,2,2,2,2,99,2,1,2,1,,2,99,1,2,1,1,1,,1,1,5,2,,,,1,1,5,1,1,4,5,,,,,,,,,,,,,0,,0,8.735912944
736,1,UMF ���8 ��AGUASCALIENTES,1,20,6,11,18,1,18,16,37,2,2,6,2,1,3,2,2,2,3,2,8,3,2,,,,,1,2,3,2,1,2,2,2,4,,,,3,1,3,1,1,1,2,2,2,3,1,1,1,2,2,2,2,2,2,2,2,2,2,2,3,4,3,,,,,,,,,,,,2,,,2,2,,,,,,1,2,1,2,2,2,,,,3,2,,,2,2,2,2,2,2,1,2,1,,2,2,3,3,1,1,1,,1,1,5,2,,,,2,2,5,2,1,2,5,,,,,,,,,,,,,0,,0,11.08222261
737,1,UMF ���8 ��AGUASCALIENTES,1,20,6,11,19,2,19,20,65,1,1,3,5,1,1,2,1,2,3,2,11,1,1,1,,1,,1,2,1,1,1,2,1,1,1,,2,1,1,1,2,99,1,2,1,1,1,1,1,1,2,2,2,2,2,1,2,2,2,2,2,2,1,1,,,,,,1,,,,,,,1,4,998,2,2,,,,,,1,2,1,2,2,1,,,,4,4,,,4,2,3,2,5,3,2,1,1,,2,2,1,1,1,1,1,,1,1,5,1,1,,,1,1,3,1,1,2,3,,,,,,,,,,,,,0,,0,8.073024601
738,1,UMF ���8 ��AGUASCALIENTES,1,20,6,11,9,5,9,27,34,1,2,2,5,2,3,1,2,2,3,2,15,1,1,1,,2,6,1,1,2,2,2,2,2,2,,,,,4,2,,,1,1,2,2,2,4,1,1,2,2,2,2,2,1,2,2,2,1,1,2,4,4,,,,,,2,,,,5,5,,2,,,2,2,,,,,,1,1,2,2,2,4,4,4,4,,,,,4,2,2,2,4,2,2,2,1,,2,2,3,5,1,1,1,,1,1,2,1,1,,,1,2,2,3,2,5,5,,,,,,,,,,,,,0,,0,8.905897937
739,1,UMF ���8 ��AGUASCALIENTES,1,20,6,11,8,12,8,45,59,2,2,5,5,1,1,1,1,2,1,3,4,2,1,1,,1,,1,1,1,2,1,1,1,1,1,1,2,2,1,1,2,1,1,1,2,2,1,1,1,1,2,2,2,1,2,1,2,2,2,2,2,2,1,2,,,,2,,1,,,,,,,2,,,1,2,,,,,,1,2,1,2,2,1,,,,1,1,,,1,1,1,1,1,1,1,2,1,,2,1,1,2,1,1,1,,1,1,1,1,1,,,1,1,2,1,1,4,4,,,,,,,,,,,,,0,,0,9.817078852
740,1,UMF ���8 ��AGUASCALIENTES,1,20,6,11,10,8,10,33,21,1,2,6,5,2,2,1,1,2,4,2,3,1,1,1,,1,,1,1,1,3,97,2,1,2,,,2,,2,1,2,1,1,1,2,1,2,2,1,1,1,2,2,1,2,1,1,2,2,2,2,2,2,2,2,,,1,,2,2,,,,,,2,,,1,1,2,1,2,2,2,1,1,1,1,2,2,2,4,4,2,2,2,,2,2,2,2,2,1,1,2,1,,2,1,2,4,2,,,,,,5,1,1,,,2,2,4,2,2,4,4,,,,,,,,,,,,,0,,0,8.45485298
741,1,UMF ���8 ��AGUASCALIENTES,1,20,6,11,17,8,17,24,35,1,2,6,5,1,2,2,2,2,1,2,4,1,1,1,,2,2,1,1,1,1,1,2,1,2,2,,2,,1,1,2,1,1,2,2,1,1,1,1,1,2,2,2,2,2,1,2,2,2,2,2,2,2,2,,,,,,2,,,,,,,1,1,1,1,2,,,,,,1,2,2,2,2,2,,,,,,,,4,4,2,4,5,99,99,99,99,,2,1,1,2,1,1,1,,1,1,2,1,1,,,1,3,5,2,2,2,5,,,,,,,,,,,,,0,,0,9.350955178
742,1,UMF ���8 ��AGUASCALIENTES,1,20,6,11,19,2,19,27,22,1,1,5,2,1,2,1,2,2,1,1,6,1,1,1,,1,,1,1,1,1,1,1,1,1,2,2,2,2,1,1,99,99,1,1,2,2,2,2,1,1,2,2,2,2,2,2,2,2,2,2,2,2,2,1,,,,,,,,,,,,,2,,,1,1,1,1,1,2,2,1,2,1,2,2,2,,,,2,2,,,2,2,2,2,2,1,1,1,1,,2,1,1,2,2,,,,,,5,1,1,,,1,1,1,1,2,2,1,,,,,,,,,,,,,0,,0,8.45485298
743,1,UMF ���8 ��AGUASCALIENTES,1,20,6,11,16,4,16,23,72,1,4,2,5,1,2,1,99,2,3,1,8,1,1,2,2,1,,1,1,1,1,1,1,1,1,1,1,2,2,1,2,,,1,2,2,1,1,1,1,1,2,2,2,2,2,2,2,2,2,2,2,2,2,2,,,,,,,,,,,,,2,,,2,1,1,1,2,2,1,1,2,1,2,2,2,,,,2,2,,,2,2,2,2,2,99,99,99,1,,2,2,1,1,1,1,1,,1,1,1,1,1,,,1,1,99,1,1,1,5,,,,,,,,,,,,,0,,0,8.073024601
744,1,UMF ���8 ��AGUASCALIENTES,1,20,6,11,8,9,8,34,59,2,2,2,5,2,2,1,99,2,3,6,11,1,1,1,,2,998,1,1,1,1,2,1,1,2,,2,2,,1,2,,,1,2,2,2,2,1,2,1,2,2,2,2,2,1,2,2,2,2,2,2,,1,,,,,,2,,,,,,,2,,,1,1,1,1,2,1,2,1,2,1,1,2,2,,,,2,2,2,,2,2,2,2,2,99,1,99,1,,2,2,2,1,1,1,1,,1,1,5,2,,,,1,1,4,1,1,1,4,,,,,,,,,,,,,0,,0,9.817078852
745,1,UMF ���8 ��AGUASCALIENTES,1,20,6,11,16,15,16,40,35,1,2,5,4,2,2,97,1,1,2,6,13,1,2,,,,,1,2,1,2,1,2,2,2,2,,,,1,2,,,1,1,1,1,2,2,1,1,2,2,2,2,1,2,2,2,2,2,2,2,2,2,,,,,2,,,,,,,,2,,,2,1,1,1,2,2,2,1,2,1,2,1,2,,,,2,2,,2,2,4,2,3,4,,,,1,,2,2,97,2,1,1,1,,1,1,3,2,,,,1,4,5,2,3,3,5,,,,,,,,,,,,,0,,0,9.350955178
746,1,UMF ���8 ��AGUASCALIENTES,1,20,6,11,14,15,14,40,43,1,2,7,5,1,2,1,1,2,3,1,11,1,1,1,,2,5,1,1,1,1,2,2,1,2,,,2,,2,2,,,1,1,2,2,2,2,2,1,2,2,2,2,2,1,2,2,2,2,2,2,,1,,,,,,1,,,,,,,2,,,2,1,3,2,4,2,3,1,2,1,2,2,3,,,,2,3,,,3,3,2,99,3,1,2,1,1,,2,1,1,2,2,,,,,,5,1,1,,,4,3,4,1,3,5,5,,,,,,,,,,,,,0,,0,9.350955178
747,1,UMF ���8 ��AGUASCALIENTES,1,20,6,11,14,45,15,10,26,1,2,7,5,1,2,1,1,2,4,3,1,2,2,,,,,2,2,1,1,1,2,2,2,2,,,,1,1,1,1,1,2,2,2,2,2,2,1,2,2,2,1,1,2,2,2,2,2,2,2,,1,,,,3,2,,,,,,,,1,7,1,2,1,3,1,2,2,2,1,2,1,1,2,2,,,,3,2,2,,3,3,2,3,3,1,1,1,1,,2,2,1,2,2,,,,,,5,1,1,,,4,2,4,2,2,5,2,,,,,,,,,,,,,0,,0,8.905897937
748,1,UMF ���8 ��AGUASCALIENTES,1,20,6,11,13,40,14,5,80,2,2,3,9,2,1,1,2,2,3,2,1,1,1,1,,2,6,1,3,,1,2,2,2,2,,,,,1,2,,,1,1,1,1,1,1,1,1,2,2,2,2,2,1,2,2,2,2,2,2,1,1,,,,,,1,,,,,,,2,,,2,2,,,,,,1,2,1,2,2,1,,,,1,1,,,2,2,2,2,2,2,2,2,1,,2,2,2,1,1,1,1,,1,1,5,1,1,,,2,2,3,1,2,4,4,,,,,,,,,,,,,0,,0,9.567691645
749,1,UMF ���8 ��AGUASCALIENTES,1,20,6,11,11,10,11,42,66,1,1,2,5,2,2,1,2,2,3,2,2,1,1,1,,2,1,1,1,1,2,2,2,2,2,,,,,2,2,,,1,1,2,2,2,2,1,1,2,2,2,2,2,1,2,2,2,2,2,2,2,2,,,,,,2,,,,,,,2,,,2,2,,,,,,1,2,2,2,2,2,,,,,,,,2,2,2,2,2,2,2,2,2,1,2,2,1,2,1,1,1,,1,1,5,1,1,,,2,2,2,2,2,2,2,,,,,,,,,,,,,0,,0,8.073024601
750,1,UMF ���8 ��AGUASCALIENTES,1,20,6,11,13,5,13,35,58,2,2,3,9,2,2,1,1,2,4,2,13,1,1,1,,1,,1,2,1,2,2,2,2,1,,,,1,2,1,2,1,1,1,2,1,1,1,1,1,2,2,2,2,2,1,2,2,2,2,2,2,2,1,,,,,,1,,,,,,,1,2,3,2,1,3,1,2,2,2,1,2,1,2,2,1,,,,3,3,,,2,2,2,4,2,2,2,2,1,,2,2,2,2,1,1,1,,1,1,1,1,1,,,3,4,5,2,3,3,5,,,,,,,,,,,,,0,,0,9.817078852
751,1,UMF ���8 ��AGUASCALIENTES,1,20,6,11,12,0,12,19,21,1,2,7,1,2,2,2,2,2,1,3,6,3,2,,,,,1,1,1,1,1,1,1,2,1,1,1,,1,1,1,1,2,2,2,2,2,2,1,1,1,2,2,2,1,1,2,2,2,2,2,2,3,1,1,,,,1,2,,,,,,,2,,,2,1,1,1,1,2,1,1,1,2,2,1,2,3,3,5,,,,1,2,3,3,4,2,3,2,2,1,,2,99,2,2,1,1,1,,1,1,5,1,1,,,1,1,5,1,1,3,3,,,,,,,,,,,,,0,,0,8.45485298
752,1,UMF ���8 ��AGUASCALIENTES,1,20,6,11,10,25,10,55,40,2,2,5,1,1,2,1,1,2,2,2,11,1,2,,,,,1,1,1,3,2,1,1,2,,2,2,,3,2,,,1,1,1,1,1,2,1,1,1,2,2,2,2,1,2,2,2,2,2,2,2,2,2,,,,,1,,,,,,,1,8,998,1,2,,,,,,1,2,1,2,2,1,,,,1,1,,,2,5,2,3,2,1,1,1,1,,2,2,1,2,1,1,1,,1,1,5,1,1,,,1,1,4,3,1,5,5,,,,,,,,,,,,,0,,0,11.08222261
753,1,UMF ���8 ��AGUASCALIENTES,1,20,6,11,11,10,11,21,66,2,4,1,9,2,2,2,1,2,3,2,1,1,2,,,,,1,1,1,2,1,1,1,2,2,2,1,,2,1,2,1,1,1,1,1,1,1,2,1,2,2,2,1,2,2,2,2,2,2,2,2,,1,,,,2,,,,,,,,,2,,,1,1,1,1,1,2,1,1,1,1,1,2,2,2,2,3,2,1,1,,2,1,2,2,2,1,1,1,1,,2,2,1,1,1,1,1,,2,,5,2,,,,2,2,4,1,2,4,3,,,,,,,,,,,,,0,,0,9.567691645
754,1,UMF ���8 ��AGUASCALIENTES,1,20,6,11,18,51,19,6,30,1,1,9,2,1,3,3,3,2,1,2,4,5,1,2,3,1,,1,4,,3,2,2,2,2,,,,,4,1,4,1,1,2,1,2,2,2,1,1,2,2,2,2,2,2,2,2,2,2,2,2,2,4,,,,,,,,,,,,,2,,,2,1,3,1,2,2,2,1,1,1,2,2,1,4,4,4,4,5,,,2,3,4,2,4,2,2,1,2,2,2,1,3,2,2,,,,,,5,1,2,1,2,4,4,5,4,5,4,5,,,,,,,,,,,,,0,,0,8.905897937
755,1,UMF ���8 ��AGUASCALIENTES,1,20,6,11,16,32,16,50,55,1,2,3,5,1,2,3,2,2,3,2,2,1,1,1,,1,,1,1,1,1,2,2,2,2,,,,,2,2,,,1,2,2,1,2,2,1,1,2,1,2,2,2,1,2,2,2,2,2,2,1,2,,1,,,,1,,,,,,,2,,,2,1,1,1,2,2,1,1,2,1,2,2,2,,,,2,2,,,2,2,2,99,2,99,99,99,1,,2,2,2,2,1,1,1,,1,1,5,1,1,,,2,99,99,2,5,2,99,,,,,,,,,,,,,0,,0,8.28345248
756,1,UMF ���8 ��AGUASCALIENTES,1,20,6,11,17,42,18,9,72,1,2,5,5,1,2,2,2,2,3,2,2,1,1,2,2,2,2,1,1,1,2,2,2,2,2,,,,,2,1,2,1,1,2,2,1,1,1,1,1,2,1,2,2,2,1,2,2,2,2,2,2,2,2,,1,,,,2,,,,,,,1,5,1,2,2,,,,,,1,2,1,2,2,3,,,,3,3,,,3,3,2,3,3,99,99,99,1,,2,1,1,2,1,1,1,,1,1,5,1,1,,,2,1,4,2,1,4,4,,,,,,,,,,,,,0,,0,8.073024601
757,1,UMF ���8 ��AGUASCALIENTES,1,20,6,11,12,22,12,45,80,2,2,2,1,1,2,2,1,2,3,2,1,1,2,,,,,1,2,1,3,2,2,2,2,,,,,2,2,,,1,2,1,1,2,2,1,1,2,2,2,2,1,1,2,2,2,2,2,2,2,3,,,,,2,2,,,,,,,2,,,99,2,,,,,,1,2,2,2,1,3,,,,,,,2,2,2,2,2,2,2,1,2,1,,2,2,2,2,1,1,1,,1,1,5,1,1,,,1,4,4,2,2,5,5,,,,,,,,,,,,,0,,0,9.567691645
2398,1,UMF ���8 ��AGUASCALIENTES,1,20,6,11,8,35,9,5,21,1,2,8,2,2,2,2,2,2,2,1,13,1,1,2,2,2,2,1,2,1,1,1,2,1,1,2,,2,1,3,1,2,2,1,1,2,2,2,2,1,1,2,2,2,2,2,1,2,2,2,2,2,1,2,2,,,,,,2,,,,,,2,1,1,132,2,2,,,,,,1,2,1,2,2,2,,,,2,2,,,2,4,4,2,2,2,1,1,1,,2,1,1,2,1,1,1,,1,1,5,1,1,,,2,2,5,2,5,5,5,,,,,,,,,,,,,0,,0,8.45485298
2399,1,UMF ���8 ��AGUASCALIENTES,1,20,6,11,10,20,10,50,28,1,1,5,1,2,4,2,1,2,1,4,10,1,1,1,,1,,1,2,1,2,2,2,2,2,,,,,3,2,,,1,1,2,2,2,1,1,1,2,2,2,2,2,1,2,2,2,2,2,2,2,2,,,,,,2,,,,,,,2,,,2,2,,,,,,1,1,1,2,2,2,5,4,4,4,4,,,4,2,2,2,2,2,2,2,2,2,2,1,2,2,1,1,1,,1,1,5,1,1,,,5,5,5,5,1,5,5,,,,,,,,,,,,,0,,0,8.905897937
2400,1,UMF ���8 ��AGUASCALIENTES,1,20,6,11,11,2,11,26,20,1,1,6,6,1,1,1,1,1,4,1,998,1,2,,,,,1,3,,1,2,2,2,2,,,,,3,2,,,1,1,2,2,2,1,1,1,2,2,2,2,2,1,2,2,2,2,2,2,2,2,,,,,,1,,,,,,,2,,,2,2,,,,,,1,2,1,2,2,3,,,,3,2,,,3,4,4,2,2,,,,1,,2,1,2,2,1,1,1,,1,1,5,1,1,,,5,4,4,2,1,4,5,,,,,,,,,,,,,0,,0,8.45485298
2740,1,UMF ���8 ��AGUASCALIENTES,1,20,6,11,12,5,12,33,31,1,2,5,5,2,2,1,2,2,4,2,3,1,1,1,,1,,1,1,1,3,97,2,2,2,,,,,4,2,,,1,1,2,2,2,3,1,1,2,2,2,2,2,1,2,2,2,2,2,2,2,2,,,,,,2,,,,,,,2,,,2,2,,,,,,1,1,1,2,2,2,1,1,2,1,2,,,2,2,2,2,2,1,1,1,1,,2,1,1,1,1,1,1,,1,1,99,1,1,,,4,3,4,2,2,4,4,,,,,,,,,,,,,0,,0,8.905897937
2741,1,UMF ���8 ��AGUASCALIENTES,1,20,6,11,12,40,13,11,68,2,2,2,9,2,4,2,2,2,3,2,1,1,2,,,,,2,2,1,2,1,2,2,2,2,,,,3,2,,,1,1,2,1,2,2,1,1,2,2,2,2,2,2,2,2,2,2,2,2,3,5,,,,,,,,,,,,,2,,,2,1,1,1,2,2,2,1,2,1,2,2,3,,,,3,4,,,3,2,2,2,2,2,2,2,2,1,2,1,2,4,2,,,,,,5,1,2,1,1,2,5,5,3,2,5,5,,,,,,,,,,,,,0,,0,9.567691645
2742,1,UMF ���8 ��AGUASCALIENTES,1,20,6,11,13,25,13,55,66,2,2,7,9,2,2,1,1,2,4,2,200,1,1,1,,1,,1,1,1,2,1,1,1,1,2,2,2,2,2,1,2,1,1,1,2,1,1,2,1,1,2,2,2,2,2,1,2,2,2,2,2,2,1,1,,,,,,1,,,,,,,2,,,2,1,1,1,2,2,2,1,2,1,2,2,2,,,,2,5,,,2,2,2,2,2,2,1,1,1,,2,1,2,2,1,1,1,,1,1,5,1,1,,,2,2,5,2,2,5,5,,,,,,,,,,,,,0,,0,9.567691645
2743,1,UMF ���8 ��AGUASCALIENTES,1,20,6,11,8,5,8,30,20,2,1,8,6,1,2,1,1,2,1,1,64,1,1,1,,1,,1,1,1,1,1,1,1,1,2,2,1,1,1,2,,,1,1,2,2,2,2,1,1,2,2,2,2,2,1,2,2,2,2,2,2,2,1,,,,,,2,,,,,,,1,5,5,1,1,3,1,2,2,2,1,2,1,2,2,1,,,,2,2,,,2,2,2,2,2,1,1,1,1,,2,1,2,1,1,1,1,,1,1,5,1,1,,,1,1,2,1,1,2,2,,,,,,,,,,,,,0,,0,10.02021302
2744,1,UMF ���8 ��AGUASCALIENTES,1,20,6,11,19,9,19,30,37,1,3,3,1,2,2,2,1,2,3,3,17,1,1,1,,2,2,1,1,1,1,1,1,1,1,2,1,1,1,2,1,1,1,1,2,2,2,2,1,1,1,2,2,2,1,2,1,2,2,2,2,2,2,2,1,,,,3,,1,,,,,,,1,2,1,2,1,3,1,2,2,2,1,2,1,2,2,2,,,,2,2,,,2,2,2,3,2,1,1,1,1,,2,1,1,1,1,1,1,,1,1,5,1,2,2,1,1,1,4,1,1,5,4,,,,,,,,,,,,,0,,0,9.350955178
2745,1,UMF ���8 ��AGUASCALIENTES,1,20,6,11,9,23,9,41,58,1,2,1,5,2,1,1,1,2,4,2,1,1,1,2,1,2,3,1,1,1,1,1,1,1,2,2,1,1,,1,1,1,1,1,1,1,1,1,2,1,1,2,2,2,2,2,1,2,2,2,2,2,2,2,2,,,,,,2,,,,,,,2,,,2,1,2,1,2,2,2,1,2,1,2,2,2,,,,2,2,,,2,2,2,99,4,1,1,1,1,,2,2,1,99,1,1,1,,1,1,5,1,1,,,4,4,3,3,3,3,4,,,,,,,,,,,,,0,,0,8.28345248
2746,1,UMF ���8 ��AGUASCALIENTES,1,20,6,11,16,50,17,30,25,1,2,5,4,1,2,2,1,2,4,6,3,1,1,1,,2,3,1,1,1,2,97,1,1,1,,2,2,2,2,1,2,1,1,1,2,2,2,2,1,1,2,2,2,2,2,1,2,2,2,2,2,2,2,2,,,,,,2,,,,,,,1,5,1,1,2,,,,,,1,2,1,2,2,2,,,,2,2,,,2,3,2,2,2,1,1,2,1,,2,2,1,1,1,1,1,,1,1,5,1,1,,,2,2,4,2,2,4,4,,,,,,,,,,,,,0,,0,8.45485298
2747,1,UMF ���8 ��AGUASCALIENTES,1,20,6,11,11,35,11,57,83,2,4,3,9,2,4,2,2,2,4,2,1,1,1,2,2,2,2,2,1,1,1,1,1,1,2,4,2,2,,1,1,1,1,1,1,2,1,1,1,1,1,2,2,2,2,2,1,2,2,2,2,2,2,4,2,,,,,,3,,,,,,,2,,,1,1,3,1,2,2,2,1,2,1,2,2,2,,,,2,2,,,2,2,2,2,2,2,2,2,1,,2,1,2,2,1,2,2,3,2,,5,1,2,2,4,3,3,5,4,3,5,5,,,,,,,,,,,,,0,,0,9.567691645
2748,1,UMF ���8 ��AGUASCALIENTES,1,20,6,11,15,2,15,21,24,2,2,3,1,1,2,2,2,1,1,6,5,2,2,,,,,2,1,1,3,2,2,2,2,,,,,2,1,2,2,2,2,2,1,1,1,1,1,1,2,2,2,2,1,2,2,2,1,1,2,2,3,2,,,,,2,,,,2,1,,2,,,2,2,,,,,,1,1,1,2,2,2,2,2,4,2,2,,,2,2,2,99,99,,,,1,,2,1,3,2,1,1,1,,1,1,5,2,,,,1,1,2,1,1,3,3,,,,,,,,,,,,,0,,0,10.02021302
2749,1,UMF ���8 ��AGUASCALIENTES,1,20,6,11,18,5,18,27,18,2,1,5,1,2,2,97,99,2,1,6,6,1,2,,,,,1,1,1,3,1,1,1,1,2,2,2,2,1,1,1,1,1,1,1,1,1,1,1,1,2,2,2,2,2,1,2,2,2,2,2,2,2,1,,,,,,2,,,,,,,1,8,1,2,2,,,,,,1,2,1,2,2,1,,,,1,1,,,1,1,1,1,1,99,99,99,1,,2,2,1,1,1,1,1,,1,1,1,2,,,,1,2,2,1,1,5,2,,,,,,,,,,,,,0,,0,10.02021302
2750,1,UMF ���8 ��AGUASCALIENTES,1,20,6,11,17,2,17,23,60,2,2,3,4,2,1,2,2,1,4,2,14,1,1,1,,2,998,1,1,1,1,1,1,1,1,1,1,1,1,1,1,1,1,1,1,1,1,1,1,1,1,2,2,2,2,2,1,1,2,2,2,2,2,1,1,,,,,,1,1,,,,,,2,,,2,1,2,1,1,2,1,1,1,1,2,2,1,1,1,4,1,2,,,1,1,1,1,1,,,,1,,2,2,1,1,1,1,1,,1,1,5,2,,,,1,1,99,1,1,2,99,,,,,,,,,,,,,0,,0,9.817078852
2751,1,UMF ���8 ��AGUASCALIENTES,1,20,6,11,16,2,16,24,30,1,2,9,2,2,2,99,1,2,4,2,3,1,1,1,,2,2,1,1,1,2,97,97,97,97,,,,,1,1,1,1,1,2,2,1,1,2,1,1,2,2,2,2,2,1,2,2,2,2,2,2,2,2,,,,,,3,,,,,,,2,,,1,1,4,1,2,2,2,1,2,1,2,2,2,,,,2,4,,,2,3,2,2,2,1,1,1,1,,2,2,1,2,1,2,1,,1,1,5,1,2,1,1,1,2,4,2,4,4,4,,,,,,,,,,,,,0,,0,8.905897937
2752,1,UMF ���8 ��AGUASCALIENTES,1,20,6,11,14,2,14,19,31,1,2,3,5,2,2,2,1,2,4,2,11,1,1,2,1,2,5,1,1,1,1,1,1,1,1,2,2,2,2,1,2,,,1,1,2,2,1,2,1,1,2,2,1,2,2,1,2,2,2,2,2,2,2,1,,,1,,,2,,,,,,,1,4,998,2,2,,,,,,1,2,1,2,2,2,,,,1,2,,,1,1,1,1,1,3,2,2,1,,2,2,2,2,1,1,1,,1,1,5,1,2,2,3,3,3,5,3,3,3,5,,,,,,,,,,,,,0,,0,8.905897937
2753,1,UMF ���8 ��AGUASCALIENTES,1,20,6,11,15,25,15,58,36,2,2,5,2,2,2,1,1,2,1,2,8,1,1,1,,1,,1,1,1,1,2,1,2,2,,2,,,1,1,1,1,2,2,2,1,2,2,1,1,2,2,2,2,2,1,2,2,2,2,2,2,4,1,,,,,,2,,,,,,,2,,,1,1,1,1,2,2,2,1,2,1,2,2,2,,,,2,2,,,2,2,2,2,2,1,1,1,1,,2,2,1,2,1,1,1,,1,1,5,1,1,,,1,5,5,2,1,5,5,,,,,,,,,,,,,0,,0,11.08222261
2754,1,UMF ���8 ��AGUASCALIENTES,1,20,6,11,14,40,15,10,22,1,2,7,4,1,3,2,1,2,1,4,4,1,1,2,2,1,,1,1,1,2,1,1,1,1,2,2,2,2,2,1,1,1,1,1,2,2,2,2,1,1,2,2,2,2,2,1,2,2,2,2,2,2,2,2,,,,,,2,,,,,,,2,,,2,2,,,,,,1,2,1,2,2,2,,,,2,4,,,2,2,2,2,2,1,1,2,1,,2,2,1,2,1,1,1,,1,1,5,1,1,,,2,2,5,4,4,99,99,,,,,,,,,,,,,0,,0,8.45485298
2755,1,UMF ���8 ��AGUASCALIENTES,1,20,6,11,14,7,14,31,62,1,2,2,5,2,2,2,1,1,4,2,2,1,1,1,,2,2,1,1,1,1,1,2,2,2,2,,,,2,2,,,1,1,2,2,2,2,1,1,2,2,2,2,2,1,2,2,2,2,2,2,1,1,,,,,,1,,,,,,,2,,,2,2,,,,,,1,2,1,2,2,1,,,,1,4,,,2,1,1,3,2,,,,1,,2,2,2,2,1,1,1,,1,1,5,1,1,,,2,2,4,2,2,4,4,,,,,,,,,,,,,0,,0,8.28345248
2756,1,UMF ���8 ��AGUASCALIENTES,1,20,6,11,11,30,11,59,28,1,2,5,5,2,3,2,1,2,3,3,21,1,1,2,2,2,2,1,2,1,2,1,1,1,1,2,2,1,1,2,1,2,1,1,1,2,2,2,2,1,1,2,2,2,2,2,2,2,2,2,2,2,2,1,2,,,,,,,,,,,,,2,,,2,2,,,,,,1,1,1,2,2,2,5,4,5,5,5,,,3,2,2,2,2,2,2,2,2,1,2,1,3,4,2,,,,,,5,1,1,,,4,4,5,2,5,4,5,,,,,,,,,,,,,0,,0,8.905897937
2757,1,UMF ���8 ��AGUASCALIENTES,1,20,6,11,9,45,10,18,34,1,2,8,5,1,4,2,2,2,1,2,998,1,1,1,,1,,1,2,1,3,1,2,1,2,4,,2,,2,1,3,1,1,2,2,2,2,3,1,1,2,2,2,2,2,1,2,2,2,2,2,2,2,2,,,,,,2,,,,,,,2,,,2,2,,,,,,1,1,1,2,2,2,4,4,5,2,2,,,4,2,2,3,3,2,2,2,2,2,2,1,2,4,1,1,1,,1,1,5,1,1,,,4,4,4,4,99,4,4,,,,,,,,,,,,,0,,0,8.905897937
2758,1,UMF ���8 ��AGUASCALIENTES,1,20,6,11,9,14,9,42,39,1,1,7,4,1,1,1,1,2,3,2,2,1,1,1,,1,,1,1,1,2,2,2,2,2,,,,,2,2,,,1,1,2,2,2,2,1,1,2,2,2,2,2,1,2,2,2,2,2,2,3,3,,,,,,2,,,,,,,2,,,2,2,,,,,,1,2,1,2,2,2,,,,2,2,,,2,2,2,2,2,2,2,2,1,,2,1,2,2,1,1,1,,1,1,5,1,1,,,2,2,4,2,2,4,4,,,,,,,,,,,,,0,,0,9.350955178
2759,1,UMF ���8 ��AGUASCALIENTES,1,20,6,11,19,7,19,26,21,1,2,5,5,1,2,1,1,2,4,2,3,1,1,2,2,1,,1,1,1,1,1,1,1,1,1,1,1,1,1,1,1,1,1,2,1,1,1,1,1,1,2,2,2,1,2,1,2,2,2,2,2,2,2,1,,,,2,,2,,,,,,,2,,,2,2,,,,,,1,2,1,1,2,1,,,,1,1,1,,1,1,1,1,1,2,2,2,1,,2,1,1,2,1,1,3,3,,,5,1,3,1,5,1,1,1,1,1,1,1,,,,,,,,,,,,,0,,0,8.45485298
2760,1,UMF ���8 ��AGUASCALIENTES,1,20,6,11,13,8,13,27,50,1,2,1,5,2,2,2,2,2,4,2,2,1,1,1,,1,,1,1,1,1,1,2,1,2,3,,3,,1,1,1,1,1,1,1,1,1,1,1,1,2,2,2,2,2,1,1,1,1,1,2,2,2,2,,,,,,1,2,2,2,2,,,2,,,1,2,,,,,,1,2,1,2,2,1,,,,2,2,,,2,2,2,2,2,1,1,1,1,,2,1,2,2,1,1,1,,1,1,5,1,1,,,3,3,3,3,1,1,1,,,,,,,,,,,,,0,,0,8.735912944
2761,1,UMF ���8 ��AGUASCALIENTES,1,20,6,11,12,7,12,29,18,2,1,5,10,1,1,99,2,2,2,6,9,4,2,,,,,1,1,1,3,1,1,1,2,1,1,1,,1,1,2,1,1,1,2,2,1,1,1,1,2,2,2,2,1,1,1,2,2,2,2,2,1,1,,,,,1,1,1,,,,,,2,,,1,1,1,1,1,2,1,1,2,1,1,1,2,,,,2,2,1,1,1,1,1,1,1,2,1,1,1,,2,1,1,2,1,1,1,,1,1,5,1,1,,,1,1,2,1,1,2,2,,,,,,,,,,,,,0,,0,10.02021302
2762,1,UMF ���8 ��AGUASCALIENTES,1,20,6,11,11,10,11,29,20,1,2,5,2,2,3,2,1,2,3,6,8,3,1,2,3,2,2,2,2,1,2,2,2,2,2,,,,,2,1,3,1,1,1,2,2,2,1,1,1,1,2,2,2,2,1,1,2,2,2,2,2,2,4,3,,,,,1,2,,,,,,1,5,1,2,2,,,,,,1,2,1,2,2,2,,,,2,2,,,2,1,2,2,2,2,2,2,1,,2,2,1,3,1,2,1,,1,1,5,1,1,,,4,4,5,3,3,5,5,,,,,,,,,,,,,0,,0,8.45485298
2763,1,UMF ���8 ��AGUASCALIENTES,1,20,6,11,10,31,10,54,35,1,2,9,5,1,5,3,1,2,1,6,13,3,1,2,3,1,,1,1,3,2,1,1,1,2,4,2,2,,2,1,4,1,2,2,2,2,1,1,1,1,2,2,2,2,2,1,2,2,2,2,2,2,2,2,,,,,,2,,,,,,,1,5,1,1,1,1,1,1,2,2,1,2,1,2,2,2,,,,1,1,,,1,1,1,1,1,99,2,1,1,,2,1,1,2,1,1,1,,1,1,5,1,1,,,1,5,5,2,2,5,5,,,,,,,,,,,,,0,,0,9.350955178
2764,1,UMF ���8 ��AGUASCALIENTES,1,20,6,11,10,4,10,22,31,2,2,5,2,2,2,1,1,2,2,6,13,1,2,,,,,1,2,3,2,1,2,1,1,4,,2,2,2,2,,,1,1,2,2,2,99,1,1,2,2,1,2,2,1,2,2,2,2,2,2,1,2,,,2,,,2,,,,,,,1,2,6,1,1,1,2,2,1,2,1,2,1,2,2,2,,,,2,4,,,2,2,2,99,99,99,99,99,1,,2,2,1,99,1,1,1,,1,1,1,2,,,,3,5,5,2,4,5,5,,,,,,,,,,,,,0,,0,10.55476596
2765,1,UMF ���8 ��AGUASCALIENTES,1,20,6,11,18,1,18,35,21,1,1,2,7,2,1,1,2,2,4,2,9,1,2,,,,,1,1,1,2,1,2,1,1,1,,1,1,1,1,2,1,1,1,2,2,2,1,1,1,2,2,2,2,2,1,2,2,2,2,2,2,2,1,,,,,,2,,,,,,,1,1,2,2,2,,,,,,1,1,1,2,2,1,2,2,5,3,2,,,2,2,2,2,2,1,1,2,1,,2,1,2,2,1,1,2,3,1,2,5,2,,,,2,2,4,2,1,4,4,,,,,,,,,,,,,0,,0,8.45485298
2766,1,UMF ���8 ��AGUASCALIENTES,1,20,6,11,8,29,8,42,46,1,2,2,5,1,2,2,2,2,1,2,1,1,2,,,,,1,1,1,2,1,1,1,1,2,2,2,2,1,1,1,1,1,1,2,1,1,2,1,1,2,2,1,1,2,1,2,2,2,2,2,2,1,1,,,1,2,,1,,,,,,,2,,,2,1,1,1,1,2,1,1,2,1,1,2,1,,,,1,1,2,,1,1,1,1,99,1,1,1,1,,2,1,2,1,1,1,1,,1,1,5,1,1,,,2,2,2,2,2,2,2,,,,,,,,,,,,,0,,0,8.735912944
2767,1,UMF ���8 ��AGUASCALIENTES,1,20,6,11,9,2,9,19,35,1,2,9,5,2,1,1,1,2,4,2,11,1,1,2,2,2,998,1,1,1,3,2,1,2,2,,2,,,4,1,2,1,1,1,2,2,1,1,1,1,2,1,2,2,1,1,2,2,2,2,2,2,2,2,,2,,,2,2,,,,,,,2,,,1,2,,,,,,1,2,1,2,1,2,,,,2,1,,3,2,2,2,99,99,99,99,99,1,,2,1,1,2,1,1,1,,1,1,1,2,,,,2,2,4,1,1,2,4,,,,,,,,,,,,,0,,0,9.350955178
4225,1,UMF ���8 ��AGUASCALIENTES,1,20,6,11,8,1,8,22,28,2,2,4,10,1,5,2,2,2,2,1,13,4,2,,,,,1,1,1,1,2,2,1,2,,,5,,4,1,4,1,1,1,2,2,2,2,1,1,2,2,2,2,2,1,2,2,2,2,2,2,3,3,,,,,,2,,,,,,,2,,,2,1,1,1,2,2,2,1,2,1,2,2,2,,,,2,2,,,3,2,2,2,2,3,2,2,1,,2,2,2,2,1,1,1,,1,1,5,1,1,,,2,1,5,2,2,5,5,,,,,,,,,,,,,0,,0,10.55476596
4401,1,UMF ���8 ��AGUASCALIENTES,1,20,6,11,14,58,15,15,48,2,2,7,10,1,3,2,2,2,4,2,4,3,2,,,,,1,2,1,1,2,2,1,1,,,1,1,2,1,2,1,1,1,1,1,1,1,1,1,2,2,2,2,2,1,2,2,2,2,2,2,3,1,,,,,,4,,,,,,,1,5,998,1,2,,,,,,1,1,1,2,2,3,4,4,5,4,5,,,4,2,2,2,2,2,2,2,2,5,2,1,3,2,1,2,1,,1,1,5,1,1,,,1,3,3,2,3,5,4,,,,,,,,,,,,,0,,0,10.35330937
4402,1,UMF ���8 ��AGUASCALIENTES,1,20,6,11,17,15,17,44,26,2,2,5,2,2,1,2,2,2,3,2,1,1,1,1,,2,5,1,2,1,1,2,2,2,2,,,,,2,1,1,1,1,1,2,2,2,1,1,1,2,2,2,2,2,1,2,2,2,2,2,2,1,1,,,,,,2,,,,,,,1,2,8,2,1,1,1,2,2,2,1,2,1,2,2,2,,,,2,2,,,2,4,2,2,4,2,2,2,1,,2,1,1,2,1,1,1,,1,1,2,1,1,,,4,4,4,2,2,2,2,,,,,,,,,,,,,0,,0,10.55476596