FOLIO,DELEG,ID_UNID,UNIDMED,FECHA_D,FECHA_M,FECHA_A,HR_INI_H,HR_INI_M,HR_FIN_H,HR_FIN_M,EDAD,SEXO,EDOCIVI,ESCOLAR,OCUPA,INGRESO,SAT1,SAT3,MOTCONS2,PROBSAL,PROBSAL_G,RETRO,CAQOD,PREOSAD,TMSALUD,MHCLINC,EXPCLAA_A,EXPCLAA_B,EXPCLAA_C,EXPCLAA_D,EXPCLAB_A,EXPCLAB_B,EXPCLAB_C,EXPCLAB_D,MOPIN,EXPLORA,PREVENF_A,PREVENF_B,PREVENF_C,PREVENF_D,FILTROSAUX,SADUNI,TEMSAD,SATLARX,BTRATOU,CALFATNA_A,CALFATNA_C,CALFATNA_D,CALFATNA_E,CALFATNA_F,CALFATNA_G,CALFATNA_H,CALFATNA_J,CALFATNA_K,CALFATNA_L,CALFATNA_M,CALFATNA_N,CALFATNB_A,CALFATNB_C,CALFATNB_D,CALFATNB_E,CALFATNB_F,CALFATNB_G,CALFATNB_H,CALFATNB_J,CALFATNB_K,CALFATNB_L,CALFATNB_M,CALFATNB_N,CALFINMA_A,CALFINMB_A1,CALFINMA_B,CALFINMB_B1,CALFINMB_B2,CALFINMB_B3,CALFINMA_C,CALFINMB_C1,CALFINMB_C2,CALFINMA_D,CALFINMB_D1,CALFINMA_E,CALFINMB_E1,CALFINMB_F,CALFINMB_G,CALFINMB_H,CALFINMB_I,CALFINMB_J,RECOMUNI,NORECOM,CORRUP,ATN1FAM,FILTROFARM,TFARSURT,TOTMED,ACNOMED,VERSURT,VERSURT2,FARM1,FARM2,FARM5,FARM6_R,FARM6,SATMED,SAT2,OPELEC_B,OPELEC_C,PREFESERV,FILTROATEN,OTROSERV,MOT_OTRO,PROBSAL2_G,PROBSAL2,TRAT_OTRO,TMP_OTRO,SAT_OTRO,MEJ_SERV,INFO_SP,SAT_SP,TRATO_SP,TMED_SP,PREP_SP,INST_SP,MED_SP,COMENT,COMENT_T,EDAD_R,id_Unidad,Cve_Delegaci�n,Delegaci�n,Nivel,NIVEL_F,Unidad,promedio_diario2012,estrato,MOSCondia,FE_FinalNR
13414,1,6,UMF    6 JESUS MARIA,23,7,13,19,23,19,42,47,1,2,5,5,2,2,2,1,1,1,1,1,1,1,1,1,1,1,1,2,1,1,99,2,1,1,1,1,1,2,,,,2,1,1,2,2,2,2,2,2,2,2,2,1,2,2,,,,,,,,,,2,1,2,1,4,4,4,1,2,2,2,,2,,2,2,2,2,2,1,,2,2,1,2,1,,1,1,1,1,,,,2,7,2,2,1,2,,,,,,,,,1,3,2,2,2,3,3,,SIN COMENTARIO,4,6,1,AGUASCALIENTES,1,1,UMF    6 JESUS MARIA,384,2,0.268343816,6.884102403
573,4,1904,UMF 13 CAMPECHE,16,7,13,16,20,16,35,19,2,1,7,6,3,2,2,1,1,1,1,1,1,1,1,1,2,1,1,2,,2,2,1,1,2,2,2,2,2,,,,2,1,1,2,2,1,2,2,2,2,2,2,1,2,2,,,2,,,,,,,2,1,2,2,,,,1,2,2,2,,2,,2,2,2,2,2,1,,2,1,1,1,1,,2,,1,1,,,,2,9,2,2,1,2,,,,,,,,,1,4,1,3,3,3,3,,SIN COMENTARIO,1,1904,4,CAMPECHE,1,1,UMF 13 CAMPECHE,440,1,0.210425634,5.617633352
3599,12,499,UMF    52 CUAUTITLAN  I.,19,7,13,12,20,12,35,60,1,1,3,5,1,4,2,1,1,1,2,1,2,1,1,1,2,1,1,1,,2,2,3,2,1,2,2,2,2,,,,1,1,1,2,2,2,2,2,2,2,2,2,1,2,2,,,,,,,,,,1,1,2,1,2,4,4,1,4,4,2,,2,,4,2,2,2,2,1,,2,99,1,1,1,,1,1,1,1,,,,2,7,2,1,1,2,,,,,,,,,1,2,99,99,99,99,99,,SIN COMENTARIO,5,499,12,M�XICO ORIENTE,1,1,UMF    52 CUAUTITLAN  I.,1792,1,0.125948833,23.81398235
8976,14,636,UMF      40 VILLAGRAN,23,7,13,14,50,15,6,44,1,2,4,5,4,2,2,1,1,1,1,1,2,1,1,1,1,1,1,2,2,2,2,2,1,1,1,1,2,2,,,,2,1,1,2,2,2,1,1,2,2,2,2,2,2,2,,,,2,2,,,,,,1,2,1,1,2,1,1,2,2,2,,2,,2,2,2,2,2,1,,2,2,2,,,,,,1,2,1,1,98,2,6,2,2,1,2,,,,,,,,,2,,,,,,,,SIN COMENTARIO,3,636,14,GUANAJUATO,1,1,UMF      40 VILLAGRAN,209,2,0.071821306,27.95242293
16690,26,1253,UMF    3 CD. VALLES,23,7,13,19,1,19,22,19,1,1,6,6,3,3,3,1,1,1,1,1,2,1,1,1,2,2,2,2,,,,1,99,1,1,1,1,2,,,,1,2,1,2,1,2,2,2,2,2,2,2,2,,2,,2,,,,,,,,,1,1,2,,,,1,2,1,2,,2,,2,2,3,2,1,1,,2,99,2,,,,,,2,,,,,1,8,2,2,1,2,,,,,,,,,1,2,2,99,4,2,99,,SIN COMENTARIO,1,1253,26,SAN LUIS POTOS�,1,1,UMF    3 CD. VALLES,708,3,1,9.009336103
6282,31,1552,HGSMF   8 TLAXCALA,17,7,13,11,38,12,0,48,1,2,3,5,5,1,1,1,1,1,2,1,1,1,1,1,1,1,1,2,2,2,2,1,1,1,1,1,2,2,,,,2,1,1,1,2,2,2,2,2,2,2,2,1,2,1,2,,,,,,,,,4,1,2,1,2,2,4,1,2,4,2,,2,,2,2,2,2,3,1,,2,2,1,2,1,,1,1,2,,,,,4,10,2,2,1,2,,,,,,,,,1,5,3,3,2,3,3,,SIN COMENTARIO,4,1552,31,TLAXCALA,1,1,HGSMF   8 TLAXCALA,428,1,0.212617983,2.910369485
8070,5,111,UMF   13 TUXTLA GUTIERREZ,17,7,13,9,56,10,14,20,2,2,3,1,2,2,2,1,2,1,1,1,1,1,1,1,2,1,2,1,,1,,1,2,1,1,1,2,1,1,1,1,2,2,1,2,1,2,2,2,2,1,1,2,1,,1,,2,,,,,3,1,,1,1,2,2,,,,1,1,2,2,,2,,2,2,3,2,2,1,,2,1,1,1,1,,1,1,1,2,1,1,80,1,7,2,2,1,2,,,,,,,,,2,,,,,,,2,EN LABORATORIO HAY UN BOTECITO DONDE PIDEN COOPERACI�N VOLUNTARIA,1,111,5,CHIAPAS,1,1,UMF   13 TUXTLA GUTIERREZ,864,2,1,9.922710603
18690,27,1330,UMF      53 INF. BARRAN,19,7,13,10,35,10,50,52,1,2,5,5,3,3,2,1,2,1,1,1,1,1,1,1,2,1,1,1,,1,1,1,1,1,1,1,1,2,,,,2,2,1,2,1,2,2,2,2,2,2,2,1,,1,,1,,,,,,,,1,1,1,1,1,1,1,1,1,1,2,,2,,1,1,1,1,1,1,,2,1,1,1,1,,1,1,2,,,,,2,8,2,2,1,2,,,,,,,,,2,,,,,,,,SIN COMENTARIO,4,1330,27,SINALOA,1,1,UMF      53 INF. BARRAN,42,4,0.063636364,15.65205662
9542,1,4,UMF    9  AGUASCALLIENTES,22,7,13,17,21,17,40,18,1,1,5,2,2,2,2,1,5,1,1,1,1,1,1,1,1,1,1,2,2,2,2,1,1,1,1,1,1,2,,,,2,1,1,2,2,2,2,2,2,2,2,2,1,2,2,,,,,,,,,,2,1,2,2,,,,2,,,2,,2,,2,2,2,2,2,1,,2,2,1,1,1,,1,1,1,1,,,,2,8,2,2,1,2,,,,,,,,,2,,,,,,,,SIN COMENTARIO,1,4,1,AGUASCALIENTES,1,1,UMF    9  AGUASCALLIENTES,729,1,0.149446494,14.71785568
220,9,347,UMF       5 C.ANAHUAC,16,7,13,9,19,9,51,41,1,1,5,1,3,2,2,1,5,1,1,3,1,1,1,1,1,1,1,1,2,2,2,1,1,1,1,1,1,1,2,1,2,2,1,1,2,2,2,2,2,2,2,2,2,2,2,2,,,,,,,,,,,1,2,2,,,,1,2,2,2,,2,,2,2,2,2,2,1,,2,2,2,,,,,,1,1,,,,2,8,2,2,1,2,,,,,,,,,1,2,2,2,1,1,1,,SIN COMENTARIO,3,347,9,D. F. NORTE,1,1,UMF       5 C.ANAHUAC,933,2,0.165719361,45.9969476
18274,32,1578,UMF73 POZA RICA,22,7,13,11,11,11,31,49,1,1,5,5,1,2,2,1,5,1,1,1,1,1,1,1,1,1,1,1,2,2,2,1,1,1,1,1,1,1,2,1,2,1,1,1,2,1,2,2,1,2,2,2,2,1,1,1,,1,,,2,,,,,1,1,1,2,,,,1,2,1,2,,1,2,2,2,1,2,1,1,,2,2,1,1,1,,1,1,1,1,,,,1,10,2,2,1,2,,,,,,,,,1,4,3,3,3,3,3,,SIN COMENTARIO,4,1578,32,VERACRUZ NORTE,1,1,UMF73 POZA RICA,875,1,0.18037518,20.83650772
6974,7,236,UMF    79 PIEDRAS NEGRAS,16,7,13,13,33,13,49,31,2,1,5,2,5,2,1,1,6,1,1,1,1,1,1,1,2,1,1,2,,2,2,1,2,2,2,2,2,2,,,,1,2,1,2,2,2,2,2,2,2,2,2,2,,2,,,,,,,,,,,1,2,1,5,4,4,1,2,2,2,,2,,3,3,2,2,3,1,,2,2,1,1,1,,1,1,2,,,,,3,7,1,2,1,2,,,,,,,,,1,3,2,1,1,1,3,,SIN COMENTARIO,2,236,7,COAHUILA,1,1,UMF    79 PIEDRAS NEGRAS,1005,1,0.193418014,24.64149387
12067,26,1252,UMF   45 SAN LUIS POTOSI,18,7,13,16,19,16,32,53,1,2,3,5,2,2,2,1,6,1,1,3,1,1,1,1,2,1,2,2,,2,,1,1,1,1,1,1,1,1,2,2,2,2,1,2,2,2,1,2,2,2,2,2,1,,2,,,,2,,,,,,2,1,1,2,,,,1,4,3,1,2,1,1,2,3,3,2,2,1,,2,2,1,2,2,4,1,2,1,2,2,,,4,7,2,2,1,2,,,,,,,,,1,1,1,2,2,2,1,,SIN COMENTARIO,4,1252,26,SAN LUIS POTOS�,1,1,UMF   45 SAN LUIS POTOSI,1164,2,1,12.50506875
19869,4,95,UMF 12 CD. DEL CARMEN,23,7,13,11,50,12,3,21,2,1,8,2,3,3,3,1,36,1,97,,1,1,2,2,2,1,2,,,3,,3,1,1,1,2,1,2,,,,2,1,1,2,2,2,1,2,2,2,2,1,1,2,3,,,,2,,,,,2,2,1,1,2,,,,1,2,2,1,2,2,,2,4,3,2,2,1,,2,2,1,99,1,,1,1,2,,,,,2,7,2,2,1,2,,,,,,,,,2,,,,,,,2,"DEBEN DE TENER LA AMABILIDAD DE ATENDER A LA GENTE, ADMINISTRATIVOS, MEDICOS ENFERMEROS EN GENERAL DE TODOS",1,95,4,CAMPECHE,1,1,UMF 12 CD. DEL CARMEN,591,1,0.282639885,4.17117686
13038,14,625,HGZMF  2 IRAPUATO,22,7,13,15,7,15,23,32,1,2,7,5,3,2,2,1,36,1,1,1,1,1,1,1,1,1,1,2,2,1,2,1,1,1,1,1,2,2,,,,1,1,1,2,1,2,1,2,2,2,2,2,1,1,1,,2,,2,,,,,,2,1,2,1,2,2,4,1,1,2,2,,2,,4,2,3,2,2,1,,2,1,1,1,1,,1,1,1,1,,,,1,8,2,2,1,2,,,,,,,,,2,,,,,,,,SIN COMENTARIO,2,625,14,GUANAJUATO,1,1,HGZMF  2 IRAPUATO,1514,1,0.166758454,21.42509359
8965,14,636,UMF      40 VILLAGRAN,23,7,13,19,30,19,45,51,1,2,3,5,99,2,2,1,2,1,1,1,1,1,1,1,2,1,1,2,,2,2,1,1,1,1,1,2,1,2,4,2,2,1,1,2,2,2,2,2,2,2,2,2,1,2,2,,,,,,,,,,2,1,2,2,,,,1,2,4,2,,2,,4,2,2,4,5,1,,2,1,1,1,1,,1,1,1,1,,,,2,8,2,2,2,2,,,,,,,,,2,,,,,,,,SIN COMENTARIO,4,636,14,GUANAJUATO,1,1,UMF      40 VILLAGRAN,209,2,0.071821306,22.82898584
18215,33,1646,UMF      61 CORDOBA,24,7,13,16,30,16,55,25,2,1,5,2,3,2,2,1,5,1,1,2,2,3,1,1,2,1,1,3,,2,2,3,1,1,2,1,1,2,,,,2,1,1,2,2,2,2,2,2,2,2,2,1,2,2,,,,,,,,,,2,1,2,2,,,,1,2,2,2,,2,,2,2,2,3,3,1,,2,1,1,1,1,,1,1,1,1,,,,2,7,1,2,2,2,,,,,,,,,2,,,,,,,,SIN COMENTARIO,1,1646,33,VERACRUZ SUR,1,1,UMF      61 CORDOBA,777,1,0.291229385,9.370177593
13700,24,1205,UMF      15 QUERETARO,19,7,13,19,18,19,34,41,2,2,7,4,3,2,4,1,1,1,1,1,1,1,1,1,1,1,2,2,2,2,,2,1,1,2,2,2,1,1,2,2,4,1,1,2,2,2,2,2,2,2,2,2,1,5,2,,,,,,,,,,4,1,2,2,,,,1,2,2,2,,2,,2,2,2,2,1,1,,2,1,1,1,1,,1,1,1,1,,,,2,9,2,2,3,2,,,,,,,,,2,,,,,,,,SIN COMENTARIO,3,1205,24,QUER�TARO,1,1,UMF      15 QUERETARO,674,2,0.23419041,21.77372462
602,4,1904,UMF 13 CAMPECHE,16,7,13,11,40,11,56,36,2,2,7,4,2,2,1,1,2,1,1,1,1,1,1,1,1,1,1,1,2,1,1,1,2,1,1,1,1,2,,,,1,1,1,2,1,2,1,99,2,2,2,2,1,1,1,,1,,1,,,,,,1,1,1,1,1,1,1,1,1,1,1,1,1,1,1,1,1,1,1,1,,2,2,1,1,1,,1,1,1,1,,,,1,10,2,2,3,2,,,,,,,,,1,99,2,3,2,99,99,,SIN COMENTARIO,3,1904,4,CAMPECHE,1,1,UMF 13 CAMPECHE,440,1,0.210425634,6.097429155
7934,5,110,UMF   23 TUXTLA GUTIERREZ,18,7,13,8,52,9,25,21,1,1,1,1,2,2,2,1,2,1,1,1,1,1,1,1,1,1,1,1,1,1,1,1,1,1,1,1,1,2,,,,1,1,1,2,2,1,2,2,2,1,2,2,1,1,1,,,1,,,,1,,,1,1,1,1,1,1,1,1,1,1,2,,2,,1,1,1,1,1,1,,2,2,1,1,1,,1,1,1,1,,,,1,10,2,2,3,2,,,,,,,,,2,,,,,,,2,HAY MUCHOS ASISTENTES MEDICOS Y NO SIRVEN PARA NADA.,1,110,5,CHIAPAS,1,1,UMF   23 TUXTLA GUTIERREZ,940,1,1,8.182427054
14377,8,325,UMF      16  COLIMA,23,7,13,10,1,10,13,32,1,2,5,5,2,1,1,1,2,1,1,1,1,1,2,1,1,1,1,1,1,1,1,1,1,1,1,1,2,1,2,2,2,1,1,1,2,2,2,2,2,2,2,2,2,1,1,1,,,,,,,,,,2,1,2,2,,,,1,2,2,2,,2,,4,2,2,2,2,1,,2,2,1,1,1,,1,1,1,1,,,,2,10,2,2,3,2,,,,,,,,,1,1,1,1,2,1,2,,SIN COMENTARIO,2,325,8,COLIMA,1,1,UMF      16  COLIMA,140,2,0.158371041,8.606474442
19605,25,1237,UMF    5 PUCTE RIO HONDO,25,7,13,9,10,9,22,34,2,2,4,3,2,1,1,1,5,1,2,2,1,1,1,1,2,1,1,2,,2,2,1,1,1,1,1,1,2,,,,1,1,1,2,2,2,2,2,2,2,2,2,2,2,2,,,,,,,,,,,1,3,2,,,,1,3,3,2,,2,,3,2,2,2,2,1,,2,2,2,,,,,,1,1,,,,1,10,2,2,3,2,,,,,,,,,2,,,,,,,,SIN COMENTARIO,2,1237,25,QUINTANA ROO,1,1,UMF    5 PUCTE RIO HONDO,92,2,0.089756098,13.00627627
5474,33,1648,HGZMF   32 MINATITLAN,16,7,13,11,3,11,20,40,1,2,2,5,99,2,2,1,5,1,2,1,1,1,1,1,2,1,1,2,,1,1,2,1,1,1,1,1,2,,,,2,1,1,2,2,2,2,2,2,2,2,2,1,1,1,,,,,,,,,,1,1,1,1,2,2,4,1,2,2,2,,2,,1,1,1,1,1,1,,2,2,1,1,1,,1,1,1,1,,,,2,10,2,2,3,2,,,,,,,,,1,2,2,2,3,3,3,,SIN COMENTARIO,3,1648,33,VERACRUZ SUR,1,1,HGZMF   32 MINATITLAN,406,1,0.152173913,15.61877175
7536,2,37,UMFH    13 SAN QUINTIN,19,7,13,9,52,10,15,37,2,2,1,3,1,2,2,1,6,1,97,,3,,99,1,2,1,2,99,,99,,99,1,1,1,2,1,2,,,,2,1,1,2,2,2,2,2,2,2,2,2,2,2,2,,,,,,,,,,,1,2,2,,,,1,1,1,2,,2,,2,2,2,2,2,1,,2,1,1,1,1,,1,1,97,,,,,2,8,99,99,3,2,,,,,,,,,1,99,2,4,99,99,99,,SIN COMENTARIO,3,37,2,BAJA CALIFORNIA,1,1,UMFH    13 SAN QUINTIN,191,4,0.150393701,17.06028508
19790,4,95,UMF 12 CD. DEL CARMEN,23,7,13,14,50,15,5,26,2,2,5,2,4,3,3,1,6,1,1,1,1,1,1,1,1,1,1,1,1,1,1,1,1,1,1,1,1,2,,,,2,1,1,2,2,2,2,2,2,2,2,1,1,2,2,,,,,,,,,2,2,1,2,2,,,,1,2,2,2,,2,,2,2,2,2,2,1,,2,2,1,99,1,,1,1,2,,,,,2,7,1,1,3,2,,,,,,,,,2,,,,,,,2,QUE PONGAN ASIENTOS EN BUEN ESTADO Y QUE SEAN MAS,2,95,4,CAMPECHE,1,1,UMF 12 CD. DEL CARMEN,591,1,0.282639885,4.195865506
7044,7,236,UMF    79 PIEDRAS NEGRAS,16,7,13,18,4,18,20,57,2,3,3,3,5,2,2,1,6,1,1,1,1,1,1,1,1,1,1,1,1,2,1,2,2,1,2,1,2,2,,,,1,1,1,2,1,2,2,2,2,2,2,2,2,2,2,,2,,,,,,,,,1,2,2,,,,2,,,2,,2,,2,2,2,99,4,1,,2,2,2,,,,,,1,1,,,,2,8,2,2,3,2,,,,,,,,,1,1,1,3,2,3,3,,SIN COMENTARIO,5,236,7,COAHUILA,1,1,UMF    79 PIEDRAS NEGRAS,1005,1,0.193418014,18.16556211
15263,7,248,HGZMF   18 TORREON,25,7,13,8,50,9,3,67,2,3,2,9,3,2,2,1,6,1,1,1,1,1,1,2,1,2,1,,2,,1,1,1,1,2,2,2,2,,,,1,1,1,2,2,2,2,2,2,2,2,2,1,1,1,,,,,,,,,,2,1,4,1,2,1,3,1,2,2,2,,2,,2,5,2,2,5,1,,2,2,1,1,1,,1,1,2,,,,,2,9,2,2,3,2,,,,,,,,,1,1,3,1,3,1,1,,SIN COMENTARIO,6,248,7,COAHUILA,1,1,HGZMF   18 TORREON,279,3,0.082058824,25.02164546
9229,31,1558,UMF      37 CALPULALPAN,23,7,13,14,42,15,3,38,1,1,5,2,2,2,2,1,6,1,97,,1,1,1,1,1,1,1,2,2,1,2,1,2,2,2,1,1,1,2,3,2,2,1,1,2,2,1,2,2,2,2,2,2,2,2,2,,,1,,,,,,,,1,2,2,,,,1,2,4,2,,2,,2,4,2,2,4,99,,2,1,2,,,,,,2,,,,,2,7,2,2,3,2,,,,,,,,,1,2,2,2,2,1,3,,SIN COMENTARIO,3,1558,31,TLAXCALA,1,1,UMF      37 CALPULALPAN,135,1,0.067064083,9.522672323
19576,27,1308,HGSMF   4 NAVOLATO,19,7,13,9,30,9,45,44,1,2,5,5,2,2,2,1,1,1,2,2,1,1,1,2,2,1,2,,,2,,3,2,2,2,2,2,1,1,3,2,2,1,1,2,2,2,2,2,2,2,2,2,1,2,2,,,,,,,,,,2,1,2,2,,,,1,2,2,2,,2,,2,2,2,2,2,1,,2,1,1,1,1,,2,,1,1,,,,2,7,2,2,4,2,,,,,,,,,1,2,1,3,3,99,3,,SIN COMENTARIO,3,1308,27,SINALOA,1,1,HGSMF   4 NAVOLATO,611,2,0.176845152,19.38674404
13543,24,1203,UMF       9 DEL TINTERO,22,7,13,14,25,14,33,54,1,2,3,5,99,2,2,1,2,1,2,2,1,1,1,1,1,1,1,2,2,2,2,1,1,1,1,1,2,2,,,,2,1,1,2,2,2,1,2,2,1,2,2,1,2,2,,,,2,,,2,,,2,1,2,1,3,3,3,1,2,2,1,2,2,,3,2,2,2,2,1,,2,1,1,1,1,,1,1,1,1,,,,2,8,2,2,4,2,,,,,,,,,1,2,1,3,3,1,3,,SIN COMENTARIO,4,1203,24,QUER�TARO,1,1,UMF       9 DEL TINTERO,946,1,1,6.437600856
7046,7,236,UMF    79 PIEDRAS NEGRAS,16,7,13,18,42,18,55,41,2,2,7,2,2,2,2,1,15,1,1,1,2,1,2,1,2,1,1,2,,2,2,1,1,2,2,1,2,2,,,,2,2,1,2,2,2,2,2,2,2,2,2,1,,2,,,,,,,,,,2,1,2,2,,,,1,2,2,2,,2,,2,4,2,5,2,1,,2,2,1,1,1,,1,1,1,1,,,,4,8,2,2,4,2,,,,,,,,,2,,,,,,,,SIN COMENTARIO,3,236,7,COAHUILA,1,1,UMF    79 PIEDRAS NEGRAS,1005,1,0.193418014,25.15036961
13241,1,7,UMF    3 PABELLON ARTEAGA,24,7,13,16,14,16,34,46,1,2,3,5,2,2,1,1,1,1,1,1,1,1,1,1,1,2,1,2,2,,2,1,1,1,1,1,1,2,,,,2,1,1,2,2,2,2,2,2,2,2,2,1,2,2,,,,,,,,,,1,1,2,2,,,,1,2,1,2,,2,,2,2,2,2,2,1,,2,2,1,1,1,,1,1,1,1,,,,2,8,2,2,5,2,,,,,,,,,2,,,,,,,,SIN COMENTARIO,4,7,1,AGUASCALIENTES,1,1,UMF    3 PABELLON ARTEAGA,215,2,0.150244584,10.3261536
13243,1,7,UMF    3 PABELLON ARTEAGA,24,7,13,18,48,19,9,36,1,2,5,5,2,2,2,1,1,1,1,1,1,1,1,1,1,2,2,2,2,,,2,1,1,1,99,1,2,,,,2,1,1,2,2,2,2,2,2,2,2,2,1,2,1,,,,,,,,,,2,1,2,2,,,,1,2,2,2,,2,,2,2,1,2,1,1,,2,2,1,2,1,,1,1,2,,,,,2,9,2,2,5,2,,,,,,,,,2,,,,,,,,SIN COMENTARIO,3,7,1,AGUASCALIENTES,1,1,UMF    3 PABELLON ARTEAGA,215,2,0.150244584,13.81942934
13248,1,7,UMF    3 PABELLON ARTEAGA,24,7,13,11,44,12,1,49,1,2,9,2,3,3,3,1,1,1,2,99,2,1,1,1,1,2,2,2,2,,,2,1,1,1,1,1,2,,,,2,1,1,2,2,2,2,2,2,2,2,2,1,2,2,,,,,,,,,,2,1,2,2,,,,1,2,2,2,,2,,2,2,99,2,2,99,,2,2,2,,,,,,1,1,,,,1,8,2,2,5,2,,,,,,,,,1,2,3,3,3,3,2,,SIN COMENTARIO,4,7,1,AGUASCALIENTES,1,1,UMF    3 PABELLON ARTEAGA,215,2,0.150244584,10.3261536
15587,11,450,UMFH    13 TLAHUALLILO,23,7,13,11,30,11,46,56,1,4,2,5,2,5,5,1,1,1,2,2,2,1,1,1,1,1,1,2,2,2,2,2,1,1,1,1,2,2,,,,2,1,1,2,1,2,2,2,2,2,2,2,2,2,2,,2,,,,,,,,,1,3,2,,,,1,3,2,2,,2,,2,2,2,2,2,1,,2,2,1,1,3,999,,,2,,,,,5,5,1,1,5,2,,,,,,,,,2,,,,,,,2,"TIENEN QUE GASTAR $2300 PORQUE NUNCA ENCUENTRA SU TRATAMIENTO, MUL MAL SERVICIO, GROSERAS LAS DE LA FARMACIA",5,450,11,DURANGO,1,1,UMFH    13 TLAHUALLILO,99,4,0.076506955,10.16584777
11109,12,496,UMF      92 CD.AZTECA,23,7,13,11,2,11,15,56,2,2,3,2,3,5,2,1,1,1,3,2,1,1,1,1,1,1,2,2,2,2,,1,1,1,2,1,2,1,1,99,4,2,1,1,2,2,2,1,1,2,2,2,2,1,2,2,,,,2,2,,,,,2,1,2,2,,,,1,2,2,1,2,1,2,2,2,3,2,99,1,,2,99,1,1,1,,1,1,1,1,,,,2,8,2,2,5,2,,,,,,,,,2,,,,,,,2,TENGO UN ESTUDIO QUE ME LO TENIAN QUE HACER EN 3 MESES Y YA VAN 5 Y NO ME LO QUIEREN HACER,5,496,12,M�XICO ORIENTE,1,1,UMF      92 CD.AZTECA,1622,1,0.114000562,33.24553776
7228,21,1046,UMF       5 MONTERREY,18,7,13,16,10,16,34,52,1,2,5,5,99,2,2,1,1,1,2,2,1,1,1,1,1,1,1,1,1,1,1,1,1,1,1,1,2,1,1,4,2,1,1,1,2,1,2,2,2,2,2,2,2,1,2,2,,2,,,,,,,,1,1,2,1,2,2,2,2,,,2,,2,,1,2,2,2,2,1,,2,2,1,1,1,,1,1,1,1,,,,4,7,1,1,5,2,,,,,,,,,1,2,2,3,3,3,3,,SIN COMENTARIO,4,1046,21,NUEVO LE�N,1,1,UMF       5 MONTERREY,641,2,0.075199437,56.4680965
5229,29,1448,UMF      43 VILLAHERMOSA,17,7,13,13,42,14,15,66,1,2,3,5,99,2,2,1,1,1,3,3,1,1,1,1,1,1,1,2,2,2,2,1,2,1,2,2,2,1,1,1,2,2,1,1,2,2,2,1,2,2,2,2,2,1,2,2,,,,2,,,,,,2,1,2,2,,,,1,2,2,1,3,2,,2,2,2,2,2,1,,2,99,1,1,1,,1,1,1,1,,,,2,8,2,2,5,2,,,,,,,,,1,4,99,3,3,3,3,,SIN COMENTARIO,6,1448,29,TABASCO,1,1,UMF      43 VILLAHERMOSA,511,1,0.229972997,5.284540139
4616,30,1486,UMF      77 CD. MADERO,16,7,13,13,8,13,29,41,1,2,5,5,3,2,2,1,2,1,1,1,1,1,99,1,2,2,1,2,,,1,1,1,1,1,1,1,2,,,,2,1,2,2,2,2,2,2,2,2,2,2,1,1,,,,,,,,,,,1,1,1,2,,,,1,1,1,2,,2,,1,2,1,1,1,1,,2,99,1,2,1,,1,1,2,,,,,1,9,2,2,5,2,,,,,,,,,2,,,,,,,,SIN COMENTARIO,3,1486,30,TAMAULIPAS,1,1,UMF      77 CD. MADERO,1802,1,1,16.58904573
9587,1,4,UMF    9  AGUASCALLIENTES,22,7,13,7,51,8,10,24,1,5,3,2,2,2,2,1,2,1,1,1,1,1,1,1,1,1,1,2,2,1,1,1,1,1,1,1,1,2,,,,2,1,1,2,2,2,2,2,2,2,2,2,1,2,2,,,,,,,,,,2,1,2,1,3,2,2,1,2,2,2,,2,,1,2,1,2,2,1,,2,2,1,1,2,1,1,2,1,1,,,,2,7,1,2,5,2,,,,,,,,,1,4,3,3,3,3,3,,SIN COMENTARIO,1,4,1,AGUASCALIENTES,1,1,UMF    9  AGUASCALLIENTES,729,1,0.149446494,14.71785568
13395,1,6,UMF    6 JESUS MARIA,23,7,13,11,31,11,48,56,2,2,5,2,3,2,99,1,2,1,1,1,1,1,1,1,1,2,2,2,1,,,1,1,1,1,1,1,1,1,1,2,2,1,1,2,2,2,2,2,2,2,2,2,1,2,1,,,,,,,,,,1,1,2,1,2,1,2,1,2,2,2,,2,,2,1,1,1,2,1,,2,2,1,1,1,,1,1,1,1,,,,1,9,2,2,5,2,,,,,,,,,1,2,2,2,3,3,3,,SIN COMENTARIO,5,6,1,AGUASCALIENTES,1,1,UMF    6 JESUS MARIA,384,2,0.268343816,8.686496454
13224,1,7,UMF    3 PABELLON ARTEAGA,24,7,13,19,51,20,7,46,1,2,5,5,2,3,3,1,2,1,1,1,1,1,1,1,1,1,1,2,2,3,3,1,1,1,2,1,2,2,,,,2,1,2,1,2,2,2,1,2,2,2,2,2,2,,2,,,,2,,,,,,1,2,2,,,,1,2,3,2,,2,,2,2,2,2,2,99,,2,2,1,1,1,,1,1,1,2,2,,,2,8,2,1,5,2,,,,,,,,,1,4,2,2,2,2,3,,SIN COMENTARIO,4,7,1,AGUASCALIENTES,1,1,UMF    3 PABELLON ARTEAGA,215,2,0.150244584,10.3261536
2413,2,18,UMF  27 TIJUANA,16,7,13,11,10,11,33,34,1,6,5,2,2,2,2,1,2,1,99,1,1,1,1,1,2,1,2,2,,2,,99,1,1,1,1,2,2,,,,2,1,1,2,2,2,2,2,2,2,1,2,1,1,1,,,,,,,,2,,4,1,2,1,2,2,2,1,2,2,2,,2,,2,4,2,4,99,1,,2,1,1,1,1,,1,1,2,,,,,2,8,1,1,5,2,,,,,,,,,1,2,1,3,3,99,1,,SIN COMENTARIO,2,18,2,BAJA CALIFORNIA,1,1,UMF  27 TIJUANA,1888,1,1,18.46715255
6998,7,236,UMF    79 PIEDRAS NEGRAS,16,7,13,10,43,10,58,54,1,4,5,11,1,3,2,1,2,1,2,1,1,1,1,1,2,1,1,1,,1,1,1,1,1,1,1,2,2,,,,2,1,1,2,2,2,2,2,2,2,2,2,1,2,2,,,,,,,,,,2,1,1,2,,,,1,1,1,2,,2,,5,2,2,2,2,1,,2,1,1,1,1,,1,1,2,,,,,3,5,1,1,5,2,,,,,,,,,1,3,1,1,2,99,3,,SIN COMENTARIO,4,236,7,COAHUILA,1,1,UMF    79 PIEDRAS NEGRAS,1005,1,0.193418014,21.09667865
15269,7,248,HGZMF   18 TORREON,25,7,13,18,33,18,46,44,1,1,7,5,3,2,2,1,2,1,1,1,1,3,1,1,97,1,1,1,,2,2,1,1,1,2,1,2,1,1,4,2,2,1,1,2,2,2,2,2,2,2,2,2,1,3,1,,,,,,,,,,2,1,1,2,,,,1,2,4,2,,2,,4,4,4,4,4,1,,2,1,1,1,1,,1,1,1,1,,,,2,10,2,2,5,2,,,,,,,,,2,,,,,,,,SIN COMENTARIO,3,248,7,COAHUILA,1,1,HGZMF   18 TORREON,279,3,0.082058824,32.98068552
3703,10,388,UMF     7 CALZ. TLALPAN,18,7,13,10,48,11,4,80,1,1,5,5,3,5,5,1,2,1,3,3,2,3,1,1,1,2,2,2,2,,,3,1,1,1,1,1,2,,,,1,1,1,2,2,2,2,2,2,2,2,2,1,2,2,,,,,,,,,,2,1,2,2,,,,1,1,2,2,,2,,2,2,2,1,4,1,,2,2,1,1,1,,1,1,1,1,,,,2,0,1,2,5,2,,,,,,,,,2,,,,,,,,SIN COMENTARIO,6,388,10,D. F. SUR,1,1,UMF     7 CALZ. TLALPAN,1877,1,0.179686004,18.02763808
16182,13,571,UMF      61 NAUCALPAN,26,7,13,15,16,15,30,58,1,2,2,4,3,3,3,1,2,1,1,1,1,1,1,1,1,1,1,2,2,2,2,1,1,1,1,1,1,1,1,3,2,2,1,1,2,2,2,2,2,2,2,1,2,1,2,3,,,,,,,,2,,2,1,2,2,,,,1,2,2,2,,2,,2,2,2,2,3,1,,2,2,1,1,1,,1,1,2,,,,,2,8,2,2,5,2,,,,,,,,,1,1,2,2,2,2,2,,SIN COMENTARIO,5,571,13,M�XICO PONIENTE,1,1,UMF      61 NAUCALPAN,1379,1,0.243295695,11.72358976
8294,13,576,UMF       223 LERMA,22,7,13,16,30,16,49,54,1,6,3,4,1,4,2,1,2,1,2,2,1,1,2,1,2,1,2,2,,2,,1,1,1,2,2,1,1,2,5,2,2,2,2,1,2,2,2,2,2,1,2,2,1,,,2,,,,,,2,,,2,1,99,2,,,,1,2,99,2,,2,,99,2,2,99,2,99,,2,2,2,,,,,,1,1,,,,2,8,2,2,5,2,,,,,,,,,2,,,,,,,,SIN COMENTARIO,4,576,13,M�XICO PONIENTE,1,1,UMF       223 LERMA,552,2,0.107749366,26.81657222
1255,21,1034,UMF      32 V.GUADALUPE,16,7,13,9,3,9,20,61,2,2,3,4,2,2,2,1,2,1,1,1,1,1,1,1,1,1,1,2,1,2,1,1,1,1,1,1,1,2,,,,2,1,1,2,1,2,2,2,2,2,2,2,2,2,2,,2,,,,,,,,,1,1,1,1,2,1,1,1,1,99,,2,,1,2,1,1,2,1,,2,1,1,1,1,,1,1,1,1,,,,1,8,2,2,5,2,,,,,,,,,1,2,1,3,3,3,3,,SIN COMENTARIO,5,1034,21,NUEVO LE�N,1,1,UMF      32 V.GUADALUPE,1313,1,0.129538279,23.42292423
6598,25,1234,UMF      16 CANCUN,18,7,13,12,50,13,6,65,1,4,3,5,2,2,1,1,2,1,3,3,1,1,1,1,1,1,1,1,1,1,1,3,1,1,1,1,1,1,1,4,1,2,1,1,2,2,2,2,2,2,2,2,2,2,1,1,,,,,,,,,,,1,1,2,,,,1,1,1,2,,2,,1,1,1,1,1,1,,1,1,1,1,1,,1,1,2,,,,,1,8,1,1,5,2,,,,,,,,,2,,,,,,,,SIN COMENTARIO,6,1234,25,QUINTANA ROO,1,1,UMF      16 CANCUN,623,1,0.177290837,8.13937171
16487,26,1255,UMF    10 MATEHUALA,22,7,13,8,53,9,14,68,1,2,2,5,2,1,2,1,2,1,1,1,1,1,2,1,1,1,1,1,1,1,1,1,1,1,1,1,1,1,1,3,2,3,1,2,1,2,2,1,2,2,2,1,2,1,2,,2,,,2,,,,2,,2,1,2,1,2,2,5,1,2,2,1,2,1,2,2,2,2,2,5,1,,2,99,1,1,1,,1,1,1,1,,,,2,10,2,2,5,2,,,,,,,,,1,2,2,2,2,2,3,2,QUE MANTENGAN LIMPIAS LAS RAMPAS Y LIBRES DE OBSTRUCCION,6,1255,26,SAN LUIS POTOS�,1,1,UMF    10 MATEHUALA,419,4,0.210235825,10.45905508
16654,26,1260,HGSMF   9 RIO VERDE,22,7,13,13,0,13,20,20,1,2,7,5,4,1,2,1,2,1,2,2,1,1,1,1,2,1,1,2,,2,2,1,1,1,1,1,1,1,1,1,1,2,1,1,2,1,2,2,2,2,2,2,2,1,3,3,,3,,,,,,,,2,1,2,1,3,5,5,1,2,2,99,,99,,2,5,3,1,1,1,,2,1,1,1,1,,1,1,1,1,,,,2,9,2,2,5,2,,,,,,,,,1,1,3,99,3,3,3,,SIN COMENTARIO,1,1260,26,SAN LUIS POTOS�,1,1,HGSMF   9 RIO VERDE,203,5,0.210580913,15.33368645
14162,34,1743,UMFH       2 PROGRESO,24,7,13,15,7,15,19,52,1,2,2,11,4,5,5,1,2,1,3,3,1,3,1,2,2,1,2,,,2,,2,2,1,1,1,2,2,,,,2,1,1,1,1,2,1,2,2,2,1,2,1,1,1,1,1,,1,,,,1,,5,1,2,2,,,,1,2,4,2,,2,,2,5,2,2,2,1,,2,2,1,6,,,,,2,,,,,4,0,1,1,5,2,,,,,,,,,1,5,2,2,4,3,3,,SIN COMENTARIO,4,1743,34,YUCAT�N,1,1,UMFH       2 PROGRESO,281,4,0.158577878,29.75848482
13236,1,7,UMF    3 PABELLON ARTEAGA,24,7,13,14,11,14,29,40,1,2,3,5,2,1,1,1,5,1,1,1,1,1,99,1,2,1,2,1,,1,,2,1,1,1,1,1,2,,,,2,1,1,2,2,2,2,2,2,2,2,2,1,2,2,,,,,,,,,,1,1,1,1,2,1,2,1,2,2,2,,2,,2,1,1,1,1,1,,2,2,1,1,1,,1,1,1,1,,,,2,8,2,2,5,2,,,,,,,,,2,,,,,,,,SIN COMENTARIO,3,7,1,AGUASCALIENTES,1,1,UMF    3 PABELLON ARTEAGA,215,2,0.150244584,13.81942934
2468,2,18,UMF  27 TIJUANA,16,7,13,12,4,12,13,27,1,1,7,4,4,2,2,1,5,1,1,1,1,1,1,1,2,1,2,1,,1,,1,1,1,1,2,2,2,,,,2,1,1,1,1,2,2,2,2,2,2,2,1,2,2,2,2,,,,,,,,1,1,2,2,,,,1,2,2,2,,2,,2,2,2,2,2,1,,2,2,1,1,1,,1,1,1,1,,,,1,8,2,2,5,2,,,,,,,,,2,,,,,,,,SIN COMENTARIO,2,18,2,BAJA CALIFORNIA,1,1,UMF  27 TIJUANA,1888,1,1,18.46715255
8075,5,111,UMF   13 TUXTLA GUTIERREZ,17,7,13,10,47,11,3,25,1,6,7,5,2,3,3,1,5,1,1,1,1,1,1,1,2,1,2,1,,2,,1,99,1,1,2,1,1,1,2,2,1,2,1,2,1,2,1,2,1,1,1,2,1,,1,,2,,1,,2,2,2,,1,1,1,1,2,1,2,1,2,2,1,2,2,,2,1,1,2,3,1,,2,1,1,1,1,,1,1,1,1,,,,2,8,2,2,5,2,,,,,,,,,1,2,2,3,3,2,2,,SIN COMENTARIO,1,111,5,CHIAPAS,1,1,UMF   13 TUXTLA GUTIERREZ,864,2,1,9.025042946
8539,13,572,UMF       222 TOLUCA,22,7,13,15,34,15,44,29,1,2,4,1,3,3,3,1,5,1,1,1,1,1,1,1,2,1,2,2,,2,,2,1,1,1,2,1,2,,,,2,1,1,2,2,2,1,2,2,2,2,2,1,2,2,,,,2,,,,,,2,1,1,2,,,,1,3,3,2,,2,,3,3,3,2,2,1,,2,1,1,1,1,,1,1,1,1,,,,2,9,2,2,5,2,,,,,,,,,2,,,,,,,,SIN COMENTARIO,2,572,13,M�XICO PONIENTE,1,1,UMF       222 TOLUCA,1140,1,0.201129146,16.80961291
5562,17,763,UMF      54 TLAQUEPAQUE,19,7,13,14,25,14,41,40,2,6,4,5,4,4,4,1,5,1,1,1,1,1,2,1,2,1,2,2,,2,,1,1,2,2,1,2,1,2,1,2,2,1,2,2,2,2,2,2,2,2,1,2,1,2,,,,,,,,,2,,2,1,2,2,,,,1,2,2,2,,1,2,2,2,2,2,4,1,,2,2,1,1,1,,2,,2,,,,,4,9,1,1,5,2,,,,,,,,,2,,,,,,,,SIN COMENTARIO,3,763,17,JALISCO,1,1,UMF      54 TLAQUEPAQUE,618,2,0.086336966,59.98304385
472,17,779,UMF      79 GUADALAJARA,17,7,13,18,58,19,10,27,2,2,6,2,5,2,2,1,5,1,1,1,2,1,1,1,2,1,1,2,,1,1,3,2,1,1,1,1,2,,,,2,1,1,2,1,2,2,2,1,2,2,2,1,1,1,,1,,,,2,,,,1,1,2,2,,,,1,2,1,2,,2,,99,99,99,99,99,1,,2,1,1,1,1,,2,,2,,,,,2,5,2,1,5,2,,,,,,,,,2,,,,,,,2,FALTA MEDICAMENTO Y LIMPIEZA EN LOS BA�OS,2,779,17,JALISCO,1,1,UMF      79 GUADALAJARA,240,3,0.050611556,44.65246682
7057,20,1000,UMF      25 TEPIC,17,7,13,15,47,16,3,48,2,2,5,1,3,2,2,1,5,1,2,2,1,1,1,2,2,1,2,,,2,,2,1,1,1,1,2,2,,,,2,1,1,2,2,2,2,2,2,2,1,2,1,2,2,,,,,,,,2,,2,1,2,2,,,,1,2,4,2,,2,,3,4,2,2,4,1,,2,2,1,1,1,,2,,1,1,,,,2,9,2,2,5,2,,,,,,,,,1,3,3,3,2,2,3,,SIN COMENTARIO,4,1000,20,NAYARIT,1,1,UMF      25 TEPIC,433,2,0.234815618,6.690496003
4691,30,1486,UMF      77 CD. MADERO,16,7,13,20,33,20,58,31,1,2,7,5,3,3,3,1,5,1,2,3,1,1,2,1,97,1,2,2,,1,,2,2,1,1,2,2,2,,,,3,2,1,2,1,2,2,2,1,2,2,2,1,,2,,2,,,,2,,,,1,1,1,1,2,2,1,1,1,2,2,,2,,1,2,3,2,2,99,,2,1,2,,,,,,1,1,,,,2,8,2,2,5,2,,,,,,,,,1,3,2,3,3,3,3,,SIN COMENTARIO,2,1486,30,TAMAULIPAS,1,1,UMF      77 CD. MADERO,1802,1,1,16.72674001
357,32,1576,UMF      57 VERACRUZ,17,7,13,15,15,15,29,24,2,1,7,4,1,2,2,1,5,1,2,2,1,1,2,2,2,1,2,,,2,,2,2,1,2,2,2,2,,,,2,1,1,2,2,2,2,2,2,2,2,2,1,2,2,,,,,,,,,,1,1,2,1,2,5,5,1,2,99,2,,2,,2,2,2,1,5,1,,2,2,1,1,1,,1,1,2,,,,,1,6,2,2,5,2,,,,,,,,,2,,,,,,,,SIN COMENTARIO,1,1576,32,VERACRUZ NORTE,1,1,UMF      57 VERACRUZ,1324,1,0.272933416,15.68611535
19833,4,95,UMF 12 CD. DEL CARMEN,23,7,13,12,45,12,55,49,2,2,1,10,3,1,2,1,6,1,1,1,1,1,1,1,2,1,1,1,,1,1,1,1,1,1,1,1,2,,,,1,1,1,2,2,2,2,2,2,2,2,2,1,1,1,,,,,,,,,,1,1,1,2,,,,1,2,2,2,,2,,2,5,2,2,1,1,,2,1,1,1,1,,1,1,1,1,,,,2,7,2,2,5,2,,,,,,,,,2,,,,,,,,SIN COMENTARIO,4,95,4,CAMPECHE,1,1,UMF 12 CD. DEL CARMEN,591,1,0.282639885,4.383476779
20658,5,112,UMF      11  TAPACHULA,22,7,13,16,2,16,36,63,1,4,5,5,2,2,3,1,6,1,2,2,1,2,1,1,1,1,1,2,3,3,3,2,1,1,1,1,1,2,,,,2,1,1,2,1,2,2,2,2,2,2,2,1,2,2,,1,,,,,,,,2,1,3,2,,,,1,2,3,2,,2,,3,3,4,2,3,1,,2,1,1,1,1,,1,1,1,1,,,,2,9,2,2,5,2,,,,,,,,,1,3,2,99,99,99,99,2,QUE CONSTRUYAN OTRA UNIDAD PORQUE ESTAMOS MUY AMONTONADOS,5,112,5,CHIAPAS,1,1,UMF      11  TAPACHULA,754,3,1,8.318718306
17134,5,113,HGZMF   1 TAPACHULA,23,7,13,9,15,9,30,62,1,4,2,5,99,2,2,1,6,1,2,3,1,1,1,1,2,1,1,2,,1,1,2,1,1,2,2,2,2,,,,2,1,1,2,1,2,2,2,2,2,2,2,1,2,1,,2,,,,,,,,1,1,2,2,,,,1,2,2,2,,2,,1,2,2,2,2,1,,2,2,1,1,1,,1,1,1,1,,,,2,8,2,2,5,2,,,,,,,,,2,,,,,,,,SIN COMENTARIO,5,113,5,CHIAPAS,1,1,HGZMF   1 TAPACHULA,325,4,0.267489712,6.61966974