folio,deleg,unidmed,id_unid,fecha_d,fecha_m,fecha_a,hr_ini_h,hr_ini_m,hr_fin_h,hr_fin_m,edad,sexo,edocivi,escolar,ocupa,ingreso,sat1,sat3,cons_mf,mot_cons1,frecmf,probsal_g,probsal,tmtotal,tmedico,citapre,hrcita,tdifcons,citatel,retro,caqod,btratou,preosad,tmsalud,mhclinco,expclaa_a,expclaa_b,expclaa_c,expclaa_d,expclab_a,expclab_b,expclab_c,expclab_d,mopin,explora,prevasis_a,prevasis_b,prevasis_c,prevmed_a,calfatna_a,calfatna_b,calfatna_c,calfatna_d,calfatna_e,calfatna_f,calfatna_g,calfatna_h,calfatna_i,calfatna_j,calfatna_k,calfatna_l,calfatna_m,calfatnb_a,calfatnb_b,calfatnb_c,calfatnb_d,calfatnb_e,calfatnb_f,calfatnb_g,calfatnb_h,calfatnb_i,calfatnb_j,calfatnb_k,calfatnb_l,calfatnb_m,filtrosaux,saduni,temsad,satlarx,calfinma_a,calfinmb_a1,calfinma_b,calfinmb_b1,calfinmb_b2,calfinmb_b3,calfinma_c,calfinmb_c1,calfinmb_c2,calfinma_d,calfinmb_d1,calfinma_e,calfinmb_e1,calfinmb_f,calfinmb_g,calfinmb_h,calfinmb_i,calfinmb_j,recomuni,norecom,corrup,atn1fam,filtrofarm,tfarsurt,totmed,acnomed,versurt,versurt2,farm1,farm2,farm5,farm6,farm6_r,satmed,sat2,opelec_a,opelec_b,opelec_c,prefeserv,filtroaten,otroserv,mot_otro,probsal2,probsal2_g,trat_otro,tmp_otro,sat_otro,mej_serv,info_sp,sat_sp,trato_sp,tmed_sp,prep_sp,inst_sp,med_sp,coment,coment_t,edad_fin,id_Unidad,Cve_Delegaci�n,Delegaci�n,Nivel,Unidad,promedio_diario2012,estrato,MOSCondia,FE_FinalNR
1446,1,UMF    10 C/UMAA 1  AGS,3,18,7,13,15,34,15,55,64,1,6,2,5,2,2,2,2,1,2,1,1,1,1,2,,,,1,2,2,1,1,1,1,1,1,1,2,2,2,1,1,1,2,2,2,1,1,1,2,2,2,2,2,1,2,2,2,2,2,2,2,,,,,,1,,,,,,1,1,1,2,1,2,2,,,,1,3,3,2,,2,,2,3,2,3,3,1,,2,1,1,2,1,,1,1,1,1,,,,2,7,2,2,2,6,2,,,,,,,,,2,,,,,,,,SIN COMENTARIO,5,3,1,AGUASCALIENTES,1,UMF    10 C/UMAA 1  AGS,1248,1,0.255842558,9.732968804
1473,1,UMF    10 C/UMAA 1  AGS,3,18,7,13,12,12,12,31,58,1,2,4,5,2,2,2,2,1,2,1,1,1,1,1,1,,99,1,1,2,1,1,99,1,1,1,1,2,2,2,99,2,1,1,1,2,1,1,1,2,2,2,2,2,1,2,2,2,2,2,2,1,,,,,,2,,,,,,1,1,2,99,1,2,2,,,,1,2,2,2,,2,,2,99,2,2,2,1,,2,99,1,1,2,2,1,2,1,1,,,,1,8,2,99,2,6,2,,,,,,,,,2,,,,,,,,SIN COMENTARIO,5,3,1,AGUASCALIENTES,1,UMF    10 C/UMAA 1  AGS,1248,1,0.255842558,9.732968804
9541,1,UMF    9  AGUASCALLIENTES,4,22,7,13,17,0,17,17,59,1,2,1,5,2,2,2,2,1,2,1,1,1,1,1,1,,2,1,1,2,1,1,1,1,1,1,1,2,2,2,2,1,1,1,1,1,1,1,1,2,2,2,2,2,1,2,2,2,2,2,2,2,,,,,,2,,,,,,1,1,1,1,1,2,2,,,,1,2,2,2,,2,,2,2,2,1,2,1,,2,2,1,1,1,,1,1,1,1,,,,2,9,2,2,2,6,2,,,,,,,,,2,,,,,,,,SIN COMENTARIO,5,4,1,AGUASCALIENTES,1,UMF    9  AGUASCALLIENTES,729,1,0.149446494,14.59945321
13398,1,UMF    6 JESUS MARIA,6,23,7,13,12,21,12,40,44,1,4,2,2,2,2,2,2,1,2,1,1,1,1,1,1,,2,1,1,2,1,1,1,1,1,1,2,2,2,2,,1,2,1,1,1,1,1,1,2,2,2,2,2,2,2,2,2,2,2,2,2,,,,,,,,,,,,2,,,,1,2,2,,,,1,2,2,2,,2,,2,2,2,2,2,1,,2,2,2,,,,,,1,1,,,,2,9,2,1,1,6,2,,,,,,,,,2,,,,,,,,SIN COMENTARIO,3,6,1,AGUASCALIENTES,1,UMF    6 JESUS MARIA,384,2,0.268343816,9.212952891
13414,1,UMF    6 JESUS MARIA,6,23,7,13,19,23,19,42,47,1,2,5,5,2,2,2,2,1,1,1,1,1,1,1,1,,2,1,1,2,1,1,1,1,1,1,1,2,1,1,99,2,1,1,1,1,1,1,1,2,2,2,2,2,1,2,2,2,2,2,2,2,,,,,,2,,,,,,2,,,,1,2,1,4,4,4,1,2,2,2,,2,,2,2,2,2,2,1,,2,2,1,2,1,,1,1,1,1,,,,2,7,2,2,2,1,2,,,,,,,,,1,3,2,2,2,3,3,,SIN COMENTARIO,4,6,1,AGUASCALIENTES,1,UMF    6 JESUS MARIA,384,2,0.268343816,6.884102403
13241,1,UMF    3 PABELLON ARTEAGA,7,24,7,13,16,14,16,34,46,1,2,3,5,2,2,1,2,1,2,1,1,1,1,1,1,,2,1,1,2,1,1,1,1,1,2,1,2,2,,2,1,1,1,1,1,1,1,1,2,2,2,2,2,1,2,2,2,2,2,2,2,,,,,,1,,,,,,2,,,,1,2,2,,,,1,2,1,2,,2,,2,2,2,2,2,1,,2,2,1,1,1,,1,1,1,1,,,,2,8,2,2,2,5,2,,,,,,,,,2,,,,,,,,SIN COMENTARIO,4,7,1,AGUASCALIENTES,1,UMF    3 PABELLON ARTEAGA,215,2,0.150244584,10.3261536
13243,1,UMF    3 PABELLON ARTEAGA,7,24,7,13,18,48,19,9,36,1,2,5,5,2,2,2,2,1,2,1,1,1,1,1,1,,2,1,1,2,1,1,1,1,1,2,2,2,2,,,2,1,1,1,1,99,1,1,2,2,2,2,2,1,2,2,2,2,2,2,1,,,,,,2,,,,,,2,,,,1,2,2,,,,1,2,2,2,,2,,2,2,1,2,1,1,,2,2,1,2,1,,1,1,2,,,,,2,9,2,2,2,5,2,,,,,,,,,2,,,,,,,,SIN COMENTARIO,3,7,1,AGUASCALIENTES,1,UMF    3 PABELLON ARTEAGA,215,2,0.150244584,13.81942934
13245,1,UMF    3 PABELLON ARTEAGA,7,24,7,13,10,39,10,57,59,1,2,2,4,2,2,2,2,1,2,1,1,1,1,1,1,,2,1,1,2,1,1,1,1,1,1,2,2,2,2,,1,1,1,1,1,1,1,1,2,2,2,2,2,2,2,2,2,2,2,2,2,,,,,,,,,,,,2,,,,1,2,2,,,,1,2,2,2,,2,,2,2,2,2,2,1,,2,2,1,1,1,,1,1,1,1,,,,2,9,2,2,2,6,2,,,,,,,,,2,,,,,,,,SIN COMENTARIO,5,7,1,AGUASCALIENTES,1,UMF    3 PABELLON ARTEAGA,215,2,0.150244584,10.70716356
13248,1,UMF    3 PABELLON ARTEAGA,7,24,7,13,11,44,12,1,49,1,2,9,2,3,3,3,2,1,2,1,1,1,1,1,1,,2,2,99,2,2,1,1,1,1,2,2,2,2,,,2,1,1,1,1,1,1,1,2,2,2,2,2,1,2,2,2,2,2,2,2,,,,,,2,,,,,,2,,,,1,2,2,,,,1,2,2,2,,2,,2,2,99,2,2,99,,2,2,2,,,,,,1,1,,,,1,8,2,2,2,5,2,,,,,,,,,1,2,3,3,3,3,2,,SIN COMENTARIO,4,7,1,AGUASCALIENTES,1,UMF    3 PABELLON ARTEAGA,215,2,0.150244584,10.3261536
5736,3,HGZMF 1 LA PAZ,71,16,7,13,12,20,12,38,52,2,2,7,2,4,1,1,2,1,1,1,1,1,1,1,1,,1,1,1,1,1,1,1,1,97,1,1,1,,1,1,1,1,1,1,1,1,1,1,1,2,2,2,2,2,2,2,2,2,2,1,1,1,,,,,,,,,,,1,1,7,1,1,1,2,,,,1,1,1,2,,2,,1,1,1,1,1,1,,2,2,1,1,1,,1,1,1,1,,,,1,10,2,2,2,6,2,,,,,,,,,1,99,3,3,3,3,3,,SIN COMENTARIO,4,71,3,BAJA CALIFORNIA SUR,1,HGZMF 1 LA PAZ,750,1,1,5.244812574
12190,3,HGSMF   26 CABO SAN LUCAS,72,22,7,13,14,55,15,12,47,1,2,5,2,2,1,1,2,1,2,1,1,1,1,2,,,,1,1,1,1,1,1,1,1,1,1,1,1,1,1,1,1,1,1,2,1,1,1,2,2,2,2,2,1,2,2,2,2,2,1,1,,,,,,1,,,,,,1,1,3,2,1,2,2,,,,1,2,2,2,,2,,2,2,2,2,2,1,,2,2,1,1,1,,1,1,1,1,,,,1,10,2,2,2,6,2,,,,,,,,,1,2,2,2,2,2,2,,SIN COMENTARIO,4,72,3,BAJA CALIFORNIA SUR,1,HGSMF   26 CABO SAN LUCAS,460,2,0.254565578,5.98424402
10599,3,UMF 34 LA PAZ C/UMAA,73,18,7,13,9,48,10,0,69,1,2,2,999,99,1,1,1,1,1,1,1,1,1,1,1,,2,2,2,1,1,1,1,1,2,2,2,1,,,,1,1,1,1,1,1,1,1,2,2,2,2,2,1,2,2,2,2,2,1,1,,,,,,2,,,,,,1,1,2,1,1,1,2,,,,1,1,1,2,,2,,1,1,1,1,1,1,,2,2,1,1,1,,1,1,1,1,,,,2,8,2,2,2,6,2,,,,,,,,,2,,,,,,,,SIN COMENTARIO,6,73,3,BAJA CALIFORNIA SUR,1,UMF 34 LA PAZ C/UMAA,427,2,0.236303265,5.277579323
10614,3,UMF 34 LA PAZ C/UMAA,73,18,7,13,9,32,9,45,64,2,2,5,999,99,1,1,1,1,1,1,1,1,1,1,1,,2,1,1,1,1,1,1,1,2,2,2,1,,,,1,1,1,1,1,1,1,1,2,2,2,2,2,1,2,2,2,2,2,1,1,,,,,,1,,,,,,1,1,1,1,1,1,2,,,,1,1,1,2,,2,,1,1,1,1,1,1,,2,2,1,1,1,,1,1,1,1,,,,1,10,2,2,2,6,2,,,,,,,,,2,,,,,,,,SIN COMENTARIO,5,73,3,BAJA CALIFORNIA SUR,1,UMF 34 LA PAZ C/UMAA,427,2,0.236303265,6.615458222
10661,3,UMF 34 LA PAZ C/UMAA,73,18,7,13,11,49,12,0,48,1,2,5,999,99,1,1,2,1,1,1,1,1,1,1,1,,2,2,2,1,1,1,1,1,2,2,2,1,,,,1,1,1,1,1,1,1,1,2,2,2,2,2,1,2,2,2,2,2,1,1,,,,,,1,,,,,,1,1,3,1,1,1,2,,,,1,1,1,2,,2,,1,1,1,1,1,1,,2,2,1,1,1,,1,1,1,1,,,,1,9,2,2,2,6,2,,,,,,,,,2,,,,,,,,SIN COMENTARIO,4,73,3,BAJA CALIFORNIA SUR,1,UMF 34 LA PAZ C/UMAA,427,2,0.236303265,6.482931021
10676,3,UMF 34 LA PAZ C/UMAA,73,18,7,13,8,48,9,0,41,1,6,3,999,99,2,2,2,1,6,1,1,1,1,2,,,,2,2,2,1,1,1,1,2,2,2,2,,,,1,1,1,1,1,1,1,1,2,2,2,2,2,1,2,2,2,2,2,1,1,,,,,,2,,,,,,2,,,,1,1,2,,,,1,1,1,2,,2,,1,1,1,1,1,1,,2,2,1,1,1,,1,1,1,1,,,,1,10,2,2,2,6,2,,,,,,,,,2,,,,,,,,SIN COMENTARIO,3,73,3,BAJA CALIFORNIA SUR,1,UMF 34 LA PAZ C/UMAA,427,2,0.236303265,7.12760139
10678,3,UMF 34 LA PAZ C/UMAA,73,18,7,13,18,10,18,30,79,2,2,9,999,99,1,1,1,1,1,1,1,1,1,2,,,,1,1,1,1,1,1,1,2,2,2,1,,,,1,1,1,1,1,1,1,1,2,2,2,2,2,1,2,2,2,2,2,1,1,,,,,,2,,,,,,1,2,1,1,1,1,2,,,,1,1,1,2,,2,,1,1,1,1,1,1,,2,2,1,1,1,,1,1,1,1,,,,1,10,2,2,2,6,2,,,,,,,,,2,,,,,,,,SIN COMENTARIO,6,73,3,BAJA CALIFORNIA SUR,1,UMF 34 LA PAZ C/UMAA,427,2,0.236303265,5.25067428
6858,4,HGZMF   1 CAMPECHE,94,17,7,13,9,30,9,40,53,1,2,2,5,1,2,2,2,1,1,1,1,1,1,1,1,,2,2,2,2,1,1,1,1,1,1,1,2,2,2,2,1,1,1,1,2,1,1,1,2,1,2,2,2,1,2,2,2,2,2,2,2,,2,,,,2,,,,,,1,1,2,2,1,2,1,2,2,2,1,2,2,2,,2,,2,2,2,2,2,1,,2,2,1,1,1,,1,1,1,1,,,,2,6,2,2,2,6,2,,,,,,,,,1,2,2,2,2,3,3,,SIN COMENTARIO,4,94,4,CAMPECHE,1,HGZMF   1 CAMPECHE,564,1,0.269727403,4.636113441
19858,4,UMF 12 CD. DEL CARMEN,95,23,7,13,15,37,15,45,52,2,6,2,3,3,2,2,2,1,1,1,1,1,1,1,1,,2,2,2,2,2,1,1,1,2,1,2,2,,2,,3,1,1,1,1,1,1,1,2,2,2,2,2,1,2,2,2,2,2,2,2,,,,,,2,,,,,,2,,,,1,2,2,,,,1,2,2,2,,2,,3,4,2,2,3,1,,2,1,1,1,1,,1,1,1,1,,,,2,10,2,2,2,6,2,,,,,,,,,1,4,1,3,3,3,3,,SIN COMENTARIO,4,95,4,CAMPECHE,1,UMF 12 CD. DEL CARMEN,591,1,0.282639885,4.383476779
19866,4,UMF 12 CD. DEL CARMEN,95,23,7,13,10,15,10,29,47,1,2,5,5,3,2,2,2,1,2,1,1,1,1,1,1,,2,2,2,2,1,1,1,1,1,1,1,1,1,1,1,1,1,1,2,2,1,2,1,2,1,2,1,2,1,2,2,2,2,2,,2,,2,,2,,2,,,,,,1,1,2,2,1,2,2,,,,1,2,2,1,2,2,,2,5,2,2,2,1,,2,2,1,1,1,,1,1,1,1,,,,2,9,1,2,2,6,2,,,,,,,,,2,,,,,,,2,LA VENTILACION QUE SIRVA EL CLIMA PARA NO PASAR CALOR EN LAS INSTALACIONES Y LOS BA�OS DEBEN DE SER MAS COMPLETOS Y FUNCIONEN BIEN,4,95,4,CAMPECHE,1,UMF 12 CD. DEL CARMEN,591,1,0.282639885,4.275218383
573,4,UMF 13 CAMPECHE,1904,16,7,13,16,20,16,35,19,2,1,7,6,3,2,2,2,1,4,1,1,1,1,1,1,,2,1,1,2,1,1,1,1,2,1,1,2,,2,2,1,1,2,2,2,2,1,1,2,2,1,2,2,1,2,2,2,2,2,2,2,,,2,,,2,,,,,,2,,,,1,2,2,,,,1,2,2,2,,2,,2,2,2,2,2,1,,2,1,1,1,1,,2,,1,1,,,,2,9,2,2,2,1,2,,,,,,,,,1,4,1,3,3,3,3,,SIN COMENTARIO,1,1904,4,CAMPECHE,1,UMF 13 CAMPECHE,440,1,0.210425634,5.617633352
7895,5,UMF   23 TUXTLA GUTIERREZ,110,18,7,13,9,10,9,26,69,2,2,7,9,5,2,2,2,1,2,1,1,1,1,2,,,,1,1,2,1,1,1,1,2,1,1,2,,2,2,2,2,1,1,2,1,1,1,2,2,2,2,2,1,2,2,2,2,2,2,1,,,,,,2,,,,,,2,,,,1,2,1,2,4,5,1,2,2,2,,2,,2,1,2,4,2,1,,2,2,1,1,1,,1,1,1,1,,,,2,8,2,2,2,6,2,,,,,,,,,2,,,,,,,,SIN COMENTARIO,6,110,5,CHIAPAS,1,UMF   23 TUXTLA GUTIERREZ,940,1,1,7.273129759
8071,5,UMF   13 TUXTLA GUTIERREZ,111,17,7,13,10,17,10,30,61,1,2,9,9,3,2,2,2,1,2,1,1,1,1,1,1,,2,2,2,2,1,1,1,1,2,2,1,1,,,1,2,1,1,1,1,1,2,1,1,1,2,2,2,1,1,2,2,2,2,,1,2,1,,,,2,1,,,,,1,1,4,3,1,1,2,,,,1,1,1,2,,2,,2,1,2,2,2,1,,2,1,1,1,1,,2,,1,2,1,200,1,3,9,2,2,2,6,2,,,,,,,,,1,2,2,3,3,3,3,,SIN COMENTARIO,5,111,5,CHIAPAS,1,UMF   13 TUXTLA GUTIERREZ,864,2,1,8.473177267
8077,5,UMF   13 TUXTLA GUTIERREZ,111,17,7,13,19,10,19,30,60,1,2,3,5,2,3,3,2,1,2,1,1,2,1,1,1,,2,2,2,2,1,1,1,1,2,1,1,1,,1,2,2,99,1,1,1,1,1,1,2,1,2,2,2,1,2,2,2,2,2,1,2,,1,,,,3,,,,,,1,1,3,2,1,2,1,3,4,4,1,1,2,2,,2,,2,3,2,3,3,1,,2,1,1,1,1,,1,2,1,2,1,100,1,3,8,2,1,1,6,2,,,,,,,,,1,3,2,2,3,2,3,,SIN COMENTARIO,5,111,5,CHIAPAS,1,UMF   13 TUXTLA GUTIERREZ,864,2,1,8.473177267
2236,6,UMF      47 CD.JUAREZ,152,17,7,13,15,20,15,45,72,2,4,3,9,99,2,2,2,1,2,1,1,2,1,2,,,,2,2,2,1,1,1,1,2,2,2,2,,,,2,2,1,1,1,1,1,1,1,2,2,2,2,2,1,2,2,2,2,2,2,1,,,,,,2,,,,,2,,,,1,2,1,2,4,2,1,2,2,2,,2,,3,2,2,99,2,1,,2,2,1,1,1,,1,1,1,1,,,,2,10,2,2,2,6,2,,,,,,,,,2,,,,,,,,SIN COMENTARIO,6,152,6,CHIHUAHUA,1,UMF      47 CD.JUAREZ,1248,1,0.200514139,22.24798717
3034,6,UMF      48 CD.JUAREZ,153,16,7,13,16,19,16,36,51,1,2,5,5,2,2,2,2,1,2,1,1,1,1,1,1,,2,1,1,2,1,1,1,1,1,1,1,1,2,2,2,1,1,1,1,2,1,1,1,2,2,2,2,2,2,2,2,2,2,2,1,1,,,,,,,,,,,,1,1,2,2,1,1,1,2,2,4,1,1,1,2,,2,,2,2,2,1,2,1,,2,1,1,1,1,,1,1,1,1,,,,2,7,1,2,1,6,2,,,,,,,,,1,2,3,3,3,3,3,,SIN COMENTARIO,4,153,6,CHIHUAHUA,1,UMF      48 CD.JUAREZ,1293,1,0.207744216,19.9716597
15348,6,HGZMF   23 HIDALGO PARRAL,156,24,7,13,15,47,16,2,68,1,4,2,5,3,2,2,2,1,2,1,1,2,1,2,,,,1,1,1,1,1,1,1,1,1,1,2,2,2,2,1,1,1,1,1,1,1,1,1,1,2,2,2,1,2,2,2,2,2,2,2,1,1,,,,2,,,,,,1,1,2,2,1,2,1,2,2,4,1,2,2,2,,2,,2,2,2,2,1,1,,2,1,1,1,1,,1,1,1,1,,,,2,10,2,2,2,6,2,,,,,,,,,1,5,3,3,2,2,3,,SIN COMENTARIO,6,156,6,CHIHUAHUA,1,HGZMF   23 HIDALGO PARRAL,553,2,0.134910954,21.07781203
15693,7,UMF      66  TORREON,232,25,7,13,13,10,13,24,69,1,2,3,5,5,2,2,2,1,2,1,1,2,1,1,1,,2,3,3,2,1,1,1,1,1,1,2,2,2,2,,1,1,1,2,2,2,1,1,2,1,2,2,2,1,2,2,2,1,2,2,2,,2,,,,2,,,,1,,1,1,1,2,1,2,2,,,,1,2,2,2,,2,,3,2,2,2,1,1,,2,1,1,2,1,,1,1,1,1,,,,2,10,2,2,2,6,2,,,,,,,,,1,2,3,3,3,3,3,,SIN COMENTARIO,6,232,7,COAHUILA,1,UMF      66  TORREON,1070,1,0.205927637,16.58033983
15275,7,UMF      26  AGUJITA,264,22,7,13,16,1,16,15,60,1,4,2,5,2,2,2,2,1,2,1,1,1,1,1,1,,2,1,1,2,1,1,1,1,2,1,1,2,,2,2,2,1,1,2,2,1,1,1,2,1,2,2,2,1,2,2,2,2,2,2,2,,2,,,,2,,,,,,1,2,1,2,1,2,1,2,2,2,1,1,3,2,,2,,2,2,2,2,2,1,,2,2,1,1,1,,1,1,1,1,,,,2,9,2,2,2,6,2,,,,,,,,,1,2,2,2,2,2,2,,SIN COMENTARIO,5,264,7,COAHUILA,1,UMF      26  AGUJITA,86,4,0.057067021,14.07787872
3830,8,UMF 19 COLIMA,319,18,7,13,19,0,19,7,30,1,1,5,2,99,2,2,2,1,2,1,1,1,1,1,1,,2,1,1,2,2,1,1,1,2,2,2,2,,,,2,1,1,2,2,1,1,1,2,2,2,2,2,1,2,2,2,2,2,2,2,,,,,,2,,,,,,1,1,4,2,1,2,2,,,,2,,,2,,2,,2,2,2,2,2,1,,2,2,2,,,,,,1,99,,,,2,9,2,2,2,6,2,,,,,,,,,2,,,,,,,,SIN COMENTARIO,2,319,8,COLIMA,1,UMF 19 COLIMA,531,1,0.329404467,4.79967007
3906,8,UMF 19 COLIMA,319,18,7,13,10,49,10,57,64,2,1,3,9,2,2,2,2,1,3,1,1,2,1,1,1,,2,97,,1,1,1,1,1,2,1,1,1,,1,1,1,1,1,2,2,1,1,1,2,1,2,2,2,2,2,2,2,2,2,1,1,,1,,,,,,,,,,1,1,1,1,1,2,2,,,,1,2,2,2,,2,,2,2,2,2,2,1,,2,2,1,1,1,,1,1,2,,,,,1,9,2,2,2,6,2,,,,,,,,,1,4,3,3,3,3,3,,SIN COMENTARIO,5,319,8,COLIMA,1,UMF 19 COLIMA,531,1,0.329404467,3.151053553
3983,8,UMF 19 COLIMA,319,18,7,13,18,12,18,26,32,2,1,9,10,5,1,1,2,1,2,1,1,1,1,1,1,,2,2,2,2,1,1,1,1,2,1,1,1,,1,1,2,1,1,1,2,1,1,1,2,2,2,2,2,1,2,2,2,1,2,1,1,,,,,,1,,,,1,,1,2,1,1,1,1,1,2,2,2,1,2,2,2,,2,,1,1,1,1,1,1,,2,2,1,1,2,2,1,2,1,1,,,,2,9,2,2,2,6,2,,,,,,,,,1,2,3,3,3,3,3,,SIN COMENTARIO,2,319,8,COLIMA,1,UMF 19 COLIMA,531,1,0.329404467,4.595746881
1904,9,UMF      33 ROSARIO,344,17,7,13,15,53,16,7,78,1,2,2,5,2,2,2,2,1,2,1,1,1,1,1,1,,2,2,2,2,2,2,2,1,1,1,1,2,2,2,2,1,1,1,1,2,1,1,1,2,1,2,2,2,1,2,2,2,2,2,2,2,,2,,,,2,,,,,,1,2,1,2,1,2,2,,,,1,2,2,2,,2,,2,2,2,2,2,1,,2,99,1,1,2,2,1,2,2,,,,,2,10,2,2,2,6,2,,,,,,,,,1,2,1,3,3,2,3,1,ESTOY MUY A GUSTO CON EL IMSS,6,344,9,D. F. NORTE,1,UMF      33 ROSARIO,1062,1,0.131419379,23.30024345
1910,9,UMF      33 ROSARIO,344,17,7,13,13,4,13,24,69,1,2,2,5,2,1,1,2,1,2,1,1,1,1,2,,,,1,1,2,2,1,1,1,1,1,1,2,2,1,2,1,2,1,1,2,1,1,1,2,1,2,2,2,1,2,2,2,2,2,2,2,,2,,,,2,,,,,,2,,,,1,2,1,2,2,2,1,3,3,2,,2,,2,1,2,2,2,1,,2,2,1,1,1,,1,1,2,,,,,4,8,2,2,2,6,2,,,,,,,,,1,4,1,2,3,2,99,1,BUEN  SERVICIO PARA LOS PACIENTES DEL IMSS,6,344,9,D. F. NORTE,1,UMF      33 ROSARIO,1062,1,0.131419379,23.30024345
230,9,UMF       5 C.ANAHUAC,347,16,7,13,18,45,18,59,47,1,2,8,2,2,2,2,2,1,2,1,1,1,1,1,1,,2,1,1,1,1,1,1,1,1,1,1,2,2,2,2,1,2,1,1,2,1,1,1,2,2,2,2,2,1,2,1,2,2,2,2,2,,,,,,2,,2,,,,1,1,3,2,1,2,2,,,,1,2,99,2,,2,,2,2,2,2,2,1,,2,99,1,1,1,,1,1,1,1,,,,2,9,2,2,2,6,2,,,,,,,,,1,5,3,3,3,3,3,,SIN COMENTARIO,4,347,9,D. F. NORTE,1,UMF       5 C.ANAHUAC,933,2,0.165719361,39.09228466
108,9,UMF 49 EL ARBOLILLO,358,16,7,13,11,30,11,45,33,2,6,5,2,2,2,2,2,1,2,1,1,1,2,1,1,,2,1,1,2,1,1,1,1,97,1,1,2,,1,1,1,1,1,1,1,1,1,2,1,1,2,2,1,1,2,1,2,2,2,2,,2,2,,,2,2,,2,,,,1,1,1,1,1,2,2,,,,1,2,2,2,,1,2,1,2,2,99,99,1,,2,2,1,1,1,,1,1,1,1,,,,2,8,2,2,2,6,2,,,,,,,,,1,2,1,3,2,2,3,,SIN COMENTARIO,2,358,9,D. F. NORTE,1,UMF 49 EL ARBOLILLO,507,3,0.131551635,40.87087636
3669,10,UMF     7 CALZ. TLALPAN,388,18,7,13,14,26,14,44,73,1,4,1,5,99,2,2,2,1,1,1,1,4,1,2,,,,1,1,2,1,1,99,2,1,1,1,,2,1,2,1,1,1,2,2,1,2,1,2,2,2,2,2,1,2,2,2,2,2,,2,,,,,,1,,,,,,2,,,,1,5,2,,,,1,5,3,2,,2,,5,5,99,2,4,1,,2,1,1,1,1,,1,1,1,1,,,,2,10,2,2,2,6,2,,,,,,,,,2,,,,,,,,SIN COMENTARIO,6,388,10,D. F. SUR,1,UMF     7 CALZ. TLALPAN,1877,1,0.179686004,18.02763808
3400,10,UMF      19 COYOACAN,398,19,7,13,8,40,9,0,51,1,2,5,5,3,2,2,2,1,1,1,1,1,1,2,,,,1,1,2,2,1,1,1,1,1,1,2,2,2,2,2,1,1,2,2,2,1,1,2,2,2,2,2,2,2,2,2,2,2,2,2,,,,,,,,,,,,2,,,,1,1,2,,,,1,2,2,2,,2,,2,2,2,5,99,1,,2,1,2,,,,,,1,2,1,20,1,2,8,2,2,2,6,2,,,,,,,,,2,,,,,,,2,QUE NO SEAN DESPOTAS LAS SE�ORITAS QUE RECIBEN LAS CITAS,4,398,10,D. F. SUR,1,UMF      19 COYOACAN,856,2,0.122812052,51.18821045
10981,11,UMF      44 DURANGO,442,18,7,13,16,8,16,23,52,2,2,3,2,2,1,1,2,1,2,1,1,1,1,1,1,,2,2,2,1,1,1,1,1,1,1,1,1,1,1,1,1,1,1,1,2,1,1,1,2,2,2,1,2,1,2,2,2,2,2,1,1,,,,1,,1,,,,,,2,,,,1,2,1,2,2,2,1,2,2,1,2,2,,2,2,2,2,2,1,,2,2,1,1,1,,1,1,1,99,,,,1,9,2,2,2,6,2,,,,,,,,,2,,,,,,,,SIN COMENTARIO,4,442,11,DURANGO,1,UMF      44 DURANGO,1019,1,1,11.72693971
15587,11,UMFH    13 TLAHUALLILO,450,23,7,13,11,30,11,46,56,1,4,2,5,2,5,5,2,1,2,1,1,1,1,1,2,2,2,2,2,2,2,1,1,1,1,1,1,2,2,2,2,2,1,1,1,2,1,1,1,2,1,2,2,2,2,2,2,2,2,2,2,2,,2,,,,,,,,,,2,,,,1,3,2,,,,1,3,2,2,,2,,2,2,2,2,2,1,,2,2,1,1,3,999,,,2,,,,,5,5,1,1,1,5,2,,,,,,,,,2,,,,,,,2,"TIENEN QUE GASTAR $2300 PORQUE NUNCA ENCUENTRA SU TRATAMIENTO, MUL MAL SERVICIO, GROSERAS LAS DE LA FARMACIA",5,450,11,DURANGO,1,UMFH    13 TLAHUALLILO,99,4,0.076506955,10.16584777
11109,12,UMF      92 CD.AZTECA,496,23,7,13,11,2,11,15,56,2,2,3,2,3,5,2,2,1,3,1,1,1,1,1,2,2,2,3,2,2,1,1,1,1,1,1,2,2,2,2,,1,1,1,2,2,1,1,1,2,2,2,1,1,1,2,2,2,2,2,2,2,,,,2,2,2,,,,,,1,1,99,4,1,2,2,,,,1,2,2,1,2,1,2,2,2,3,2,99,1,,2,99,1,1,1,,1,1,1,1,,,,2,8,1,2,2,5,2,,,,,,,,,2,,,,,,,2,TENGO UN ESTUDIO QUE ME LO TENIAN QUE HACER EN 3 MESES Y YA VAN 5 Y NO ME LO QUIEREN HACER,5,496,12,M�XICO ORIENTE,1,UMF      92 CD.AZTECA,1622,1,0.114000562,33.24553776
3599,12,UMF    52 CUAUTITLAN  I.,499,19,7,13,12,20,12,35,60,1,1,3,5,1,4,2,2,1,2,1,1,5,5,2,,,,2,1,1,2,1,1,1,2,1,1,1,,2,2,3,2,1,2,2,2,1,1,2,2,2,2,2,1,2,2,2,2,2,2,2,,,,,,1,,,,,,2,,,,1,2,1,2,4,4,1,4,4,2,,2,,4,2,2,2,2,1,,2,99,1,1,1,,1,1,1,1,,,,2,7,1,2,1,1,2,,,,,,,,,1,2,99,99,99,99,99,,SIN COMENTARIO,5,499,12,M�XICO ORIENTE,1,UMF    52 CUAUTITLAN  I.,1792,1,0.125948833,23.81398235
11067,12,UMF       195 CHALCO,505,23,7,13,18,29,18,57,48,2,2,5,2,2,4,4,2,1,2,1,1,3,2,1,2,2,2,2,2,2,1,1,1,1,2,1,1,2,,2,2,2,1,1,1,2,1,1,1,2,2,2,2,2,1,2,2,2,2,2,4,2,,,,,,2,,,,,,1,1,3,2,1,2,2,,,,1,2,2,2,,2,,2,2,3,2,2,1,,2,2,1,1,1,,1,1,1,1,,,,2,8,2,2,2,6,2,,,,,,,,,1,4,3,3,3,3,3,2,EL TIEMPO DE ESPERA ES DEMACIADO LARGO PARA PASAR A CONSULTA,4,505,12,M�XICO ORIENTE,1,UMF       195 CHALCO,789,2,0.07791823,68.1749216
8501,13,UMF       222 TOLUCA,572,22,7,13,11,57,12,12,47,2,6,2,9,2,2,2,2,1,2,1,1,1,1,1,1,,2,1,1,2,1,1,1,1,2,1,2,2,,2,,1,2,1,1,2,1,1,1,2,2,2,2,1,1,2,2,2,2,2,2,2,,,,,2,2,,,,,,1,2,3,2,1,2,2,,,,1,2,2,2,,2,,2,2,2,2,2,1,,2,1,1,1,1,,1,2,1,2,1,60,1,3,9,2,2,2,6,2,,,,,,,,,2,,,,,,,,SIN COMENTARIO,4,572,13,M�XICO PONIENTE,1,UMF       222 TOLUCA,1140,1,0.201129146,19.67001608
11900,13,UMF       220 TOLUCA,574,23,7,13,18,5,18,16,70,1,2,1,5,2,2,2,2,1,2,1,1,1,1,1,2,3,2,1,1,1,1,1,1,1,1,1,1,1,1,1,1,1,1,1,1,1,1,1,1,2,2,2,2,2,1,2,2,2,1,2,2,1,,,,,,2,,,,2,,1,1,3,2,1,2,2,,,,1,2,2,2,,2,,2,2,2,2,2,1,,2,2,1,1,1,,1,1,1,1,,,,2,10,2,2,2,6,2,,,,,,,,,2,,,,,,,,SIN COMENTARIO,6,574,13,M�XICO PONIENTE,1,UMF       220 TOLUCA,1012,1,0.178546224,14.02898872
8473,13,UMF       224 ZINACATEPEC,581,22,7,13,9,42,9,57,63,1,2,2,5,99,2,2,1,1,6,1,1,1,1,1,1,,2,1,1,2,2,1,1,1,1,1,2,2,2,2,,1,1,1,1,2,1,1,1,2,2,2,2,2,1,1,2,2,2,2,2,2,,,,,,2,2,,,,,1,1,1,2,1,2,2,,,,1,2,2,2,,2,,2,2,2,2,2,1,,2,1,1,1,2,2,1,2,2,,,,,2,10,2,2,2,6,2,,,,,,,,,1,4,3,3,99,99,99,,SIN COMENTARIO,5,581,13,M�XICO PONIENTE,1,UMF       224 ZINACATEPEC,507,2,0.09896545,20.97188632
11350,13,UMF 249 SANTIAGO TLAXOMUL,1959,22,7,13,18,22,18,41,54,1,3,2,5,99,2,2,2,1,1,1,1,1,1,1,1,,2,2,2,4,3,,1,1,2,1,1,3,,3,3,1,1,1,1,2,2,1,1,1,2,2,1,2,1,2,2,2,2,2,2,1,2,,,5,,2,,,,,,1,1,1,2,1,2,1,2,2,2,1,2,2,2,,2,,2,2,2,2,99,1,,2,2,2,,,,,,1,2,2,,,4,8,2,2,2,6,2,,,,,,,,,2,,,,,,,,SIN COMENTARIO,4,1959,13,M�XICO PONIENTE,1,UMF 249 SANTIAGO TLAXOMUL,451,2,0.088034355,31.92449074
9146,14,UMF      49 CELAYA,627,23,7,13,16,2,16,19,27,1,6,5,4,3,2,2,2,1,6,1,1,1,1,2,,,,2,2,2,1,1,2,1,2,2,2,2,,,,2,1,1,1,1,2,1,1,2,1,2,2,2,2,2,2,2,2,2,2,1,,2,,,,,,,,,,2,,,,1,2,2,,,,1,1,2,2,,2,,2,2,1,2,2,1,,2,1,1,1,1,,1,1,2,,,,,2,9,2,2,2,6,2,,,,,,,,,1,2,1,1,1,1,3,,SIN COMENTARIO,2,627,14,GUANAJUATO,1,UMF      49 CELAYA,1482,1,0.163233836,22.76416194
8976,14,UMF      40 VILLAGRAN,636,23,7,13,14,50,15,6,44,1,2,4,5,4,2,2,1,1,2,1,1,1,1,1,1,,1,1,1,2,2,1,1,1,1,1,1,2,2,2,2,2,1,1,1,2,1,1,1,2,2,2,1,1,2,2,2,2,2,2,2,2,,,,2,2,,,,,,,2,,,,1,2,1,1,2,1,1,2,2,2,,2,,2,2,2,2,2,1,,2,2,2,,,,,,1,2,1,98,1,2,6,2,2,2,1,2,,,,,,,,,2,,,,,,,,SIN COMENTARIO,3,636,14,GUANAJUATO,1,UMF      40 VILLAGRAN,209,2,0.071821306,27.95242293
4464,14,UMF      32 CUERAMARO,660,19,7,13,15,23,15,40,42,1,2,5,5,4,2,2,2,1,1,1,1,1,1,1,1,,1,1,1,2,1,1,1,2,2,1,2,,,1,,1,1,1,1,1,1,2,2,1,2,2,2,2,2,2,2,2,2,1,,,1,,,,,,,,,,3,2,,,,1,2,1,2,1,2,2,,,2,,2,,2,3,2,2,2,1,,2,1,2,,,,,,2,,,,,2,5,2,2,2,6,2,,,,,,,,,1,2,2,99,99,3,3,,SIN COMENTARIO,3,660,14,GUANAJUATO,1,UMF      32 CUERAMARO,42,3,0.022447889,25.67451316
13817,15,UMF       9   ACAPULCO,690,19,7,13,16,52,17,9,73,1,2,3,5,2,2,2,2,1,2,1,1,1,2,1,1,,2,1,1,2,1,1,1,1,2,1,2,2,,2,,1,1,1,1,2,1,1,1,2,2,2,2,2,1,2,2,2,2,2,1,2,,,,,,4,,,,,,2,,,,1,2,1,2,2,2,1,2,2,2,,2,,2,2,2,1,2,1,,2,1,1,4,1,,1,1,1,1,,,,2,10,2,1,1,6,2,,,,,,,,,2,,,,,,,,SIN COMENTARIO,6,690,15,GUERRERO,1,UMF       9   ACAPULCO,1539,1,1,7.366406704
9094,16,UMF      16 ACTOPAN,727,23,7,13,13,25,13,44,24,2,6,5,3,2,2,2,1,1,2,1,1,1,1,1,1,,2,99,99,3,2,1,1,1,1,1,1,2,2,1,1,1,1,1,1,1,1,1,1,2,2,2,2,2,1,2,1,2,2,2,2,2,,,,,,5,,2,,,,1,2,3,2,1,2,2,,,,1,2,2,2,,2,,2,2,2,2,2,1,,2,1,1,1,1,,1,1,2,,,,,2,8,2,2,2,6,2,,,,,,,,,1,3,2,99,99,99,99,,SIN COMENTARIO,1,727,16,HIDALGO,1,UMF      16 ACTOPAN,199,2,0.068267581,16.80632299
898,17,UMF      78 GUADALAJARA,756,16,7,13,16,17,16,30,78,1,4,2,1,99,1,1,2,1,2,1,1,1,1,1,1,,2,1,1,1,1,1,1,1,2,1,1,1,,2,1,1,1,1,1,2,2,1,1,1,2,2,2,2,2,2,2,2,2,2,1,1,1,,,,,,,,,,,2,,,,1,1,2,,,,1,1,1,2,,2,,1,1,1,1,1,1,,2,99,2,,,,,,1,1,,,,2,10,2,2,2,6,2,,,,,,,,,2,,,,,,,,SIN COMENTARIO,6,756,17,JALISCO,1,UMF      78 GUADALAJARA,965,1,0.0682027,51.96539902
491,17,UMF      79 GUADALAJARA,779,17,7,13,15,30,15,45,68,1,4,9,5,3,2,5,2,1,6,1,1,1,1,2,,,,3,2,2,2,1,1,1,1,1,1,2,2,2,2,3,1,1,1,2,1,1,1,2,2,2,2,2,1,2,2,2,1,1,2,2,,,,,,2,,,,2,2,2,,,,1,1,2,,,,1,2,1,2,,2,,1,2,2,2,4,1,,2,2,1,1,1,,1,1,2,,,,,2,8,2,2,2,6,2,,,,,,,,,2,,,,,,,,SIN COMENTARIO,6,779,17,JALISCO,1,UMF      79 GUADALAJARA,240,3,0.050611556,32.21972266
14745,18,UMF 75 MORELIA C/UMAA,899,24,7,13,18,51,19,6,67,1,2,3,6,3,2,2,2,1,2,1,1,1,1,2,,,,1,1,1,1,1,1,1,1,1,1,2,2,2,2,2,2,1,1,2,1,1,1,2,2,2,2,2,1,2,2,2,2,2,1,1,,,,,,1,,,,,,2,,,,1,2,2,,,,1,2,2,2,,2,,2,2,2,1,1,1,,2,1,1,1,2,2,1,2,1,1,,,,2,8,2,2,2,6,2,,,,,,,,,2,,,,,,,,SIN COMENTARIO,6,899,18,MICHOAC�N,1,UMF 75 MORELIA C/UMAA,1259,2,1,10.87246458
5091,18,UMF 82 ZAMORA,1944,16,7,13,9,20,9,40,56,1,2,2,5,2,1,1,2,1,1,1,1,1,1,1,1,,2,1,1,1,1,1,1,1,1,1,1,2,2,2,2,1,1,1,1,2,1,1,1,2,2,2,2,2,2,2,2,2,1,2,1,1,,,,,,,,,,1,,1,1,1,1,1,3,2,,,,1,3,2,2,,2,,3,2,2,2,3,1,,2,1,2,,,,,,1,1,,,,1,10,2,2,2,6,2,,,,,,,,,2,,,,,,,,SIN COMENTARIO,5,1944,18,MICHOAC�N,1,UMF 82 ZAMORA,752,3,0.175536881,8.966284307
1644,19,HGRMF   1 CUERNAVACA,957,16,7,13,15,59,16,19,55,2,2,2,1,3,2,2,1,1,99,1,1,1,1,1,2,2,2,97,,1,1,1,1,1,1,1,1,2,2,2,2,1,1,1,1,1,1,1,1,1,1,2,2,1,2,2,2,2,2,2,2,2,1,1,,,1,,,,,,,2,,,,1,2,2,,,,1,2,2,2,,2,,2,2,2,2,2,1,,2,2,1,6,,,,,2,,,,,2,10,2,2,2,6,2,,,,,,,,,1,4,3,3,3,3,3,,SIN COMENTARIO,5,957,19,MORELOS,1,HGRMF   1 CUERNAVACA,1045,1,1,8.52885536
1658,19,HGRMF   1 CUERNAVACA,957,16,7,13,8,36,8,54,41,1,2,2,11,3,1,2,2,1,2,1,1,4,4,1,1,,2,2,1,2,1,1,1,2,2,2,2,,,,,4,2,1,1,2,1,1,1,2,1,2,1,2,2,2,2,2,2,2,2,2,,2,,2,,,,,,,,1,1,2,1,1,1,1,1,1,1,1,2,3,1,2,1,2,2,2,2,2,3,1,,2,1,2,,,,,,1,2,1,150,1,1,8,2,2,1,6,2,,,,,,,,,1,2,2,2,2,3,99,,SIN COMENTARIO,3,957,19,MORELOS,1,HGRMF   1 CUERNAVACA,1045,1,1,9.28887793
5876,19,UMF      20 CUERNAVACA,958,18,7,13,10,12,10,35,72,2,2,3,8,2,1,1,2,1,2,1,1,1,2,2,,,,1,1,1,1,1,1,1,1,1,1,1,1,1,1,1,1,1,1,1,1,1,1,2,2,2,1,2,1,2,1,2,2,2,1,1,,,,1,,1,,1,,,,1,1,3,1,1,1,1,1,1,1,1,1,1,1,1,2,,1,1,1,1,1,1,,2,2,1,1,1,,1,1,1,1,,,,1,10,2,2,2,6,2,,,,,,,,,1,4,3,3,2,3,3,,SIN COMENTARIO,6,958,19,MORELOS,1,UMF      20 CUERNAVACA,957,2,1,8.893221729
12702,19,HGZMF   5 ZACATEPEC,960,22,7,13,12,30,12,43,68,1,3,2,5,1,2,2,1,1,6,1,1,6,5,2,,,,97,,2,1,1,1,1,1,1,1,2,2,2,1,2,1,1,1,1,1,1,1,2,1,2,1,2,1,2,2,2,2,2,2,2,,2,,2,,2,,,,,,2,,,,1,2,1,2,2,2,1,2,2,2,,2,,2,2,2,2,2,1,,2,1,1,1,1,,1,1,2,,,,,2,10,2,2,2,6,2,,,,,,,,,1,2,3,3,3,3,3,,SIN COMENTARIO,6,960,19,MORELOS,1,HGZMF   5 ZACATEPEC,475,3,0.179924242,8.291164969
7124,20,UMF      25 TEPIC,1000,18,7,13,15,10,15,25,47,1,3,1,2,2,1,1,2,1,2,1,1,6,1,2,,,,1,1,1,1,1,1,1,1,1,1,1,1,1,1,1,1,1,1,2,1,1,1,1,2,1,2,2,1,2,2,2,1,2,1,1,1,,1,,,1,,,,1,,1,2,2,2,1,1,2,,,,1,1,2,2,,2,,1,1,1,1,4,1,,2,2,1,1,1,,1,1,1,1,,,,1,10,2,2,2,6,2,,,,,,,,,2,,,,,,,,SIN COMENTARIO,4,1000,20,NAYARIT,1,UMF      25 TEPIC,433,2,0.234815618,6.552567649
1362,21,UMF      15 MONTERREY,1033,16,7,13,13,40,13,56,60,2,2,3,4,4,2,2,1,1,6,1,1,1,1,2,,,,1,1,1,3,,2,1,1,1,2,2,2,2,,1,1,1,1,2,1,2,2,1,1,2,1,2,2,2,2,2,2,2,,,2,2,,2,,,,,,,,2,,,,1,2,1,2,2,2,2,,,2,,2,,2,1,2,4,2,1,,2,1,2,,,,,,2,,,,,2,10,2,2,1,6,2,,,,,,,,,2,,,,,,,,SIN COMENTARIO,5,1033,21,NUEVO LE�N,1,UMF      15 MONTERREY,1565,1,0.154400158,24.47171188