Folio,Deleg,Id_Unid,Unidmed,Fecha_D,Fecha_M,Fecha_A,Hr_Ini_H,Hr_Ini_M,Hr_Fin_H,Hr_Fin_M,Tipopac,Edad,Edoproc,Id_Unidproc,Sat1,Sat3,Filtroch,Probsal,Especialid,Tipocons,Tespsubsec,Filtroref,Totorpase,Tiem_Esp2,Proscesoref_1,Proscesoref_2,Proscesoref_3,Proscesoref_4,Proscesoref_5,Proscesoref_6,Satprocref,Sattempref,Satdiferim,Tmedreg3,Durasis_C,Preosad,Tratocomf,Filtrosaux1,Temsad1,Temsad1a,Filtrosaux2,Temsad2,Temsad2a,Recmedhoy,Filtrofarm2,Totmed,Motnosurt,Filtrourg,Probsal_Urg,Mot_Urg,Turgtriag,Tram_Urg1,Tram_Urg_2,Calteurg,Califurg,Motcalifurg1,Motcalifurg2,Motcalifurg3,Filtrocir,Progciru,Topera,Fechaop,Suspop1,Suspop3,Suspop2,Suspop4,Motoper,Opfinsem,Infofam,Oportiff,Medciru,Medciru2,Calciru,Motcalifcir1,Motcalifcir2,Motcalifcir3,Trabsocciru,Ciclocir,Filtrohos,Tobscama,Razontesp,Infprealta,Calhosp,Motcalifhosp1,Motcalifhosp2,Motcalifhosp3,Btratou,Calfatna_A,Calfatnb_A,Calfatna_B,Calfatnb_B,Calfatna_C,Calfatnb_C,Calfatna_E,Calfatnb_E,Calfatna_F,Calfatnb_F,Calfatna_G,Calfatnb_G,Calfatna_H,Calfatnb_H,Calfatna_I,Calfatnb_I,Calfatna_J,Calfatnb_J,Calfatna_K,Calfatnb_K,Calfatna_L,Calfatnb_L,Calfatna_M,Calfatnb_M,Calfatna_N,Calfatnb_N,Saludar,Escuchar,Responder,Tiemuv,Mejoratratou,Gafet,Btratou2,Limp1,Limp2,Recomej_A,Recomej_B,Recomej_C,Sexo,Local,Escolar,Fecha,Entidad,Id_Unidad,Cve_Delegaci�N,Delegaci�N,Nivel,Unidad,Promedio_Diario2015,Estrato,Moscondia,Fe_Finalnr
11001,1,11,HGZ 1 Aaguascalientes,23,11,2016,8,42,8,49,1,41,1,2,4,4,2,,,,,,,,,,,,,,,,,,,,,1,6,1,1,6,1,2,2,,,2,,,,,,,,,,,2,,,,,,,,,,,,,,,,,,,,2,,,,,,,,2,2,,2,,2,,1,10,2,,2,,2,,2,,2,,2,,2,,1,10,2,,1,1,1,2,2,1,10,4,2,1,8,14,1,2,7,2016-11-23,1,11,1,Aguascalientes,2,HGZ 1 Aguascalientes,758,1,1.00000000000000000000,8.58175417028632000000
11002,1,11,HGZ 1 Aaguascalientes,23,11,2016,9,5,9,14,1,42,1,2,1,1,2,,,,,,,,,,,,,,,,,,,,,1,7,1,1,7,1,2,2,,,2,,,,,,,,,,,2,,,,,,,,,,,,,,,,,,,,2,,,,,,,,2,2,,2,,2,,2,,2,,1,9,2,,2,,2,,2,,2,,2,,2,,2,1,1,1,1,99,9,4,2,1,13,,2,2,5,2016-11-23,1,11,1,Aguascalientes,2,HGZ 1 Aguascalientes,758,1,1.00000000000000000000,9.88631400470786000000
11003,1,11,HGZ 1 Aaguascalientes,23,11,2016,9,29,9,39,1,56,1,2,2,2,2,,,,,,,,,,,,,,,,,,,,,1,7,1,2,,,2,2,,,2,,,,,,,,,,,2,,,,,,,,,,,,,,,,,,,,2,,,,,,,,1,2,,2,,2,,2,,2,,1,10,2,,2,,2,,2,,2,,2,,2,,1,2,2,3,2,1,10,6,,13,,,1,2,9,2016-11-23,1,11,1,Aguascalientes,2,HGZ 1 Aguascalientes,758,1,1.00000000000000000000,9.02499223061895000000
11004,1,11,HGZ 1 Aaguascalientes,23,11,2016,9,51,9,59,1,72,1,11,2,2,2,,,,,,,,,,,,,,,,,,,,,1,9,1,2,,,2,2,,,1,31,5,1,2,,1,4,3,4,,2,,,,,,,,,,,,,,,,,,,,1,6,1,1,2,,,,2,2,,2,,2,,2,,2,,1,10,2,,2,,2,,2,,2,,2,,2,,1,1,1,2,1,1,8,6,,1,14,12,2,2,5,2016-11-23,1,11,1,Aguascalientes,2,HGZ 1 Aguascalientes,758,1,1.00000000000000000000,8.75070776743550000000
11005,1,11,HGZ 1 Aaguascalientes,23,11,2016,10,10,10,17,1,43,1,2,2,2,2,,,,,,,,,,,,,,,,,,,,,1,7,1,2,,,2,2,,,2,,,,,,,,,,,2,,,,,,,,,,,,,,,,,,,,2,,,,,,,,2,2,,2,,2,,2,,2,,1,10,2,,2,,2,,2,,2,,2,,2,,2,2,1,3,1,1,10,5,1,13,,,1,1,3,2016-11-23,1,11,1,Aguascalientes,2,HGZ 1 Aguascalientes,758,1,1.00000000000000000000,8.58175417028632000000
11006,1,11,HGZ 1 Aaguascalientes,23,11,2016,10,35,10,46,1,61,1,2,2,2,1,24,3,1,,1,8,7,7,6,,,,,1,5,4,4,1,1,2,2,,,2,,,2,2,,,97,,,,,,,,,,,2,,,,,,,,,,,,,,,,,,,,2,,,,,,,,2,2,,2,,1,10,2,,2,,2,,2,,2,,2,,2,,2,,2,,2,,1,1,1,3,1,1,10,6,,12,13,,1,2,9,2016-11-23,1,11,1,Aguascalientes,2,HGZ 1 Aguascalientes,758,1,1.00000000000000000000,9.02499223061895000000
11008,1,11,HGZ 1 Aaguascalientes,23,11,2016,11,10,11,19,1,64,1,2,2,2,1,107,1,2,2,1,6,3,3,4,1,9,,,4,5,5,1,1,1,1,1,7,1,2,,,2,2,,,2,,,,,,,,,,,2,,,,,,,,,,,,,,,,,,,,2,,,,,,,,1,2,,2,,2,,2,,2,,2,,2,,2,,1,9,2,,2,,2,,2,,1,1,1,2,1,1,10,6,,45,,,1,2,9,2016-11-23,1,11,1,Aguascalientes,2,HGZ 1 Aguascalientes,758,1,1.00000000000000000000,9.02499223061895000000
11009,1,11,HGZ 1 Aaguascalientes,23,11,2016,11,28,11,34,1,44,1,7,2,2,1,16,3,2,3,1,4,99,999,,,,,,2,2,2,4,1,1,2,2,,,2,,,2,2,,,2,,,,,,,,,,,2,,,,,,,,,,,,,,,,,,,,2,,,,,,,,2,2,,2,,1,10,1,10,2,,2,,2,,2,,2,,2,,2,,2,,2,,1,1,1,4,2,1,10,2,1,13,14,,1,2,3,2016-11-23,1,11,1,Aguascalientes,2,HGZ 1 Aguascalientes,758,1,1.00000000000000000000,8.58175417028632000000
11010,1,11,HGZ 1 Aaguascalientes,23,11,2016,11,48,11,54,1,52,1,2041,2,99,1,14,6,2,4,2,1,1,7,,,,,,4,99,4,5,1,1,1,2,,,2,,,2,2,,,2,,,,,,,,,,,97,,,,,,,,,,,,,,,,,,,,2,,,,,,,,1,1,10,1,10,1,10,1,10,2,,1,1,1,10,2,,1,10,2,,1,9,2,,2,,1,1,1,3,1,1,9,6,,1,,,1,2,7,2016-11-23,1,11,1,Aguascalientes,2,HGZ 1 Aguascalientes,758,1,1.00000000000000000000,8.23958682833615000000
11011,1,11,HGZ 1 Aaguascalientes,23,11,2016,12,8,12,15,1,40,1,2,4,4,2,,,,,,,,,,,,,,,,,,,,,2,,,1,4,1,2,2,,,2,,,,,,,,,,,2,,,,,,,,,,,,,,,,,,,,2,,,,,,,,3,2,,2,,2,,2,,2,,2,,1,9,2,,2,,1,1,2,,2,,2,,1,1,1,3,3,1,8,2,2,1,,,2,2,3,2016-11-23,1,11,1,Aguascalientes,2,HGZ 1 Aguascalientes,758,1,1.00000000000000000000,9.88631400470786000000
11012,1,11,HGZ 1 Aaguascalientes,23,11,2016,12,28,12,34,1,64,32,9888,2,2,2,,,,,,,,,,,,,,,,,,,,,1,3,1,1,7,1,2,2,,,2,,,,,,,,,,,2,,,,,,,,,,,,,,,,,,,,2,,,,,,,,2,2,,2,,2,,2,,2,,1,10,1,10,2,,2,,2,,2,,2,,2,,2,1,1,5,1,1,10,6,,995,,,2,2,9,2016-11-23,1,11,1,Aguascalientes,2,HGZ 1 Aguascalientes,758,1,1.00000000000000000000,10.39693112987070000000
11013,1,11,HGZ 1 Aaguascalientes,23,11,2016,12,51,13,1,1,66,1,2,2,2,2,,,,,,,,,,,,,,,,,,,,,1,5,1,1,5,1,2,2,,,2,,,,,,,,,,,2,,,,,,,,,,,,,,,,,,,,2,,,,,,,,3,2,,2,,2,,99,,1,1,1,10,1,10,2,,2,,2,,2,,2,,2,,1,1,1,3,1,1,9,4,2,995,,,1,2,9,2016-11-23,1,11,1,Aguascalientes,2,HGZ 1 Aguascalientes,758,1,1.00000000000000000000,7.59599814859063000000
11014,1,11,HGZ 1 Aaguascalientes,23,11,2016,13,11,13,18,1,52,1,2041,2,2,1,107,6,1,,1,99,5,69,3,1,,,,2,2,2,6,1,2,2,1,1,1,1,2,1,2,2,,,2,,,,,,,,,,,2,,,,,,,,,,,,,,,,,,,,2,,,,,,,,1,2,,2,,1,9,1,9,2,,2,,2,,2,,1,9,2,,2,,2,,2,,1,1,1,2,2,1,9,3,1,1,3,,2,2,5,2016-11-23,1,11,1,Aguascalientes,2,HGZ 1 Aguascalientes,758,1,1.00000000000000000000,9.49213191587710000000
11016,1,11,HGZ 1 Aaguascalientes,23,11,2016,13,51,14,0,1,40,1,4,2,2,1,9,26,2,1,1,99,7,7,,,,,,2,4,2,1,1,2,2,2,,,2,,,1,1,1,,2,,,,,,,,,,,2,,,,,,,,,,,,,,,,,,,,2,,,,,,,,2,1,10,2,,1,10,2,,2,,2,,2,,2,,2,,2,,2,,2,,1,99,2,2,1,1,1,1,10,5,1,50,8,1,1,2,9,2016-11-23,1,11,1,Aguascalientes,2,HGZ 1 Aguascalientes,758,1,1.00000000000000000000,8.58175417028632000000
11017,1,11,HGZ 1 Aaguascalientes,23,11,2016,14,15,14,25,2,32,1,2,5,5,1,8,8,2,7,1,2,5,7,,,,,,4,4,4,6,1,1,2,2,,,2,,,1,2,,,2,,,,,,,,,,,2,,,,,,,,,,,,,,,,,,,,2,,,,,,,,4,1,8,2,,1,9,1,10,2,,2,,2,,2,,2,,2,,1,10,2,,2,,1,1,1,2,2,99,6,2,2,1,12,14,1,2,5,2016-11-23,1,11,1,Aguascalientes,2,HGZ 1 Aguascalientes,758,1,1.00000000000000000000,7.77667247650698000000
11018,1,11,HGZ 1 Aaguascalientes,23,11,2016,14,35,14,43,1,56,1,4,4,4,2,,,,,,,,,,,,,,,,,,,,,1,9,1,2,,,2,2,,,2,,,,,,,,,,,2,,,,,,,,,,,,,,,,,,,,1,4,1,1,2,,,,1,2,,1,10,2,,2,,1,5,2,,2,,2,,2,,2,,2,,2,,2,,1,1,1,2,1,1,8,5,2,2,12,,1,2,3,2016-11-23,1,11,1,Aguascalientes,2,HGZ 1 Aguascalientes,758,1,1.00000000000000000000,9.02499223061895000000
11019,1,11,HGZ 1 Aaguascalientes,23,11,2016,14,59,15,8,1,59,1,2,3,4,2,,,,,,,,,,,,,,,,,,,,,1,1,1,2,,,1,2,,,2,,,,,,,,,,,2,,,,,,,,,,,,,,,,,,,,2,,,,,,,,3,2,,2,,2,,2,,2,,1,10,2,,1,10,2,,2,,2,,2,,2,,2,2,1,1,1,1,8,4,2,1,45,,1,2,3,2016-11-23,1,11,1,Aguascalientes,2,HGZ 1 Aguascalientes,758,1,1.00000000000000000000,9.02499223061895000000
11020,1,11,HGZ 1 Aaguascalientes,23,11,2016,15,19,15,25,1,47,1,2,5,5,1,13,1,2,3,1,1,5,7,,,,,,2,2,2,6,1,1,2,2,,,2,,,2,2,,,2,,,,,,,,,,,2,,,,,,,,,,,,,,,,,,,,2,,,,,,,,2,1,8,2,,1,9,2,,2,,2,,2,,2,,2,,2,,2,,2,,2,,1,1,1,3,3,1,8,6,,8,157,,1,2,5,2016-11-23,1,11,1,Aguascalientes,2,HGZ 1 Aguascalientes,758,1,1.00000000000000000000,8.23958682833615000000
11022,1,11,HGZ 1 Aaguascalientes,23,11,2016,15,56,16,7,1,48,1,5,2,2,1,15,1,1,,2,1,5,7,,,,,,2,2,2,5,1,1,1,2,,,1,8,1,1,1,1,,1,27,5,6,2,,5,2,,,,1,3,1,1,,,,,46,1,2,2,1,1,1,,,,2,2,1,1,,1,2,,,,2,2,,2,,1,8,1,8,2,,2,,2,,2,,2,,2,,2,,2,,1,10,1,1,1,97,,99,8,99,,1,,,1,2,5,2016-11-23,1,11,1,Aguascalientes,2,HGZ 1 Aguascalientes,758,1,1.00000000000000000000,8.23958682833615000000
11023,1,11,HGZ 1 Aaguascalientes,23,11,2016,16,15,16,22,1,53,1,2,4,2,1,4,6,2,2,1,1,5,7,,,,,,2,4,4,5,2,2,1,2,,,2,,,2,2,,,2,,,,,,,,,,,2,,,,,,,,,,,,,,,,,,,,2,,,,,,,,2,1,10,2,,1,8,2,,2,,2,,2,,2,,2,,2,,2,,2,,2,,2,1,1,3,1,99,8,2,1,1,,,1,2,5,2016-11-23,1,11,1,Aguascalientes,2,HGZ 1 Aguascalientes,758,1,1.00000000000000000000,8.23958682833615000000
11024,1,11,HGZ 1 Aaguascalientes,23,11,2016,16,35,16,42,1,43,1,7,4,2,1,999,1,1,,1,1,5,14,,,,,,5,5,5,2,1,2,1,2,,,2,,,1,1,2,99,1,999,4,5,1,3,2,2,,,,2,,,,,,,,,,,,,,,,,,,,2,,,,,,,,2,2,,2,,1,8,1,4,2,,2,,2,,2,,2,,2,,2,,2,,1,8,2,1,1,3,1,1,8,2,1,1,9,,1,1,5,2016-11-23,1,11,1,Aguascalientes,2,HGZ 1 Aguascalientes,758,1,1.00000000000000000000,8.58175417028632000000
11025,1,11,HGZ 1 Aaguascalientes,23,11,2016,16,59,17,9,1,66,1,6,1,1,1,33,5,2,7,1,1,7,7,,,,,,1,1,1,2,1,1,2,2,,,2,,,1,1,1,,2,,,,,,,,,,,97,,,,,,,,,,,,,,,,,,,,2,,,,,,,,1,1,10,2,,1,10,2,,1,10,2,,2,,2,,2,,2,,2,,2,,1,10,1,1,1,5,1,1,10,1,2,13,,,2,2,2,2016-11-23,1,11,1,Aguascalientes,2,HGZ 1 Aguascalientes,758,1,1.00000000000000000000,8.75070776743550000000
11026,1,11,HGZ 1 Aaguascalientes,23,11,2016,17,25,17,31,1,55,1,2,4,4,2,,,,,,,,,,,,,,,,,,,,,2,,,2,,,2,2,,,2,,,,,,,,,,,1,2,6,1,,,,,2,2,2,2,1,1,1,,,,1,2,1,7,,1,2,,,,2,2,,2,,2,,2,,2,,2,,2,,2,,2,,2,,2,,2,,2,,1,1,1,3,2,1,8,6,,11,,,1,2,3,2016-11-23,1,11,1,Aguascalientes,2,HGZ 1 Aguascalientes,758,1,1.00000000000000000000,9.02499223061895000000
11027,1,11,HGZ 1 Aaguascalientes,23,11,2016,17,44,17,51,1,78,1,2,2,2,2,,,,,,,,,,,,,,,,,,,,,1,1,1,2,,,2,2,,,2,,,,,,,,,,,2,,,,,,,,,,,,,,,,,,,,2,,,,,,,,2,2,,2,,2,,2,,2,,1,10,2,,2,,1,10,2,,2,,2,,2,,99,1,1,1,2,2,10,6,,1,26,,2,2,9,2016-11-23,1,11,1,Aguascalientes,2,HGZ 1 Aguascalientes,758,1,1.00000000000000000000,8.75070776743550000000
11028,1,11,HGZ 1 Aaguascalientes,23,11,2016,18,6,18,14,1,41,1,2,2,2,1,24,3,1,,1,1,2,7,,,,,,2,2,2,5,2,1,2,2,,,2,,,2,2,,,2,,,,,,,,,,,2,,,,,,,,,,,,,,,,,,,,2,,,,,,,,2,2,,2,,1,9,1,9,2,,2,,2,,2,,2,,2,,2,,2,,2,,1,1,1,3,1,1,10,2,1,995,,,1,2,3,2016-11-23,1,11,1,Aguascalientes,2,HGZ 1 Aguascalientes,758,1,1.00000000000000000000,8.58175417028632000000
11029,1,11,HGZ 1 Aaguascalientes,23,11,2016,18,26,18,32,1,30,1,2041,4,4,1,17,2,1,,1,1,6,999,,,,,,4,4,5,6,2,1,2,2,,,1,99,99,2,2,,,2,,,,,,,,,,,2,,,,,,,,,,,,,,,,,,,,2,,,,,,,,2,1,7,2,,1,10,2,,2,,2,,1,7,2,,2,,2,,2,,2,,2,,2,2,2,97,,99,8,6,,1,13,,2,2,7,2016-11-23,1,11,1,Aguascalientes,2,HGZ 1 Aguascalientes,758,1,1.00000000000000000000,8.95884739750731000000
11030,1,11,HGZ 1 Aaguascalientes,23,11,2016,18,50,19,1,1,32,1,7,2,2,1,33,6,1,,1,1,2,9,,,,,,2,2,2,5,1,1,2,2,,,2,,,2,2,,,2,,,,,,,,,,,2,,,,,,,,,,,,,,,,,,,,1,7,,99,5,999,,,1,2,,2,,1,10,2,,2,,2,,2,,2,,2,,2,,2,,2,,2,,1,1,1,97,,1,10,5,2,1,13,,1,2,3,2016-11-23,1,11,1,Aguascalientes,2,HGZ 1 Aguascalientes,758,1,1.00000000000000000000,7.77667247650698000000
11031,1,11,HGZ 1 Aaguascalientes,23,11,2016,19,10,19,16,1,49,1,2,2,2,2,,,,,,,,,,,,,,,,,,,,,2,,,2,,,1,1,1,,1,18,5,1,1,999,2,1,,,,2,,,,,,,,,,,,,,,,,,,,2,,,,,,,,2,1,7,2,,1,10,1,10,2,,1,9,1,9,1,10,2,,1,10,2,,2,,1,9,2,1,1,5,1,1,10,4,2,13,9,11,1,2,5,2016-11-23,1,11,1,Aguascalientes,2,HGZ 1 Aguascalientes,758,1,1.00000000000000000000,8.23958682833615000000
11032,1,11,HGZ 1 Aaguascalientes,23,11,2016,19,29,19,35,1,48,1,2041,4,4,2,,,,,,,,,,,,,,,,,,,,,2,,,1,1,1,2,2,,,2,,,,,,,,,,,2,,,,,,,,,,,,,,,,,,,,2,,,,,,,,2,2,,2,,1,8,1,9,2,,2,,1,8,2,,2,,2,,2,,2,,2,,1,1,1,3,1,1,8,4,2,1,13,,1,2,5,2016-11-23,1,11,1,Aguascalientes,2,HGZ 1 Aguascalientes,758,1,1.00000000000000000000,8.23958682833615000000
11033,1,11,HGZ 1 Aaguascalientes,23,11,2016,19,49,19,56,2,31,1,6,2,2,1,43,8,1,,1,1,5,7,,,,,,2,2,2,6,1,1,2,2,,,2,,,2,2,,,2,,,,,,,,,,,97,,,,,,,,,,,,,,,,,,,,2,,,,,,,,2,2,,2,,1,10,2,,2,,2,,2,,2,,2,,2,,2,,2,,2,,1,1,1,97,,99,10,6,,8,9,10,1,2,7,2016-11-23,1,11,1,Aguascalientes,2,HGZ 1 Aguascalientes,758,1,1.00000000000000000000,7.77667247650698000000
11034,1,11,HGZ 1 Aaguascalientes,23,11,2016,20,9,20,15,1,28,1,2,2,2,1,61,12,2,2,1,1,1,7,,,,,,2,2,2,4,1,1,2,1,7,1,2,,,1,1,1,,2,,,,,,,,,,,2,,,,,,,,,,,,,,,,,,,,2,,,,,,,,1,1,8,2,,1,9,2,,2,,2,,2,,2,,2,,1,9,2,,2,,1,8,1,1,1,2,1,99,9,6,,1,14,,1,2,9,2016-11-23,1,11,1,Aguascalientes,2,HGZ 1 Aguascalientes,758,1,1.00000000000000000000,7.77667247650698000000
11035,1,11,HGZ 1 Aaguascalientes,23,11,2016,9,14,9,25,1,47,1,2,1,1,2,,,,,,,,,,,,,,,,,,,,,2,,,1,3,1,2,2,,,2,,,,,,,,,,,2,,,,,,,,,,,,,,,,,,,,2,,,,,,,,1,1,10,2,,2,,1,10,1,10,2,,1,10,2,,2,,2,,1,1,2,,2,,1,1,1,2,1,1,10,5,1,13,36,,1,2,5,2016-11-23,1,11,1,Aguascalientes,2,HGZ 1 Aguascalientes,758,1,1.00000000000000000000,8.23958682833615000000
11036,1,11,HGZ 1 Aaguascalientes,23,11,2016,9,38,9,49,1,45,1,2,2,2,2,,,,,,,,,,,,,,,,,,,,,1,3,1,1,3,1,2,2,,,2,,,,,,,,,,,2,,,,,,,,,,,,,,,,,,,,2,,,,,,,,2,2,,2,,2,,2,,2,,1,8,1,8,2,,2,,2,,2,,2,,2,,2,2,1,3,2,1,8,2,1,1,,,1,2,7,2016-11-23,1,11,1,Aguascalientes,2,HGZ 1 Aguascalientes,758,1,1.00000000000000000000,8.23958682833615000000
11037,1,11,HGZ 1 Aaguascalientes,23,11,2016,10,4,10,16,1,35,1,2,2,2,2,,,,,,,,,,,,,,,,,,,,,1,3,1,2,,,2,2,,,2,,,,,,,,,,,2,,,,,,,,,,,,,,,,,,,,2,,,,,,,,2,2,,1,8,2,,1,10,2,,1,10,2,,2,,2,,2,,2,,1,8,2,,2,2,1,2,2,2,8,6,,1,,,1,2,5,2016-11-23,1,11,1,Aguascalientes,2,HGZ 1 Aguascalientes,758,1,1.00000000000000000000,8.58175417028632000000
11041,1,11,HGZ 1 Aaguascalientes,23,11,2016,10,54,11,5,1,77,1,6,2,2,1,25,7,2,2,1,3,1,7,,,,,,1,2,2,4,2,1,2,2,,,2,,,1,1,1,,2,,,,,,,,,,,2,,,,,,,,,,,,,,,,,,,,2,,,,,,,,2,1,10,1,10,1,10,1,10,1,10,2,,2,,2,,2,,2,,2,,2,,1,10,2,1,1,5,2,2,10,6,,995,,,2,2,3,2016-11-23,1,11,1,Aguascalientes,2,HGZ 1 Aguascalientes,758,1,1.00000000000000000000,8.75070776743550000000
11042,1,11,HGZ 1 Aaguascalientes,23,11,2016,11,14,11,21,1,50,1,2,1,1,2,,,,,,,,,,,,,,,,,,,,,2,,,1,1,1,2,2,,,1,3,5,1,1,3,2,2,,,,1,3,1,1,,,,,1,1,4,2,1,1,2,,,,2,2,1,6,1,1,2,,,,2,1,10,2,,1,10,2,,2,,2,,2,,2,,2,,2,,1,10,2,,99,,1,1,1,1,1,1,10,6,,13,,,1,2,5,2016-11-23,1,11,1,Aguascalientes,2,HGZ 1 Aguascalientes,758,1,1.00000000000000000000,8.23958682833615000000
11043,1,11,HGZ 1 Aaguascalientes,23,11,2016,11,31,11,37,1,24,1,8,2,2,1,4,2,2,2,1,8,1,7,,,,,,2,2,2,2,1,1,2,2,,,1,1,1,2,2,,,2,,,,,,,,,,,2,,,,,,,,,,,,,,,,,,,,2,,,,,,,,2,2,,2,,2,,2,,2,,2,,2,,2,,2,,2,,2,,2,,2,,1,1,1,1,2,1,9,3,2,995,,,1,2,5,2016-11-23,1,11,1,Aguascalientes,2,HGZ 1 Aguascalientes,758,1,1.00000000000000000000,7.68018435164604000000
11044,1,11,HGZ 1 Aaguascalientes,23,11,2016,11,49,11,55,1,76,1,2,2,2,1,9,17,2,4,1,4,1,7,,,,,,2,2,2,4,2,1,2,2,,,2,,,2,2,,,2,,,,,,,,,,,2,,,,,,,,,,,,,,,,,,,,2,,,,,,,,1,1,8,2,,1,7,1,10,2,,2,,2,,2,,2,,2,,2,,2,,2,,1,1,1,2,1,1,8,6,,995,,,1,2,1,2016-11-23,1,11,1,Aguascalientes,2,HGZ 1 Aguascalientes,758,1,1.00000000000000000000,7.59599814859063000000
11045,1,11,HGZ 1 Aaguascalientes,23,11,2016,12,4,12,14,1,23,1,6,3,2,2,,,,,,,,,,,,,,,,,,,,,1,1,1,2,,,2,2,,,2,,,,,,,,,,,2,,,,,,,,,,,,,,,,,,,,2,,,,,,,,2,2,,2,,2,,2,,1,8,2,,2,,2,,2,,1,8,2,,2,,2,,2,1,1,5,2,2,7,6,,1,,,1,2,5,2016-11-23,1,11,1,Aguascalientes,2,HGZ 1 Aguascalientes,758,1,1.00000000000000000000,7.68018435164604000000
11046,1,11,HGZ 1 Aaguascalientes,23,11,2016,12,27,12,38,1,86,32,1775,3,2,2,,,,,,,,,,,,,,,,,,,,,1,3,1,1,4,1,2,2,,,2,,,,,,,,,,,2,,,,,,,,,,,,,,,,,,,,2,,,,,,,,2,2,,2,,1,10,2,,2,,1,10,1,10,2,,2,,2,,2,,2,,2,,1,1,1,2,2,1,10,2,1,13,,,2,2,3,2016-11-23,1,11,1,Aguascalientes,2,HGZ 1 Aguascalientes,758,1,1.00000000000000000000,8.75070776743550000000
11048,1,11,HGZ 1 Aaguascalientes,23,11,2016,12,52,13,0,1,74,1,5,1,2,1,35,6,1,,1,8,1,4,7,,,,,2,1,1,3,1,1,2,2,,,2,,,2,2,,,2,,,,,,,,,,,2,,,,,,,,,,,,,,,,,,,,2,,,,,,,,1,1,10,2,,1,10,2,,2,,1,10,1,10,2,,2,,2,,2,,2,,2,,1,2,1,3,1,1,10,1,1,1,,,2,2,9,2016-11-23,1,11,1,Aguascalientes,2,HGZ 1 Aguascalientes,758,1,1.00000000000000000000,8.75070776743550000000
11049,1,11,HGZ 1 Aaguascalientes,23,11,2016,13,15,13,25,1,57,1,8,2,2,2,,,,,,,,,,,,,,,,,,,,,97,,,1,1,1,2,2,,,2,,,,,,,,,,,2,,,,,,,,,,,,,,,,,,,,2,,,,,,,,2,2,,2,,2,,2,,2,,1,10,1,10,2,,2,,2,,2,,2,,2,,2,1,1,5,2,1,10,1,1,995,,,2,2,1,2016-11-23,1,11,1,Aguascalientes,2,HGZ 1 Aguascalientes,758,1,1.00000000000000000000,10.39693112987070000000
11050,1,11,HGZ 1 Aaguascalientes,23,11,2016,13,32,13,44,1,32,1,10,1,1,1,26,13,2,6,1,8,99,4,,,,,,2,2,2,5,1,1,2,2,,,2,,,2,2,,,2,,,,,,,,,,,2,,,,,,,,,,,,,,,,,,,,2,,,,,,,,1,1,10,2,,1,10,1,10,2,,2,,2,,2,,2,,2,,2,,2,,2,,99,1,1,5,2,2,10,5,1,13,,,1,2,5,2016-11-23,1,11,1,Aguascalientes,2,HGZ 1 Aguascalientes,758,1,1.00000000000000000000,7.77667247650698000000
11051,1,11,HGZ 1 Aaguascalientes,23,11,2016,13,49,13,56,1,47,1,8,1,2,1,16,4,2,2,1,8,2,4,7,,,,,2,2,2,4,1,1,2,2,,,2,,,1,1,1,,2,,,,,,,,,,,2,,,,,,,,,,,,,,,,,,,,2,,,,,,,,2,1,10,2,,1,10,1,9,2,,2,,2,,2,,2,,2,,2,,2,,1,10,1,1,1,1,1,1,10,2,1,995,,,1,2,5,2016-11-23,1,11,1,Aguascalientes,2,HGZ 1 Aguascalientes,758,1,1.00000000000000000000,8.23958682833615000000
11052,1,11,HGZ 1 Aaguascalientes,23,11,2016,14,9,14,19,1,24,1,5,2,2,2,,,,,,,,,,,,,,,,,,,,,2,,,1,3,1,2,2,,,2,,,,,,,,,,,2,,,,,,,,,,,,,,,,,,,,1,1,,1,2,,,,2,1,10,2,,2,,1,10,2,,2,,2,,2,,2,,2,,2,,2,,2,,1,1,1,1,1,1,10,4,1,995,,,2,2,4,2016-11-23,1,11,1,Aguascalientes,2,HGZ 1 Aguascalientes,758,1,1.00000000000000000000,8.84769158004012000000
11053,1,11,HGZ 1 Aaguascalientes,23,11,2016,14,30,14,37,1,50,1,6,4,5,2,,,,,,,,,,,,,,,,,,,,,2,,,1,6,2,2,2,,,1,14,5,6,1,3,5,3,15,,,2,,,,,,,,,,,,,,,,,,,,1,1,,2,4,16,,,5,2,,2,,2,,2,,1,1,1,1,2,,2,,2,,2,,2,,2,,2,,2,2,2,1,2,1,1,4,1,1,,,1,2,3,2016-11-23,1,11,1,Aguascalientes,2,HGZ 1 Aguascalientes,758,1,1.00000000000000000000,8.23958682833615000000
11056,1,11,HGZ 1 Aaguascalientes,23,11,2016,15,6,15,16,1,32,1,9,2,2,2,,,,,,,,,,,,,,,,,,,,,1,2,1,2,,,2,2,,,2,,,,,,,,,,,2,,,,,,,,,,,,,,,,,,,,2,,,,,,,,2,2,,1,9,2,,2,,2,,2,,2,,2,,2,,2,,2,,2,,2,,1,1,1,1,2,1,9,2,2,995,,,1,2,7,2016-11-23,1,11,1,Aguascalientes,2,HGZ 1 Aguascalientes,758,1,1.00000000000000000000,7.77667247650698000000
11058,1,11,HGZ 1 Aaguascalientes,23,11,2016,15,33,15,41,1,65,1,2,1,1,2,,,,,,,,,,,,,,,,,,,,,1,1,1,2,,,2,2,,,2,,,,,,,,,,,2,,,,,,,,,,,,,,,,,,,,2,,,,,,,,2,2,,2,,2,,2,,2,,2,,2,,2,,2,,2,,2,,2,,2,,1,1,1,1,2,99,10,2,2,13,,,1,2,2,2016-11-23,1,11,1,Aguascalientes,2,HGZ 1 Aguascalientes,758,1,1.00000000000000000000,7.59599814859063000000
11060,1,11,HGZ 1 Aaguascalientes,23,11,2016,16,9,16,18,1,38,1,2,5,5,2,,,,,,,,,,,,,,,,,,,,,2,,,1,1,1,1,1,1,,2,,,,,,,,,,,2,,,,,,,,,,,,,,,,,,,,2,,,,,,,,5,2,,2,,2,,2,,2,,2,,1,9,2,,2,,2,,2,,2,,1,1,1,1,1,1,3,1,5,2,2,9,10,7,1,1,5,2016-11-23,1,11,1,Aguascalientes,2,HGZ 1 Aguascalientes,758,1,1.00000000000000000000,8.58175417028632000000
11061,1,11,HGZ 1 Aaguascalientes,23,11,2016,16,29,16,35,1,55,1,5,4,2,1,17,11,1,,2,8,7,7,4,,,,,2,5,4,4,2,1,2,2,,,2,,,2,2,,,2,,,,,,,,,,,2,,,,,,,,,,,,,,,,,,,,2,,,,,,,,2,1,8,2,,1,10,2,,1,10,2,,2,,2,,2,,2,,2,,2,,2,,2,1,1,5,1,1,10,3,1,9,,,1,2,3,2016-11-23,1,11,1,Aguascalientes,2,HGZ 1 Aguascalientes,758,1,1.00000000000000000000,9.02499223061895000000
11062,1,11,HGZ 1 Aaguascalientes,23,11,2016,16,43,16,51,1,54,1,5,2,1,1,114,29,2,4,1,8,7,4,7,,,,,2,2,4,3,2,2,2,1,2,1,1,2,1,2,2,,,2,,,,,,,,,,,2,,,,,,,,,,,,,,,,,,,,2,,,,,,,,2,1,4,2,,1,9,1,10,2,,2,,2,,2,,2,,2,,2,,2,,2,,2,1,1,1,2,99,10,2,1,1,,,1,2,7,2016-11-23,1,11,1,Aguascalientes,2,HGZ 1 Aguascalientes,758,1,1.00000000000000000000,8.23958682833615000000
11063,1,11,HGZ 1 Aaguascalientes,23,11,2016,17,0,17,10,1,55,1,7,4,3,1,177,5,2,7,2,8,7,999,,,,,,2,2,2,4,2,1,2,2,,,2,,,2,2,,,2,,,,,,,,,,,2,,,,,,,,,,,,,,,,,,,,2,,,,,,,,2,1,8,2,,1,10,1,10,2,,2,,2,,2,,2,,2,,2,,2,,2,,1,1,1,5,1,1,10,2,1,15,,,1,2,5,2016-11-23,1,11,1,Aguascalientes,2,HGZ 1 Aguascalientes,758,1,1.00000000000000000000,9.02499223061895000000
11065,1,11,HGZ 1 Aaguascalientes,23,11,2016,17,27,17,38,1,63,1,2,1,2,2,,,,,,,,,,,,,,,,,,,,,1,6,1,2,,,2,2,,,2,,,,,,,,,,,2,,,,,,,,,,,,,,,,,,,,2,,,,,,,,2,2,,2,,2,,2,,2,,2,,2,,2,,2,,2,,2,,2,,2,,1,1,1,2,2,1,10,2,2,1,,,2,2,3,2016-11-23,1,11,1,Aguascalientes,2,HGZ 1 Aguascalientes,758,1,1.00000000000000000000,10.39693112987070000000
11066,1,11,HGZ 1 Aaguascalientes,23,11,2016,17,45,17,57,1,65,1,2,1,3,1,177,5,1,,2,1,3,7,,,,,,2,2,2,2,2,2,2,2,,,2,,,2,2,,,2,,,,,,,,,,,2,,,,,,,,,,,,,,,,,,,,2,,,,,,,,1,2,,2,,1,10,2,,2,,1,10,2,,2,,2,,2,,2,,2,,2,,1,1,1,1,1,1,10,2,2,1,,,2,2,5,2016-11-23,1,11,1,Aguascalientes,2,HGZ 1 Aguascalientes,758,1,1.00000000000000000000,8.75070776743550000000
11067,1,11,HGZ 1 Aaguascalientes,23,11,2016,18,4,18,11,1,72,1,1,1,1,1,42,21,1,,1,7,2,999,,,,,,2,2,2,3,1,1,2,2,,,1,1,1,2,2,,,2,,,,,,,,,,,2,,,,,,,,,,,,,,,,,,,,2,,,,,,,,1,1,10,2,,1,10,2,,2,,2,,2,,2,,2,,1,5,2,,2,,2,,1,1,1,97,,1,10,1,2,1,,,1,2,5,2016-11-23,1,11,1,Aguascalientes,2,HGZ 1 Aguascalientes,758,1,1.00000000000000000000,7.59599814859063000000
11068,1,11,HGZ 1 Aaguascalientes,23,11,2016,18,16,18,23,1,34,1,2,1,1,2,,,,,,,,,,,,,,,,,,,,,2,,,1,1,1,2,2,,,2,,,,,,,,,,,2,,,,,,,,,,,,,,,,,,,,2,,,,,,,,2,2,,1,10,2,,1,10,2,,2,,1,10,2,,2,,2,,2,,2,,2,,1,1,1,1,1,1,10,6,,9,10,8,1,1,5,2016-11-23,1,11,1,Aguascalientes,2,HGZ 1 Aguascalientes,758,1,1.00000000000000000000,7.77667247650698000000
11069,1,11,HGZ 1 Aaguascalientes,23,11,2016,18,31,18,40,1,70,1,2,2,2,2,,,,,,,,,,,,,,,,,,,,,2,,,2,,,2,2,,,2,,,,,,,,,,,1,2,4,1,,,,,19,2,2,2,99,2,2,,,,1,2,1,3,999,1,2,,,,2,2,,2,,2,,2,,1,9,1,10,2,,2,,2,,2,,2,,2,,2,,1,1,1,1,2,1,10,2,2,995,,,2,2,2,2016-11-23,1,11,1,Aguascalientes,2,HGZ 1 Aguascalientes,758,1,1.00000000000000000000,8.75070776743550000000
11070,1,11,HGZ 1 Aaguascalientes,23,11,2016,18,53,19,1,1,44,1,2,1,1,2,,,,,,,,,,,,,,,,,,,,,2,,,1,1,1,1,1,1,,2,,,,,,,,,,,2,,,,,,,,,,,,,,,,,,,,2,,,,,,,,1,1,10,2,,1,10,2,,2,,2,,1,10,1,10,2,,2,,2,,2,,1,10,1,1,1,1,1,1,10,5,2,15,,,1,2,3,2016-11-23,1,11,1,Aguascalientes,2,HGZ 1 Aguascalientes,758,1,1.00000000000000000000,8.58175417028632000000
11071,1,11,HGZ 1 Aaguascalientes,23,11,2016,19,14,19,23,1,37,1,2,4,2,2,,,,,,,,,,,,,,,,,,,,,2,,,1,1,2,1,1,99,,1,4,5,6,1,1,5,3,4,,,2,,,,,,,,,,,,,,,,,,,,2,,,,,,,,2,1,10,2,,2,,1,9,1,9,2,,1,9,2,,2,,1,7,2,,2,,1,99,1,1,1,1,2,1,9,6,,14,,,2,2,5,2016-11-23,1,11,1,Aguascalientes,2,HGZ 1 Aguascalientes,758,1,1.00000000000000000000,9.88631400470786000000
11072,1,11,HGZ 1 Aaguascalientes,23,11,2016,19,33,19,39,1,59,1,5,2,1,1,28,6,1,,2,7,1,7,,,,,,2,2,2,4,1,1,2,2,,,2,,,2,2,,,2,,,,,,,,,,,2,,,,,,,,,,,,,,,,,,,,2,,,,,,,,1,1,10,2,,1,10,2,,1,10,1,10,1,10,2,,2,,2,,2,,2,,2,,1,1,1,5,1,1,10,6,,995,,,2,2,5,2016-11-23,1,11,1,Aguascalientes,2,HGZ 1 Aguascalientes,758,1,1.00000000000000000000,10.39693112987070000000
11074,1,11,HGZ 1 Aaguascalientes,23,11,2016,9,22,9,28,1,49,14,761,5,2,2,,,,,,,,,,,,,,,,,,,,,1,2,2,1,1,99,2,2,,,2,,,,,,,,,,,2,,,,,,,,,,,,,,,,,,,,2,,,,,,,,99,2,,1,10,2,,2,,2,,2,,2,,2,,2,,2,,2,,2,,2,,1,1,1,5,2,1,10,6,,12,1,,2,2,2,2016-11-23,1,11,1,Aguascalientes,2,HGZ 1 Aguascalientes,758,1,1.00000000000000000000,9.49213191587710000000
11075,1,11,HGZ 1 Aaguascalientes,23,11,2016,9,41,9,48,1,23,1,5,2,2,2,,,,,,,,,,,,,,,,,,,,,2,,,1,4,1,2,2,,,2,,,,,,,,,,,2,,,,,,,,,,,,,,,,,,,,2,,,,,,,,2,2,,1,10,2,,2,,2,,2,,1,10,2,,2,,2,,2,,2,,2,,2,1,1,1,1,99,10,2,1,3,2,1,1,1,5,2016-11-23,1,11,1,Aguascalientes,2,HGZ 1 Aguascalientes,758,1,1.00000000000000000000,7.68018435164604000000
11077,1,11,HGZ 1 Aaguascalientes,23,11,2016,10,17,10,28,1,33,1,2,3,2,2,,,,,,,,,,,,,,,,,,,,,1,4,1,2,,,2,2,,,2,,,,,,,,,,,2,,,,,,,,,,,,,,,,,,,,2,,,,,,,,2,1,9,2,,2,,1,10,2,,1,10,2,,2,,2,,2,,2,,2,,2,,1,1,1,3,1,99,9,3,1,1,10,9,1,1,5,2016-11-23,1,11,1,Aguascalientes,2,HGZ 1 Aguascalientes,758,1,1.00000000000000000000,7.77667247650698000000
11078,1,11,HGZ 1 Aaguascalientes,23,11,2016,10,42,10,48,1,67,1,3,2,2,1,35,6,2,2,1,7,6,7,1,,,,,2,5,4,3,1,1,2,2,,,1,1,1,1,1,1,,2,,,,,,,,,,,1,2,6,1,,,,,4,2,2,2,1,1,1,,,,1,1,2,,,,,,,,2,2,,2,,1,8,1,8,1,8,2,,2,,2,,2,,2,,2,,1,10,1,10,1,1,1,1,1,1,8,6,,1,13,,2,1,5,2016-11-23,1,11,1,Aguascalientes,2,HGZ 1 Aguascalientes,758,1,1.00000000000000000000,8.75070776743550000000
11079,1,11,HGZ 1 Aaguascalientes,23,11,2016,11,6,11,18,1,58,7,350,2,2,2,,,,,,,,,,,,,,,,,,,,,1,1,1,2,,,2,2,,,1,2,2,1,2,,2,1,,,,2,,,,,,,,,,,,,,,,,,,,2,,,,,,,,1,2,,2,,2,,2,,2,,1,9,2,,2,,2,,2,,2,,2,,2,,1,1,1,1,2,1,9,3,2,13,,,1,2,3,2016-11-23,1,11,1,Aguascalientes,2,HGZ 1 Aguascalientes,758,1,1.00000000000000000000,9.02499223061895000000