Folio,Deleg,Unidmed,Id_Unid,Fecha_D,Fecha_M,Fecha_A,Hr_Ini_H,Hr_Ini_M,Hr_Fin_H,Hr_Fin_M,Servatn,Tipopac,Sat1,Sat3,Probsal,Citapre,Comocita,Antescita,Motivoant,Diascita,Hrcita,Tmedreg2,Durasis_C,Preosad,Tratocomf,Filtroref,Totorpase1,Tiem_Esp1,Proscesoref_1,Proscesoref_2,Proscesoref_3,Proscesoref_4,Proscesoref_5,Proscesoref_6,Proscesoref_7,Satprocref,Sattempref,Conocunifila,Filtrounifila,Tmpespunif,Comptmpunif,Satmedunif,Filtrosaux1,Temsad1,Temsad1a,Filtrosaux2,Temsad2,Temsad2a,Recmedhoy,Filtrofarm2,Totmed,Motnosurt,Btratou,Calfatna_A,Calfatnb_A,Calfatna_C,Calfatnb_C,Calfatna_E,Calfatnb_E,Calfatna_F,Calfatnb_F,Calfatna_G,Calfatnb_G,Calfatna_H,Calfatnb_H,Calfatna_N,Calfatnb_N,Calfatna_K,Calfatnb_K,Calfatna_L,Calfatnb_L,Calfatna_J,Calfatnb_J,Calfatna_M,Calfatnb_M,Calfatna_O,Calfatnb_O,Saludar,Escuchar,Responder,Tiemuv,Mejoratratou,Gafet,Btratou2,Calfinmb_F,Limp1,Limp2,Recomej_A,Recomej_B,Recomej_C,Turno,Sexo,Escolar,Edad,Fecha,Entidad,Id_Unidad,Cve_Delegaci�N,Delegaci�N,Nivel,Unidad,Promedio_Diario2015,Estrato,Moscondia,Fe_Finalnr
1001,1,UMF 8 Aguascalientes,1,8,11,2016,8,3,8,16,1,1,2,2,40,1,2,1,5,4,1,2,2,1,2,3,,,,,,,,,,,,2,,,,,1,3,1,2,,,2,2,,,1,2,,2,,2,,2,,1,10,2,,2,,2,,2,,2,,2,,2,,1,1,1,2,2,1,9,2,6,,1,,,2,2,3,58,2016-11-08,1,1,1,Aguascalientes,1,UMF 8 Aguascalientes,1294,1,0.230495191,19.05057117
1002,1,UMF 8 Aguascalientes,1,8,11,2016,8,41,8,49,2,1,2,2,38,2,,,,,,1,1,1,2,3,,,,,,,,,,,,2,,,,,2,,,2,,,2,2,,,2,1,9,2,,1,9,2,,2,,2,,2,,2,,2,,2,,2,,2,,2,1,1,1,2,99,9,2,2,1,3,,,1,1,7,31,2016-11-08,1,1,1,Aguascalientes,1,UMF 8 Aguascalientes,1294,1,0.230495191,22.51946292
1003,1,UMF 8 Aguascalientes,1,8,11,2016,8,35,8,42,1,1,2,2,2,2,,,,,,1,1,1,2,3,,,,,,,,,,,,2,,,,,2,,,2,,,1,1,1,,2,1,9,1,10,2,,2,,2,,2,,1,9,2,,2,,2,,2,,2,,1,1,1,5,1,1,9,2,6,,10,,,1,1,3,68,2016-11-08,1,1,1,Aguascalientes,1,UMF 8 Aguascalientes,1294,1,0.230495191,20.67202629
1004,1,UMF 8 Aguascalientes,1,8,11,2016,8,31,8,42,1,2,4,4,7,2,,,,,,2,1,1,2,3,,,,,,,,,,,,1,2,5,2,4,1,4,1,2,,,1,1,1,,2,1,7,1,9,2,,2,,1,7,2,,1,8,2,,1,5,2,,2,,2,,1,1,1,2,2,1,8,2,2,1,1,8,9,1,1,6,40,2016-11-08,1,1,1,Aguascalientes,1,UMF 8 Aguascalientes,1294,1,0.230495191,19.86681596
1005,1,UMF 8 Aguascalientes,1,8,11,2016,8,25,8,35,2,1,2,2,2,1,1,2,5,4,1,2,2,2,2,3,,,,,,,,,,,,1,3,,,,1,3,1,2,,,2,2,,,2,1,10,2,,1,10,2,,1,10,2,,2,,2,,2,,2,,1,10,1,10,1,1,1,2,2,1,10,2,6,,6,13,,1,1,5,49,2016-11-08,1,1,1,Aguascalientes,1,UMF 8 Aguascalientes,1294,1,0.230495191,20.98475301
1006,1,UMF 8 Aguascalientes,1,8,11,2016,8,47,8,57,1,1,2,2,4,2,,,,,,2,1,1,2,1,1,2,7,,,,,,,2,2,1,3,,,,2,,,1,1,1,1,1,1,,2,1,10,1,9,1,10,2,,2,,2,,1,9,2,,1,10,2,,2,,2,,1,1,1,1,1,1,10,2,3,1,1,,,1,2,2,42,2016-11-08,1,1,1,Aguascalientes,1,UMF 8 Aguascalientes,1294,1,0.230495191,20.1780253
1007,1,UMF 8 Aguascalientes,1,8,11,2016,8,18,8,35,1,1,4,4,118,1,1,6,,2,1,1,2,1,2,1,6,1,7,4,,,,,,2,2,1,2,5,3,2,1,1,1,2,,,2,2,,,2,2,,2,,1,10,2,,1,10,2,,2,,2,,2,,2,,2,,2,,2,2,1,1,2,1,10,2,4,2,13,,,1,1,5,40,2016-11-08,1,1,1,Aguascalientes,1,UMF 8 Aguascalientes,1294,1,0.230495191,19.86681596
1008,1,UMF 8 Aguascalientes,1,8,11,2016,8,22,8,29,1,1,1,1,1,1,2,1,4,3,1,1,2,1,2,1,6,2,1,7,,,,,,2,2,2,,,,,1,6,2,2,,,2,2,,,2,2,,1,10,2,,2,,2,,2,,2,,2,,2,,2,,2,,2,,1,1,1,2,1,1,9,2,6,,12,,,2,1,3,67,2016-11-08,1,1,1,Aguascalientes,1,UMF 8 Aguascalientes,1294,1,0.230495191,20.67202629
1010,1,UMF 8 Aguascalientes,1,8,11,2016,9,29,9,37,1,1,2,2,55,2,,,,,,1,1,1,2,3,,,,,,,,,,,,1,3,,,,2,,,2,,,2,2,,,1,1,10,2,,1,10,2,,2,,2,,2,,2,,2,,2,,1,10,1,10,1,1,1,1,2,1,10,2,6,,2,,,1,1,9,32,2016-11-08,1,1,1,Aguascalientes,1,UMF 8 Aguascalientes,1294,1,0.230495191,22.51946292
1011,1,UMF 8 Aguascalientes,1,8,11,2016,9,38,9,48,1,1,2,2,13,2,,,,,,2,1,1,2,3,,,,,,,,,,,,1,1,1,1,1,2,,,2,,,1,1,1,,1,1,8,1,10,2,,2,,2,,2,,1,10,2,,1,8,2,,2,,2,,1,1,1,5,1,1,9,2,4,2,8,,,1,1,6,19,2016-11-08,1,1,1,Aguascalientes,1,UMF 8 Aguascalientes,1294,1,0.230495191,19.81689926
1012,1,UMF 8 Aguascalientes,1,8,11,2016,9,5,9,13,2,1,1,2,38,2,,,,,,1,2,2,2,3,,,,,,,,,,,,2,,,,,1,4,1,2,,,2,2,,,1,2,,2,,2,,2,,2,,2,,2,,2,,2,,2,,2,,2,,1,1,1,1,1,1,10,2,4,1,15,,,1,2,3,47,2016-11-08,1,1,1,Aguascalientes,1,UMF 8 Aguascalientes,1294,1,0.230495191,21.31347459
1013,1,UMF 8 Aguascalientes,1,8,11,2016,9,22,9,34,1,1,2,2,14,2,,,,,,1,2,2,2,3,,,,,,,,,,,,2,,,,,2,,,2,,,1,1,1,,1,1,10,1,10,1,10,2,,2,,2,,1,10,2,,2,,2,,1,10,1,10,1,1,1,3,2,99,10,2,6,,995,,,1,2,3,34,2016-11-08,1,1,1,Aguascalientes,1,UMF 8 Aguascalientes,1294,1,0.230495191,22.8722254
1014,1,UMF 8 Aguascalientes,1,8,11,2016,9,18,9,28,1,1,2,2,13,1,2,1,3,2,1,1,1,1,2,3,,,,,,,,,,,,1,3,,,,2,,,2,,,1,1,1,,2,1,8,1,10,2,,2,,1,10,1,10,1,9,2,,2,,2,,2,,2,,2,1,1,1,1,1,10,2,4,2,8,10,,1,2,5,60,2016-11-08,1,1,1,Aguascalientes,1,UMF 8 Aguascalientes,1294,1,0.230495191,19.05057117
1015,1,UMF 8 Aguascalientes,1,8,11,2016,9,33,9,40,1,1,2,2,1,2,,,,,,2,1,1,2,3,,,,,,,,,,,,2,,,,,1,5,1,2,,,1,1,1,,2,1,10,1,10,2,,2,,2,,2,,1,10,2,,2,,2,,2,,2,,1,1,1,1,2,1,10,4,4,2,10,11,,1,2,3,71,2016-11-08,1,1,1,Aguascalientes,1,UMF 8 Aguascalientes,1294,1,0.230495191,20.99584908
1016,1,UMF 8 Aguascalientes,1,8,11,2016,8,54,9,3,1,1,1,1,16,1,1,2,3,2,1,1,1,1,1,2,1,1,7,,,,,,,1,1,2,,,,,1,1,1,2,,,2,2,,,1,2,,1,10,2,,2,,2,,2,,2,,2,,2,,2,,2,,2,,1,1,1,1,2,1,10,2,6,,2,1,12,2,2,9,62,2016-11-08,1,1,1,Aguascalientes,1,UMF 8 Aguascalientes,1294,1,0.230495191,19.05057117
1017,1,UMF 8 Aguascalientes,1,8,11,2016,9,11,9,19,1,1,2,1,13,2,,,,,,3,1,1,2,1,7,,7,,,,,,,2,2,1,1,1,1,2,2,,,2,,,2,2,,,2,1,9,1,10,1,9,2,,2,,2,,2,,2,,2,,2,,2,,2,,1,2,1,2,1,1,9,2,2,1,9,10,,1,1,7,18,2016-11-08,1,1,1,Aguascalientes,1,UMF 8 Aguascalientes,1294,1,0.230495191,19.81689926
1018,1,UMF 8 Aguascalientes,1,8,11,2016,10,34,10,43,1,1,2,2,7,2,,,,,,4,1,1,2,3,,,,,,,,,,,,1,1,2,2,2,2,,,2,,,1,1,1,,2,1,3,2,,2,,2,,2,,2,,1,10,2,,2,,2,,2,,2,,1,1,1,5,1,1,9,1,2,1,1,,,1,2,7,23,2016-11-08,1,1,1,Aguascalientes,1,UMF 8 Aguascalientes,1294,1,0.230495191,20.12732667
1019,1,UMF 8 Aguascalientes,1,8,11,2016,10,37,10,48,1,1,2,2,1,1,3,1,2,4,1,2,1,1,2,3,,,,,,,,,,,,1,2,1,2,3,1,3,1,2,,,1,1,1,,2,1,9,1,9,2,,2,,2,,2,,1,9,2,,2,,2,,2,,2,,1,1,1,2,2,1,9,2,6,,2,,,1,2,2,70,2016-11-08,1,1,1,Aguascalientes,1,UMF 8 Aguascalientes,1294,1,0.230495191,20.99584908
1020,1,UMF 8 Aguascalientes,1,8,11,2016,10,12,10,21,1,1,1,1,2,1,1,1,5,4,1,1,2,1,2,3,,,,,,,,,,,,1,3,,,,2,,,2,,,1,1,1,,1,1,10,1,10,1,10,2,,2,,2,,1,10,2,,2,,2,,2,,2,,1,1,1,2,2,1,10,1,6,,3,,,1,1,5,59,2016-11-08,1,1,1,Aguascalientes,1,UMF 8 Aguascalientes,1294,1,0.230495191,18.75675076
1021,1,UMF 8 Aguascalientes,1,8,11,2016,10,18,10,24,1,2,1,2,7,2,,,,,,4,1,1,2,3,,,,,,,,,,,,1,1,4,1,2,2,,,1,99,1,1,1,1,,2,1,10,1,10,2,,2,,2,,2,,2,,2,,2,,2,,2,,2,,1,1,1,5,1,1,10,1,6,,13,9,11,1,1,5,32,2016-11-08,1,1,1,Aguascalientes,1,UMF 8 Aguascalientes,1294,1,0.230495191,22.51946292
1022,1,UMF 8 Aguascalientes,1,8,11,2016,10,43,10,53,1,2,2,2,21,2,,,,,,2,1,1,2,3,,,,,,,,,,,,1,1,2,1,2,1,3,1,2,,,1,1,1,,1,1,10,1,10,1,10,2,,2,,2,,1,10,2,,2,,2,,2,,2,,1,1,1,1,1,1,10,1,2,2,10,11,,1,1,5,35,2016-11-08,1,1,1,Aguascalientes,1,UMF 8 Aguascalientes,1294,1,0.230495191,19.86681596
1023,1,UMF 8 Aguascalientes,1,8,11,2016,10,1,10,18,1,1,2,2,25,2,,,,,,5,2,1,2,1,1,3,6,,,,,,,2,4,1,2,2,1,2,2,,,1,4,1,1,1,1,,1,1,10,1,10,2,,2,,2,,2,,1,10,2,,2,,2,,2,,2,,1,1,1,2,1,1,10,2,2,1,1,8,,1,2,5,45,2016-11-08,1,1,1,Aguascalientes,1,UMF 8 Aguascalientes,1294,1,0.230495191,21.31347459
1024,1,UMF 8 Aguascalientes,1,8,11,2016,9,50,10,1,1,1,2,2,16,1,1,3,1,3,99,1,2,2,1,2,1,1,7,,,,,,,2,2,1,1,1,1,2,1,2,1,2,,,1,1,1,,2,1,10,1,10,2,,2,,2,,2,,1,10,2,,2,,2,,2,,2,,99,1,1,3,2,99,9,2,5,99,13,12,,1,2,3,65,2016-11-08,1,1,1,Aguascalientes,1,UMF 8 Aguascalientes,1294,1,0.230495191,20.99584908
1025,1,UMF 8 Aguascalientes,1,8,11,2016,10,5,10,20,1,1,2,2,35,1,3,1,9,2,1,2,2,1,2,1,1,1,7,2,,,,,,2,2,2,,,,,1,1,1,1,1,1,2,2,,,2,2,,1,10,2,,2,,2,,2,,2,,2,,2,,2,,2,,1,10,1,1,1,1,2,99,10,5,6,,1,,,1,2,9,55,2016-11-08,1,1,1,Aguascalientes,1,UMF 8 Aguascalientes,1294,1,0.230495191,19.05057117
1026,1,UMF 8 Aguascalientes,1,8,11,2016,10,49,10,59,1,1,4,4,39,1,2,1,3,2,1,1,2,1,1,1,1,1,1,7,,,,,,4,2,1,3,,,,2,,,1,1,1,2,2,,,2,1,10,1,10,2,,2,,2,,2,,2,,2,,2,,2,,2,,1,10,1,1,1,1,3,1,6,2,6,,1,2,45,1,1,8,25,2016-11-08,1,1,1,Aguascalientes,1,UMF 8 Aguascalientes,1294,1,0.230495191,19.81689926
1027,1,UMF 8 Aguascalientes,1,8,11,2016,11,29,11,38,1,1,2,2,29,1,1,1,1,4,1,1,2,1,2,3,,,,,,,,,,,,2,,,,,2,,,2,,,1,1,1,,1,2,,1,10,2,,1,10,2,,2,,1,10,2,,2,,2,,2,,2,,1,1,1,2,1,1,10,2,6,,995,,,1,1,1,70,2016-11-08,1,1,1,Aguascalientes,1,UMF 8 Aguascalientes,1294,1,0.230495191,20.67202629
1028,1,UMF 8 Aguascalientes,1,8,11,2016,11,4,11,12,1,1,2,1,4,2,,,,,,5,1,1,2,3,,,,,,,,,,,,1,1,5,2,2,2,,,2,,,1,1,1,,2,1,10,1,9,2,,2,,2,,2,,1,10,2,,2,,2,,2,,2,,1,1,1,5,1,1,9,1,6,,1,9,,1,2,4,39,2016-11-08,1,1,1,Aguascalientes,1,UMF 8 Aguascalientes,1294,1,0.230495191,20.1780253
1029,1,UMF 8 Aguascalientes,1,8,11,2016,11,38,11,46,1,1,2,2,2,2,,,,,,3,2,1,1,3,,,,,,,,,,,,1,1,2,1,2,2,,,2,,,1,1,1,,2,1,8,2,,2,,2,,2,,2,,1,8,2,,2,,2,,2,,2,,1,2,1,4,1,99,7,2,6,,8,9,,1,2,5,56,2016-11-08,1,1,1,Aguascalientes,1,UMF 8 Aguascalientes,1294,1,0.230495191,19.05057117
1030,1,UMF 8 Aguascalientes,1,8,11,2016,11,18,11,24,1,1,2,2,7,2,,,,,,3,1,1,2,3,,,,,,,,,,,,1,1,1,1,2,2,,,2,,,1,1,1,,2,2,,1,9,2,,2,,2,,2,,1,10,2,,2,,2,,2,,2,,99,1,1,2,2,1,9,2,6,,11,9,,1,1,5,21,2016-11-08,1,1,1,Aguascalientes,1,UMF 8 Aguascalientes,1294,1,0.230495191,19.81689926
1031,1,UMF 8 Aguascalientes,1,8,11,2016,11,12,11,23,1,1,2,2,35,1,3,1,5,3,1,2,2,2,1,1,6,5,7,,,,,,,2,4,2,,,,,1,3,2,1,99,2,1,1,1,,2,1,8,1,9,1,8,2,,2,,2,,1,9,2,,2,,2,,2,,2,,1,1,1,2,3,99,8,2,4,99,1,,,1,1,7,45,2016-11-08,1,1,1,Aguascalientes,1,UMF 8 Aguascalientes,1294,1,0.230495191,20.98475301
1032,1,UMF 8 Aguascalientes,1,8,11,2016,11,54,12,4,1,1,2,2,1,1,2,1,1,2,1,1,1,1,1,3,,,,,,,,,,,,2,,,,,1,1,1,2,,,1,1,1,,1,1,10,1,10,2,,2,,2,,2,,1,10,2,,2,,2,,2,,2,,1,1,1,3,2,99,9,2,6,,13,,,1,1,3,56,2016-11-08,1,1,1,Aguascalientes,1,UMF 8 Aguascalientes,1294,1,0.230495191,18.75675076
1033,1,UMF 8 Aguascalientes,1,8,11,2016,12,39,12,50,1,1,2,2,1,1,1,1,5,4,1,1,1,1,2,3,,,,,,,,,,,,2,,,,,1,3,1,2,,,1,1,1,,2,1,9,1,10,2,,2,,1,10,2,,1,10,2,,2,,2,,2,,2,,99,1,1,3,2,1,10,4,4,2,14,,,1,1,1,61,2016-11-08,1,1,1,Aguascalientes,1,UMF 8 Aguascalientes,1294,1,0.230495191,18.75675076
1034,1,UMF 8 Aguascalientes,1,8,11,2016,11,51,12,1,1,1,4,2,70,1,3,4,2,2,1,5,2,1,2,3,,,,,,,,,,,,2,,,,,2,,,2,,,1,1,1,,2,1,10,1,10,1,10,2,,2,,2,,1,10,2,,2,,2,,1,10,2,,1,1,1,2,2,99,10,99,6,,995,,,1,2,2,54,2016-11-08,1,1,1,Aguascalientes,1,UMF 8 Aguascalientes,1294,1,0.230495191,21.31347459
1035,1,UMF 8 Aguascalientes,1,8,11,2016,12,44,12,55,1,1,1,1,19,2,,,,,,1,1,1,2,3,,,,,,,,,,,,1,1,1,1,1,1,2,99,2,,,1,1,1,,1,1,10,1,10,2,,2,,1,10,2,,1,10,2,,2,,1,10,2,,2,,1,1,1,5,1,99,10,1,6,,995,,,1,1,7,48,2016-11-08,1,1,1,Aguascalientes,1,UMF 8 Aguascalientes,1294,1,0.230495191,20.98475301
1036,1,UMF 8 Aguascalientes,1,8,11,2016,12,22,12,33,1,1,2,2,1,1,1,3,11,4,1,4,1,1,2,3,,,,,,,,,,,,2,,,,,1,7,1,1,7,1,1,1,1,,2,1,10,1,10,2,,2,,2,,1,10,1,10,1,10,2,,2,,2,,2,,1,1,1,2,2,1,10,1,1,1,995,,,1,1,2,73,2016-11-08,1,1,1,Aguascalientes,1,UMF 8 Aguascalientes,1294,1,0.230495191,20.67202629
1037,1,UMF 8 Aguascalientes,1,8,11,2016,12,50,12,56,2,1,2,2,38,2,,,,,,2,2,99,2,3,,,,,,,,,,,,2,,,,,1,7,1,2,,,2,2,,,2,2,,2,,1,10,2,,2,,2,,2,,2,,2,,2,,2,,2,,1,1,1,1,2,1,8,1,2,1,995,,,1,2,3,81,2016-11-08,1,1,1,Aguascalientes,1,UMF 8 Aguascalientes,1294,1,0.230495191,20.99584908
1038,1,UMF 8 Aguascalientes,1,8,11,2016,12,4,12,14,1,1,2,2,2,1,1,1,4,5,1,2,2,1,2,3,,,,,,,,,,,,2,,,,,1,2,1,1,2,1,1,1,1,,2,2,,1,8,2,,2,,2,,2,,1,8,2,,2,,2,,2,,2,,99,1,1,3,2,1,8,3,6,,9,8,,1,2,3,55,2016-11-08,1,1,1,Aguascalientes,1,UMF 8 Aguascalientes,1294,1,0.230495191,19.05057117
1039,1,UMF 8 Aguascalientes,1,8,11,2016,12,15,12,24,1,2,2,2,7,2,,,,,,1,1,1,2,3,,,,,,,,,,,,1,1,1,1,2,2,,,2,,,1,1,1,,2,1,9,1,9,1,9,2,,2,,2,,1,9,2,,2,,2,,2,,2,,2,1,1,4,1,99,9,2,6,,3,9,,1,1,5,23,2016-11-08,1,1,1,Aguascalientes,1,UMF 8 Aguascalientes,1294,1,0.230495191,19.81689926
1040,1,UMF 8 Aguascalientes,1,8,11,2016,12,8,12,21,1,1,2,2,2,1,2,1,4,4,1,2,1,1,2,1,7,,1,2,,,,,,2,3,2,,,,,1,2,1,1,3,1,1,1,1,,1,1,10,1,10,2,,2,,2,,2,,1,10,2,,2,,2,,2,,2,,1,1,1,3,2,1,10,2,2,1,12,,,1,1,5,72,2016-11-08,1,1,1,Aguascalientes,1,UMF 8 Aguascalientes,1294,1,0.230495191,20.67202629
1041,1,UMF 8 Aguascalientes,1,8,11,2016,12,31,12,40,2,1,2,2,1,1,2,1,4,3,1,1,1,1,2,1,1,4,4,7,,,,,,2,2,2,,,,,2,,,2,,,1,1,1,,1,1,9,1,10,2,,2,,2,,2,,1,9,2,,2,,2,,2,,2,,1,1,1,5,1,1,9,1,6,,995,,,1,1,5,56,2016-11-08,1,1,1,Aguascalientes,1,UMF 8 Aguascalientes,1294,1,0.230495191,18.75675076
1042,1,UMF 8 Aguascalientes,1,8,11,2016,13,6,13,14,1,1,2,2,1,1,1,1,4,4,3,3,2,1,2,3,,,,,,,,,,,,2,,,,,2,,,2,,,1,1,1,,2,1,5,1,10,2,,2,,2,,2,,1,7,2,,2,,2,,1,9,2,,2,1,1,2,2,1,8,2,6,,1,,,1,1,7,70,2016-11-08,1,1,1,Aguascalientes,1,UMF 8 Aguascalientes,1294,1,0.230495191,20.67202629
1043,1,UMF 8 Aguascalientes,1,8,11,2016,13,0,13,8,2,1,3,3,2,2,,,,,,2,1,1,2,3,,,,,,,,,,,,2,,,,,2,,,2,,,1,1,1,,1,1,10,1,10,2,,2,,2,,2,,2,,2,,2,,2,,2,,2,,2,1,2,2,1,1,10,3,5,2,9,,,1,1,3,44,2016-11-08,1,1,1,Aguascalientes,1,UMF 8 Aguascalientes,1294,1,0.230495191,19.86681596
1044,1,UMF 8 Aguascalientes,1,8,11,2016,13,47,13,56,1,2,2,2,7,1,3,1,3,2,1,1,1,1,2,3,,,,,,,,,,,,1,3,,,,2,,,2,,,1,1,1,,1,1,8,1,10,2,,2,,1,10,2,,1,10,2,,2,,2,,2,,2,,1,1,1,3,1,1,10,2,4,2,13,,,1,1,5,26,2016-11-08,1,1,1,Aguascalientes,1,UMF 8 Aguascalientes,1294,1,0.230495191,22.51946292
1045,1,UMF 8 Aguascalientes,1,8,11,2016,13,40,13,49,1,1,2,2,2,1,1,1,5,6,3,1,1,2,1,3,,,,,,,,,,,,2,,,,,2,,,2,,,1,1,1,,2,1,10,1,10,2,,2,,2,,2,,1,10,2,,2,,2,,2,,2,,1,1,1,2,1,99,10,2,6,,995,,,1,1,8,66,2016-11-08,1,1,1,Aguascalientes,1,UMF 8 Aguascalientes,1294,1,0.230495191,20.67202629
1046,1,UMF 8 Aguascalientes,1,8,11,2016,13,23,13,30,1,1,4,4,8,2,,,,,,3,1,1,2,3,,,,,,,,,,,,1,2,1,3,4,2,,,2,,,1,1,1,,1,1,10,1,10,2,,2,,2,,2,,1,10,2,,2,,2,,2,,2,,1,1,1,2,1,1,8,2,5,2,13,1,8,2,1,7,36,2016-11-08,1,1,1,Aguascalientes,1,UMF 8 Aguascalientes,1294,1,0.230495191,19.86681596
1047,1,UMF 8 Aguascalientes,1,8,11,2016,13,15,13,28,1,1,1,1,1,1,1,1,4,4,1,1,1,1,2,3,,,,,,,,,,,,1,1,2,1,2,99,,,2,,,1,1,1,,1,1,10,1,10,1,10,2,,2,,2,,1,8,2,,2,,2,,2,,2,,1,1,1,2,2,99,10,2,2,2,13,4,1,1,1,2,78,2016-11-08,1,1,1,Aguascalientes,1,UMF 8 Aguascalientes,1294,1,0.230495191,20.67202629
1048,1,UMF 8 Aguascalientes,1,8,11,2016,14,22,14,30,1,2,4,4,108,2,,,,,,1,2,1,2,3,,,,,,,,,,,,1,3,,,,1,2,1,2,,,1,1,1,,4,2,,1,7,2,,2,,2,,2,,1,10,2,,2,,2,,2,,2,,1,1,1,1,2,1,5,2,2,1,1,,,2,1,5,34,2016-11-08,1,1,1,Aguascalientes,1,UMF 8 Aguascalientes,1294,1,0.230495191,22.51946292
1049,1,UMF 8 Aguascalientes,1,8,11,2016,14,0,14,12,1,1,1,2,79,1,3,1,5,3,1,2,1,1,2,3,,,,,,,,,,,,99,,,,,1,1,1,1,3,1,1,1,1,,1,1,9,1,10,2,,2,,1,10,2,,1,10,2,,2,,2,,2,,2,,1,1,1,2,2,99,10,3,3,2,2,,,1,2,2,89,2016-11-08,1,1,1,Aguascalientes,1,UMF 8 Aguascalientes,1294,1,0.230495191,20.99584908
1050,1,UMF 8 Aguascalientes,1,8,11,2016,14,35,14,42,2,1,2,2,38,2,,,,,,2,2,2,2,3,,,,,,,,,,,,2,,,,,2,,,2,,,2,2,,,2,2,,2,,1,9,2,,2,,2,,2,,2,,2,,2,,2,,2,,2,1,1,3,1,1,10,2,2,1,995,,,2,1,3,77,2016-11-08,1,1,1,Aguascalientes,1,UMF 8 Aguascalientes,1294,1,0.230495191,20.67202629
1051,1,UMF 8 Aguascalientes,1,8,11,2016,14,41,14,51,1,1,2,2,4,2,,,,,,2,2,1,2,3,,,,,,,,,,,,2,,,,,1,1,1,2,,,1,1,1,,1,1,10,1,10,2,,2,,2,,2,,1,10,2,,2,,2,,2,,2,,1,1,1,2,1,1,10,3,5,2,1,14,,2,1,2,39,2016-11-08,1,1,1,Aguascalientes,1,UMF 8 Aguascalientes,1294,1,0.230495191,19.86681596
1052,1,UMF 8 Aguascalientes,1,8,11,2016,14,13,14,23,1,1,1,2,11,1,2,1,4,2,1,1,1,1,2,3,,,,,,,,,,,,1,3,,,,1,2,1,2,,,1,1,1,,2,1,10,1,10,2,,2,,2,,2,,1,10,2,,2,,2,,2,,2,,1,1,1,5,1,1,6,2,6,,2,14,13,1,1,9,27,2016-11-08,1,1,1,Aguascalientes,1,UMF 8 Aguascalientes,1294,1,0.230495191,22.51946292
1053,1,UMF 8 Aguascalientes,1,8,11,2016,13,54,14,0,1,1,2,2,27,1,2,1,5,2,2,1,1,1,2,1,6,99,7,,,,,,,2,2,2,,,,,2,,,2,,,1,1,1,,2,1,10,1,10,2,,2,,2,,2,,1,10,2,,2,,2,,2,,2,,99,1,1,97,,1,9,2,6,,995,,,1,1,5,28,2016-11-08,1,1,1,Aguascalientes,1,UMF 8 Aguascalientes,1294,1,0.230495191,22.51946292
1054,1,UMF 8 Aguascalientes,1,8,11,2016,15,16,15,23,1,1,2,2,15,2,,,,,,1,2,1,2,3,,,,,,,,,,,,1,2,6,3,4,1,3,1,1,1,1,1,1,1,,2,1,9,1,10,1,6,2,,2,,2,,1,8,2,,2,,2,,2,,2,,1,1,1,5,1,1,10,2,4,1,1,,,2,1,3,43,2016-11-08,1,1,1,Aguascalientes,1,UMF 8 Aguascalientes,1294,1,0.230495191,19.86681596
1055,1,UMF 8 Aguascalientes,1,8,11,2016,15,0,15,8,1,1,2,2,40,2,,,,,,1,1,1,2,3,,,,,,,,,,,,2,,,,,2,,,2,,,1,1,1,,1,1,10,1,10,2,,2,,2,,2,,1,10,2,,1,9,2,,2,,2,,1,1,1,2,2,1,10,2,4,2,83,,,2,1,5,43,2016-11-08,1,1,1,Aguascalientes,1,UMF 8 Aguascalientes,1294,1,0.230495191,19.86681596
1056,1,UMF 8 Aguascalientes,1,8,11,2016,15,51,15,59,1,1,2,2,7,2,,,,,,2,1,1,2,3,,,,,,,,,,,,1,1,1,1,1,2,,,2,,,1,1,1,,1,1,10,1,10,2,,2,,2,,2,,1,10,2,,2,,2,,2,,2,,1,1,1,5,1,1,10,1,6,,995,,,2,1,4,36,2016-11-08,1,1,1,Aguascalientes,1,UMF 8 Aguascalientes,1294,1,0.230495191,19.86681596
1057,1,UMF 8 Aguascalientes,1,8,11,2016,15,9,15,19,1,1,2,2,1,1,1,2,8,5,1,2,2,1,2,3,,,,,,,,,,,,2,,,,,2,,,2,,,1,1,1,,1,1,9,1,10,1,10,2,,2,,2,,1,10,2,,2,,2,,2,,2,,2,1,1,3,1,1,10,1,1,1,995,,,2,1,5,74,2016-11-08,1,1,1,Aguascalientes,1,UMF 8 Aguascalientes,1294,1,0.230495191,20.67202629
1058,1,UMF 8 Aguascalientes,1,8,11,2016,15,24,15,31,1,1,2,2,7,2,,,,,,2,1,1,2,3,,,,,,,,,,,,2,,,,,2,,,2,,,1,1,1,,2,1,10,1,8,2,,2,,2,,2,,1,10,2,,2,,2,,2,,2,,1,1,1,5,1,2,10,1,6,,995,,,2,2,7,25,2016-11-08,1,1,1,Aguascalientes,1,UMF 8 Aguascalientes,1294,1,0.230495191,20.12732667
1059,1,UMF 8 Aguascalientes,1,8,11,2016,15,47,15,54,1,1,4,4,6,1,1,1,8,1,1,2,1,1,2,3,,,,,,,,,,,,1,3,,,,2,,,2,,,1,1,1,,1,2,,1,5,1,10,2,,2,,2,,1,10,2,,2,,2,,2,,2,,1,1,1,2,1,99,10,2,2,1,1,2,,2,1,5,44,2016-11-08,1,1,1,Aguascalientes,1,UMF 8 Aguascalientes,1294,1,0.230495191,19.86681596
1060,1,UMF 8 Aguascalientes,1,8,11,2016,15,31,15,39,1,1,4,3,35,2,,,,,,5,2,1,2,3,,,,,,,,,,,,1,2,3,99,2,2,,,1,1,1,1,1,1,,2,1,9,1,8,2,,2,,2,,2,,1,8,2,,2,,2,,2,,2,,99,1,1,1,2,99,9,4,5,2,9,8,1,2,1,6,41,2016-11-08,1,1,1,Aguascalientes,1,UMF 8 Aguascalientes,1294,1,0.230495191,19.86681596
1061,1,UMF 8 Aguascalientes,1,8,11,2016,14,51,15,5,1,1,1,1,7,2,,,,,,2,1,1,2,1,99,7,999,,,,,,,99,99,1,2,1,1,1,1,1,1,1,1,1,1,1,1,,1,1,10,1,8,2,,2,,2,,2,,1,10,2,,1,9,2,,2,,2,,1,1,1,1,1,1,10,2,6,,995,,,2,1,3,50,2016-11-08,1,1,1,Aguascalientes,1,UMF 8 Aguascalientes,1294,1,0.230495191,20.98475301
1062,1,UMF 8 Aguascalientes,1,8,11,2016,15,41,15,51,1,1,2,2,40,2,,,,,,5,2,1,2,1,2,99,3,7,,,,,,2,2,2,,,,,2,,,1,2,1,1,1,1,,2,1,7,1,10,2,,1,8,1,10,2,,1,10,1,10,2,,2,,2,,2,,1,1,1,4,2,1,10,2,6,,37,,,2,1,4,43,2016-11-08,1,1,1,Aguascalientes,1,UMF 8 Aguascalientes,1294,1,0.230495191,19.86681596
1063,1,UMF 8 Aguascalientes,1,8,11,2016,16,21,16,29,1,2,2,1,7,2,,,,,,4,1,1,2,3,,,,,,,,,,,,1,1,4,1,2,2,,,2,,,1,1,1,,2,1,9,1,8,2,,2,,2,,2,,1,10,2,,2,,2,,2,,2,,2,2,2,1,1,99,7,2,2,2,1,,,2,1,9,43,2016-11-08,1,1,1,Aguascalientes,1,UMF 8 Aguascalientes,1294,1,0.230495191,19.86681596
1064,1,UMF 8 Aguascalientes,1,8,11,2016,16,9,16,22,1,1,2,1,16,1,1,1,4,6,1,2,1,1,2,3,,,,,,,,,,,,2,,,,,1,6,1,1,1,1,1,1,1,,1,1,10,1,10,2,,2,,2,,2,,1,10,2,,2,,2,,2,,2,,1,1,1,3,1,99,10,1,6,,1,,,2,1,2,76,2016-11-08,1,1,1,Aguascalientes,1,UMF 8 Aguascalientes,1294,1,0.230495191,20.67202629
1065,1,UMF 8 Aguascalientes,1,8,11,2016,16,40,16,48,1,1,2,4,4,2,,,,,,4,1,2,2,3,,,,,,,,,,,,1,2,6,3,4,2,,,1,7,1,2,2,,,2,1,6,1,6,1,10,2,,2,,1,5,2,,2,,2,,2,,2,,2,,1,2,2,1,3,2,4,5,5,2,1,,,2,1,4,42,2016-11-08,1,1,1,Aguascalientes,1,UMF 8 Aguascalientes,1294,1,0.230495191,19.86681596
1066,1,UMF 8 Aguascalientes,1,8,11,2016,16,47,16,56,1,2,2,4,40,1,2,1,5,5,1,2,1,1,1,3,,,,,,,,,,,,1,3,,,,2,,,2,,,2,2,,,1,1,10,1,10,1,10,2,,2,,2,,2,,2,,2,,2,,2,,2,,1,1,1,2,2,1,10,2,2,2,8,,,2,1,5,27,2016-11-08,1,1,1,Aguascalientes,1,UMF 8 Aguascalientes,1294,1,0.230495191,22.51946292
1067,1,UMF 8 Aguascalientes,1,8,11,2016,16,34,16,40,2,1,2,1,38,2,,,,,,2,1,1,2,3,,,,,,,,,,,,2,,,,,2,,,2,,,2,2,,,2,1,10,1,10,2,,2,,2,,2,,2,,2,,2,,2,,2,,2,,1,1,1,4,1,1,10,1,6,,12,,,2,2,9,31,2016-11-08,1,1,1,Aguascalientes,1,UMF 8 Aguascalientes,1294,1,0.230495191,22.8722254
1068,1,UMF 8 Aguascalientes,1,8,11,2016,16,26,16,35,1,1,2,2,1,1,1,1,3,6,1,1,1,2,2,3,,,,,,,,,,,,2,,,,,1,1,1,2,,,1,1,1,,2,2,,1,10,2,,2,,2,,2,,1,7,2,,2,,2,,2,,2,,1,1,1,3,2,1,10,4,6,,13,2,,2,2,2,67,2016-11-08,1,1,1,Aguascalientes,1,UMF 8 Aguascalientes,1294,1,0.230495191,20.99584908
1069,1,UMF 8 Aguascalientes,1,8,11,2016,16,1,16,8,1,1,2,2,18,1,1,1,4,6,1,1,1,1,2,3,,,,,,,,,,,,2,,,,,2,,,2,,,1,1,1,,2,1,9,1,9,2,,2,,2,,2,,1,9,2,,2,,2,,2,,2,,99,1,1,2,2,1,9,3,6,,1,14,,2,1,3,86,2016-11-08,1,1,1,Aguascalientes,1,UMF 8 Aguascalientes,1294,1,0.230495191,20.67202629
1070,1,UMF 8 Aguascalientes,1,8,11,2016,16,13,16,24,1,1,4,2,7,2,,,,,,4,1,1,2,1,1,2,7,,,,,,,2,2,1,1,2,1,4,2,,,2,,,1,1,1,,2,1,9,1,7,2,,2,,1,8,1,6,1,9,2,,2,,2,,2,,2,,2,1,1,2,1,2,7,2,4,2,13,,,2,2,5,42,2016-11-08,1,1,1,Aguascalientes,1,UMF 8 Aguascalientes,1294,1,0.230495191,20.1780253
1071,1,UMF 8 Aguascalientes,1,8,11,2016,17,37,17,43,1,1,1,1,28,2,,,,,,3,1,1,2,3,,,,,,,,,,,,1,3,,,,2,,,2,,,1,1,1,,2,1,10,1,10,2,,1,10,2,,2,,1,10,2,,2,,2,,2,,2,,1,1,1,1,1,1,10,1,6,,14,,,2,2,7,26,2016-11-08,1,1,1,Aguascalientes,1,UMF 8 Aguascalientes,1294,1,0.230495191,22.8722254
1072,1,UMF 8 Aguascalientes,1,8,11,2016,17,14,17,20,1,2,2,2,12,2,,,,,,2,1,1,2,3,,,,,,,,,,,,1,1,2,1,1,2,,,2,,,1,1,1,,1,1,8,1,10,2,,2,,2,,2,,1,10,2,,2,,2,,2,,2,,1,1,1,3,1,99,10,2,2,2,50,,,1,1,7,26,2016-11-08,1,1,1,Aguascalientes,1,UMF 8 Aguascalientes,1294,1,0.230495191,22.51946292
1073,1,UMF 8 Aguascalientes,1,8,11,2016,17,23,17,34,1,1,2,2,20,1,2,1,4,4,1,1,1,1,2,3,,,,,,,,,,,,2,,,,,2,,,2,,,1,1,1,,1,1,7,1,10,2,,2,,2,,2,,1,7,2,,2,,2,,2,,2,,1,1,1,2,1,1,10,2,6,,995,,,2,1,1,71,2016-11-08,1,1,1,Aguascalientes,1,UMF 8 Aguascalientes,1294,1,0.230495191,20.67202629
1074,1,UMF 8 Aguascalientes,1,8,11,2016,17,31,17,37,1,1,2,2,1,1,1,1,4,6,1,2,1,2,2,3,,,,,,,,,,,,2,,,,,2,,,2,,,1,1,1,,2,1,10,1,10,2,,2,,2,,2,,2,,2,,2,,2,,2,,2,,2,1,1,5,2,1,10,2,6,,995,,,2,1,3,85,2016-11-08,1,1,1,Aguascalientes,1,UMF 8 Aguascalientes,1294,1,0.230495191,20.67202629
1075,1,UMF 8 Aguascalientes,1,8,11,2016,16,56,17,6,1,1,2,2,3,1,2,1,5,6,1,1,1,1,2,3,,,,,,,,,,,,2,,,,,1,1,1,2,,,1,1,1,,2,1,10,1,10,2,,2,,2,,2,,1,10,2,,2,,2,,2,,1,10,1,1,1,5,1,1,10,2,4,2,13,2,,2,1,2,38,2016-11-08,1,1,1,Aguascalientes,1,UMF 8 Aguascalientes,1294,1,0.230495191,19.86681596
1076,1,UMF 8 Aguascalientes,1,8,11,2016,17,8,17,18,1,1,2,2,40,1,2,1,19,2,1,2,1,1,2,1,1,5,999,,,,,,,2,2,1,2,1,1,2,1,3,1,2,,,1,1,1,,2,1,10,1,10,2,,2,,1,10,2,,1,10,2,,2,,2,,2,,2,,1,1,1,3,2,1,10,3,6,,995,,,2,2,9,50,2016-11-08,1,1,1,Aguascalientes,1,UMF 8 Aguascalientes,1294,1,0.230495191,21.31347459
1077,1,UMF 8 Aguascalientes,1,8,11,2016,17,42,17,51,1,1,2,2,35,2,,,,,,4,1,1,2,1,6,2,7,1,,,,,,2,2,1,2,6,1,2,2,,,2,,,1,1,1,,1,1,10,1,10,2,,2,,2,,2,,1,8,2,,2,,2,,2,,2,,1,1,1,1,1,1,10,2,4,2,9,10,1,2,2,7,45,2016-11-08,1,1,1,Aguascalientes,1,UMF 8 Aguascalientes,1294,1,0.230495191,21.31347459
1078,1,UMF 8 Aguascalientes,1,8,11,2016,18,8,18,19,1,1,5,5,9,1,2,1,999,3,3,2,1,1,1,3,,,,,,,,,,,,1,2,1,1,3,1,2,1,2,,,2,2,,,4,1,8,1,5,2,,2,,1,9,1,9,2,,2,,2,,2,,2,,2,,2,1,1,1,2,2,5,4,4,2,1,,,2,1,5,41,2016-11-08,1,1,1,Aguascalientes,1,UMF 8 Aguascalientes,1294,1,0.230495191,19.86681596
1079,1,UMF 8 Aguascalientes,1,8,11,2016,18,35,18,42,2,1,2,2,38,2,,,,,,4,1,1,2,3,,,,,,,,,,,,1,3,,,,2,,,2,,,2,2,,,2,1,8,2,,1,10,2,,2,,2,,1,9,2,,2,,2,,2,,2,,1,1,1,3,2,1,10,2,6,,1,,,2,1,9,45,2016-11-08,1,1,1,Aguascalientes,1,UMF 8 Aguascalientes,1294,1,0.230495191,20.98475301
1080,1,UMF 8 Aguascalientes,1,8,11,2016,17,59,18,4,2,2,2,2,38,2,,,,,,1,1,1,2,3,,,,,,,,,,,,2,,,,,2,,,2,,,2,2,,,1,2,,2,,1,10,2,,2,,2,,2,,2,,2,,2,,2,,2,,1,1,1,3,2,1,10,2,6,,1,,,2,1,5,29,2016-11-08,1,1,1,Aguascalientes,1,UMF 8 Aguascalientes,1294,1,0.230495191,22.51946292
1081,1,UMF 8 Aguascalientes,1,8,11,2016,18,12,18,19,1,1,4,3,4,1,3,1,3,3,2,3,2,2,1,3,,,,,,,,,,,,1,3,,,,2,,,2,,,1,1,2,57,2,1,8,1,9,2,,2,,2,,2,,1,3,2,,2,,2,,2,,2,,1,1,1,3,2,1,5,2,6,,1,,,2,2,5,54,2016-11-08,1,1,1,Aguascalientes,1,UMF 8 Aguascalientes,1294,1,0.230495191,21.31347459
1082,1,UMF 8 Aguascalientes,1,8,11,2016,18,24,18,36,1,1,2,2,8,1,1,1,5,4,4,4,2,1,2,3,,,,,,,,,,,,1,3,,,,1,2,1,1,2,1,1,1,1,,3,1,5,1,8,2,,2,,2,,2,,1,9,2,,1,9,1,9,2,,1,9,2,2,1,2,1,99,8,2,2,2,1,2,13,2,1,9,55,2016-11-08,1,1,1,Aguascalientes,1,UMF 8 Aguascalientes,1294,1,0.230495191,18.75675076