Folio,Deleg,Id_Unid,Unidmed,Fecha_D,Fecha_M,Fecha_A,Hr_Ini_H,Hr_Ini_M,Hr_Fin_H,Hr_Fin_M,Edad,Tipopac,Edoproc,Id_Unidproc,Sat1,Sat1_Mot1,Sat1_Mot2,Sat1_Mot3,Sat3,Filtroch,Probsal,Semambe,Cartembe,Utilcartembe,Portale,Ingportale,Infoportale,Anticoncepe,Noanticoncepe,Tourobse,Infotourobse,Cartembp,Utilcartembp,Portalp,Ingportalp,Infoportalp,Tourobsp,Infotourobsp,Comunincomp,Motcomunincomp1,Motcomunincomp2,Motcomunincomp3,Infoprocp,Anticoncepp,Noanticoncepp,Tactop,Autortactop,Metdolor,Presentp,Dudasemb,Infoedosaludp,Infomabbp,Califembp,Motcalifembp1,Motcalifembp2,Motcalifembp3,Especialid,Tipocons,Tmedreg3,Satiemesp,Pres_Med,Durasis_C,Preosad,Tratocomf,Comincomcons,Consdesp,Filtrosaux1,Temsad1,Temsad1b,Filtrosaux2,Temsad2,Temsad2b,Recmedhoy,Filtrofarm2,Totmed,Motnosurt,Filtrourg,Probsal_Urg,Mot_Urg,Atnurg,Noatnurg,Turgtriag,Tram_Urg,Cartcol,Medenfcol,Clasiftiem,Calteurg,Califurg,Motcalifurg1,Motcalifurg2,Motcalifurg3,Filtrocir,Progciru,Topera,Fechaop,Suspop1,Suspop3,Suspop2,Suspop4,Motoper,Opfinsem,Infofam1,Infofam,Medciru,Medciru2,Calciru,Motcalifcir1,Motcalifcir2,Motcalifcir3,Trabsocciru,Ciclocir,Filtrohos,Tobscama,Razontesp,Infprealta,Calhosp,Motcalifhosp1,Motcalifhosp2,Motcalifhosp3,Btratou,Btratou_Mot1,Btratou_Mot2,Btratou_Mot3,Calfatna_A,Calfatnb_A,Calfatna_B,Calfatnb_B,Calfatna_C,Calfatnb_C,Calfatna_E,Calfatnb_E,Calfatna_G,Calfatnb_G,Calfatna_H,Calfatnb_H,Calfatna_I,Calfatnb_I,Calfatna_J,Calfatnb_J,Calfatna_K,Calfatnb_K,Calfatna_L,Calfatnb_L,Calfatna_M,Calfatnb_M,Calfatna_N,Calfatnb_N,Calfatna_F,Calfatnb_F,Mottratot1,Mottratot2,Mottratot3,Mottratot4,Mottratot5,Saludar,Escuchar,Responder,Tiemuv,Mejoratratou,Gafet,Amable,Calfinmb_F,Limp1,Limp2,Recomej_A,Recomej_B,Recomej_C,Sexo,Escolar,Ocupa,Id_Unidad,Cve_Delegaci�N,Delegaci�N,Nivel,Unidad,Promedio_Diario2017,Estrato,Moscondia,Fe_Finalnr,Fecha,Entidad
11003,1,11,HGZ 1 Aguascalientes,23,10,2018,8,58,9,11,21,1,1,2,2,,,,2,1,1,12,1,2,3,,,1,,,,,,,,,,,,,,,,,,,,,,,,,,,,,1,1,3,4,1,1,1,2,2,1,2,,,2,,,2,,,,2,,,,,,,,,,,,,,,2,,,,,,,,,,,,,,,,,,,,2,,,,,,,,2,,,,1,5,2,,1,9,2,,2,,2,,2,,2,,2,,2,,2,,2,,2,,,,,,,1,1,1,2,2,1,1,2,3,1,1,3,,1,6,4,11,1,Aguascalientes,2,HGZ 1 Aguascalientes,839,1,1,7.14457440470217,2018-10-23,1
11006,1,11,HGZ 1 Aguascalientes,23,10,2018,10,16,10,27,20,1,1,2,2,,,,3,2,,,,,,,,,,,,,,,,,,,,,,,,,,,,,,,,,,,,,,,,,,,,,,,1,4,97,1,3,97,2,,,,2,,,,,,,,,,,,,,,2,,,,,,,,,,,,,,,,,,,,2,,,,,,,,2,,,,1,8,2,,2,,1,9,1,8,1,8,2,,2,,2,,2,,2,,2,,2,,,,,,,1,1,1,2,1,1,1,3,5,2,1,13,,1,5,5,11,1,Aguascalientes,2,HGZ 1 Aguascalientes,839,1,1,7.14457440470217,2018-10-23,1
11009,1,11,HGZ 1 Aguascalientes,23,10,2018,11,26,11,39,21,1,1,2,2,,,,2,2,,,,,,,,,,,,,,,,,,,,,,,,,,,,,,,,,,,,,,,,,,,,,,,1,1,1,2,,,2,,,,2,,,,,,,,,,,,,,,2,,,,,,,,,,,,,,,,,,,,2,,,,,,,,2,,,,2,,2,,2,,2,,1,9,2,,2,,2,,2,,2,,2,,2,,2,,,,,,,1,1,1,2,2,1,1,2,2,1,995,,,1,5,5,11,1,Aguascalientes,2,HGZ 1 Aguascalientes,839,1,1,7.14457440470217,2018-10-23,1
11018,1,11,HGZ 1 Aguascalientes,23,10,2018,15,18,15,29,22,2,1,2,2,,,,2,1,999,,,,,,,,,,,,,,,,,,,,,,,,,,,,,,,,,,,,8,2,1,1,1,1,1,1,2,1,2,,,2,,,2,,,,2,,,,,,,,,,,,,,,2,,,,,,,,,,,,,,,,,,,,2,,,,,,,,2,,,,1,10,2,,1,10,2,,2,,2,,2,,2,,2,,2,,2,,2,,1,10,,,,,,1,1,1,1,2,1,1,3,5,2,13,,,1,7,5,11,1,Aguascalientes,2,HGZ 1 Aguascalientes,839,1,1,7.14457440470217,2018-10-23,1
11024,1,11,HGZ 1 Aguascalientes,23,10,2018,17,42,17,55,22,1,1,2,2,,,,2,2,,,,,,,,,,,,,,,,,,,,,,,,,,,,,,,,,,,,,,,,,,,,,,,2,,,1,2,1,2,,,,1,65,5,1,,3,1,1,2,,2,1,,,,2,,,,,,,,,,,,,,,,,,,,2,,,,,,,,2,,,,2,,2,,2,,2,,2,,2,,2,,2,,2,,2,,2,,2,,1,10,,,,,,1,1,1,5,2,1,1,2,6,,1,,,2,5,4,11,1,Aguascalientes,2,HGZ 1 Aguascalientes,839,1,1,7.62085940335888,2018-10-23,1
11042,1,11,HGZ 1 Aguascalientes,23,10,2018,12,20,12,35,25,1,1,2,2,,,,2,2,,,,,,,,,,,,,,,,,,,,,,,,,,,,,,,,,,,,,,,,,,,,,,,2,,,1,1,97,2,,,,2,,,,,,,,,,,,,,,2,,,,,,,,,,,,,,,,,,,,2,,,,,,,,2,,,,2,,2,,2,,2,,2,,1,9,2,,2,,2,,2,,2,,2,,2,,,,,,,1,1,1,4,2,1,1,2,2,1,995,,,2,5,4,11,1,Aguascalientes,2,HGZ 1 Aguascalientes,839,1,1,7.62085940335888,2018-10-23,1
11046,1,11,HGZ 1 Aguascalientes,23,10,2018,14,12,14,20,22,1,1,2,3,1,12,,3,,2,,,,,,,,,,,1,1,3,,,3,,2,,,,1,1,,1,1,1,1,1,1,1,2,,,,997,,,,,,,,2,,1,1,97,2,,,1,1,1,,2,,,,,,,,,,,,,,,2,,,,,,,,,,,,,,,,,,,,1,1,,1,2,,,,2,,,,1,10,2,,1,10,1,1,2,,2,,2,,2,,2,,1,5,2,,1,2,2,,,,,,,1,1,1,1,2,1,1,2,3,2,1,13,,1,6,8,11,1,Aguascalientes,2,HGZ 1 Aguascalientes,839,1,1,7.14457440470217,2018-10-23,1
11060,1,11,HGZ 1 Aguascalientes,23,10,2018,19,42,19,53,25,1,1,2,2,,,,2,2,,,,,,,,,,,,,,,,,,,,,,,,,,,,,,,,,,,,,,,,,,,,,,,1,1,1,2,,,2,,,,2,,,,,,,,,,,,,,,2,,,,,,,,,,,,,,,,,,,,2,,,,,,,,1,,,,1,10,2,,2,,1,10,2,,2,,2,,2,,2,,2,,2,,2,,2,,,,,,,1,1,1,2,2,1,1,2,6,,2,,,1,5,5,11,1,Aguascalientes,2,HGZ 1 Aguascalientes,839,1,1,7.14457440470217,2018-10-23,1
11066,1,11,HGZ 1 Aguascalientes,23,10,2018,9,53,10,5,21,1,1,4,2,,,,2,2,,,,,,,,,,,,,,,,,,,,,,,,,,,,,,,,,,,,,,,,,,,,,,,1,4,1,1,3,1,2,,,,2,,,,,,,,,,,,,,,2,,,,,,,,,,,,,,,,,,,,2,,,,,,,,2,,,,1,10,2,,2,,2,,1,10,2,,2,,2,,2,,2,,2,,2,,2,,,,,,,1,1,1,3,2,1,1,2,6,,995,,,2,5,1,11,1,Aguascalientes,2,HGZ 1 Aguascalientes,839,1,1,7.62085940335888,2018-10-23,1
11069,1,11,HGZ 1 Aguascalientes,23,10,2018,10,58,11,9,19,2,1,2,2,,,,2,2,,,,,,,,,,,,,,,,,,,,,,,,,,,,,,,,,,,,,,,,,,,,,,,1,4,99,2,,,2,,,,2,,,,,,,,,,,,,,,2,,,,,,,,,,,,,,,,,,,,2,,,,,,,,1,,,,2,,2,,2,,1,9,1,8,2,,2,,2,,2,,2,,2,,2,,2,,,,,,,1,1,1,3,1,1,1,1,6,,995,,,1,5,1,11,1,Aguascalientes,2,HGZ 1 Aguascalientes,839,1,1,7.14457440470217,2018-10-23,1
11081,1,11,HGZ 1 Aguascalientes,23,10,2018,15,13,15,23,24,1,1,3,2,,,,2,1,3,,,,,,,,,,,,,,,,,,,,,,,,,,,,,,,,,,,,64,2,2,4,2,2,2,2,1,2,2,,,2,,,2,,,,2,,,,,,,,,,,,,,,2,,,,,,,,,,,,,,,,,,,,2,,,,,,,,3,4,,,1,9,2,,1,3,2,,2,,2,,2,,2,,2,,2,,2,,2,,2,,,,,,,2,2,2,97,,99,2,2,6,,62,,,2,7,6,11,1,Aguascalientes,2,HGZ 1 Aguascalientes,839,1,1,7.62085940335888,2018-10-23,1
11088,1,11,HGZ 1 Aguascalientes,23,10,2018,17,44,17,58,19,1,1,2041,2,,,,2,1,114,,,,,,,,,,,,,,,,,,,,,,,,,,,,,,,,,,,,1,1,2,3,1,1,1,1,2,1,1,1,2,2,,,2,,,,2,,,,,,,,,,,,,,,2,,,,,,,,,,,,,,,,,,,,2,,,,,,,,1,,,,1,9,2,,1,10,2,,2,,2,,2,,2,,2,,2,,2,,2,,2,,,,,,,1,1,1,97,,1,1,2,6,,995,,,1,7,6,11,1,Aguascalientes,2,HGZ 1 Aguascalientes,839,1,1,7.14457440470217,2018-10-23,1
11011,1,11,HGZ 1 Aguascalientes,23,10,2018,12,21,12,33,32,1,1,2,2,,,,2,2,,,,,,,,,,,,,,,,,,,,,,,,,,,,,,,,,,,,,,,,,,,,,,,2,,,1,1,97,2,,,,2,,,,,,,,,,,,,,,2,,,,,,,,,,,,,,,,,,,,2,,,,,,,,2,,,,1,4,2,,2,,2,,1,9,1,9,2,,2,,2,,1,9,2,,2,,2,,,,,,,1,1,1,1,1,1,1,2,6,,1,9,8,1,7,5,11,1,Aguascalientes,2,HGZ 1 Aguascalientes,839,1,1,7.90911339743542,2018-10-23,1
11025,1,11,HGZ 1 Aguascalientes,23,10,2018,18,10,18,22,34,2,1,2,2,,,,2,1,29,,,,,,,,,,,,,,,,,,,,,,,,,,,,,,,,,,,,7,2,2,2,1,1,1,2,2,1,2,,,2,,,2,,,,2,,,,,,,,,,,,,,,2,,,,,,,,,,,,,,,,,,,,2,,,,,,,,1,,,,1,10,2,,1,10,2,,2,,2,,2,,2,,2,,2,,2,,2,,2,,,,,,,1,1,1,1,1,1,1,2,3,1,995,,,1,5,4,11,1,Aguascalientes,2,HGZ 1 Aguascalientes,839,1,1,7.90911339743542,2018-10-23,1
11028,1,11,HGZ 1 Aguascalientes,23,10,2018,19,7,19,20,28,1,1,2,1,,,,1,1,22,,,,,,,,,,,,,,,,,,,,,,,,,,,,,,,,,,,,1,2,4,2,3,1,1,2,2,1,1,1,1,2,,,2,,,,2,,,,,,,,,,,,,,,2,,,,,,,,,,,,,,,,,,,,2,,,,,,,,2,,,,1,10,2,,1,10,2,,2,,2,,2,,2,,99,,99,,99,,99,,2,,,,,,,1,1,1,3,2,1,1,1,6,,995,,,1,5,5,11,1,Aguascalientes,2,HGZ 1 Aguascalientes,839,1,1,7.90911339743542,2018-10-23,1
11034,1,11,HGZ 1 Aguascalientes,23,10,2018,8,57,9,7,32,1,1,2,2,,,,2,1,19,,,,,,,,,,,,,,,,,,,,,,,,,,,,,,,,,,,,4,1,3,2,1,1,1,2,2,1,2,,,2,,,1,1,1,,2,,,,,,,,,,,,,,,2,,,,,,,,,,,,,,,,,,,,2,,,,,,,,2,,,,2,,2,,1,10,2,,2,,2,,2,,2,,2,,2,,2,,1,99,2,,,,,,,1,1,1,97,,1,1,2,6,,995,,,1,5,5,11,1,Aguascalientes,2,HGZ 1 Aguascalientes,839,1,1,7.90911339743542,2018-10-23,1
11038,1,11,HGZ 1 Aguascalientes,23,10,2018,10,41,10,51,28,1,1,2,2,,,,2,,2,,,,,,,,,,,1,1,3,,,3,,2,,,,1,1,,1,1,1,1,1,1,1,2,,,,997,,,,,,,,2,,2,,,2,,,1,1,1,,1,999,2,1,,99,1,2,2,,2,2,,,,2,,,,,,,,,,,,,,,,,,,,1,1,,1,2,,,,2,,,,2,,2,,1,10,1,10,2,,2,,1,8,1,10,2,,2,,2,,1,99,2,,,,,,,1,1,1,1,1,1,1,2,2,1,2,1,3,1,4,4,11,1,Aguascalientes,2,HGZ 1 Aguascalientes,839,1,1,7.90911339743542,2018-10-23,1
11040,1,11,HGZ 1 Aguascalientes,23,10,2018,11,33,11,44,26,1,1,5,2,,,,2,2,,,,,,,,,,,,,,,,,,,,,,,,,,,,,,,,,,,,,,,,,,,,,,,1,1,97,2,,,2,,,,1,33,1,1,,1,3,2,2,,5,4,1,10,,1,1,5,1,,,,,4,2,1,2,1,2,2,,,,2,1,1,1,,1,2,,,,2,,,,1,1,2,,1,10,1,10,2,,2,,1,10,2,,2,,2,,2,,2,,2,,,,,,,1,1,1,1,2,1,1,3,5,1,1,,,1,6,5,11,1,Aguascalientes,2,HGZ 1 Aguascalientes,839,1,1,7.90911339743542,2018-10-23,1
11041,1,11,HGZ 1 Aguascalientes,23,10,2018,11,57,12,7,29,1,1,2,2,,,,2,2,,,,,,,,,,,,,,,,,,,,,,,,,,,,,,,,,,,,,,,,,,,,,,,2,,,1,1,97,2,,,,2,,,,,,,,,,,,,,,2,,,,,,,,,,,,,,,,,,,,2,,,,,,,,2,,,,2,,2,,2,,2,,2,,1,9,2,,2,,2,,2,,2,,2,,2,,,,,,,1,1,1,2,2,1,1,2,2,1,1,,,2,6,1,11,1,Aguascalientes,2,HGZ 1 Aguascalientes,839,1,1,8.43636552618281,2018-10-23,1
11045,1,11,HGZ 1 Aguascalientes,23,10,2018,13,46,13,59,31,2,1,2,2,,,,2,1,12,,,,,,,,,,,,,,,,,,,,,,,,,,,,,,,,,,,,8,2,1,2,1,1,1,2,2,1,1,1,97,1,1,2,2,,,,2,,,,,,,,,,,,,,,2,,,,,,,,,,,,,,,,,,,,2,,,,,,,,2,,,,99,,2,,1,10,1,10,2,,1,10,2,,2,,2,,2,,2,,2,,2,,,,,,,2,1,1,1,2,1,1,2,2,1,995,,,1,6,5,11,1,Aguascalientes,2,HGZ 1 Aguascalientes,839,1,1,7.90911339743542,2018-10-23,1
11047,1,11,HGZ 1 Aguascalientes,23,10,2018,14,35,14,48,30,1,32,1786,1,,,,1,1,23,,,,,,,,,,,,,,,,,,,,,,,,,,,,,,,,,,,,10,2,1,2,3,1,1,2,2,1,2,,,2,,,2,,,,2,,,,,,,,,,,,,,,2,,,,,,,,,,,,,,,,,,,,2,,,,,,,,1,,,,1,10,2,,1,10,2,,2,,2,,2,,2,,2,,2,,2,,2,,2,,,,,,,1,1,1,2,2,1,1,1,6,,995,,,2,9,8,11,1,Aguascalientes,2,HGZ 1 Aguascalientes,839,1,1,8.43636552618281,2018-10-23,1
11050,1,11,HGZ 1 Aguascalientes,23,10,2018,15,49,15,58,28,1,1,2,2,,,,2,1,1,37,1,1,1,2,,1,,3,,,,,,,,,,,,,,,,,,,,,,,,,,,1,2,2,2,3,1,1,2,2,1,2,,,2,,,2,,,,2,,,,,,,,,,,,,,,2,,,,,,,,,,,,,,,,,,,,2,,,,,,,,2,,,,1,10,2,,1,10,2,,2,,2,,2,,2,,2,,2,,2,,2,,2,,,,,,,1,1,1,3,2,1,1,2,2,1,995,,,1,5,5,11,1,Aguascalientes,2,HGZ 1 Aguascalientes,839,1,1,7.90911339743542,2018-10-23,1
11052,1,11,HGZ 1 Aguascalientes,23,10,2018,16,31,16,43,28,1,1,2,2,,,,2,2,,,,,,,,,,,,,,,,,,,,,,,,,,,,,,,,,,,,,,,,,,,,,,,1,1,1,2,,,2,,,,2,,,,,,,,,,,,,,,2,,,,,,,,,,,,,,,,,,,,2,,,,,,,,1,,,,2,,2,,2,,2,,1,10,2,,2,,2,,2,,2,,2,,2,,2,,,,,,,1,1,1,2,2,1,1,2,6,,995,,,1,5,5,11,1,Aguascalientes,2,HGZ 1 Aguascalientes,839,1,1,7.90911339743542,2018-10-23,1
11055,1,11,HGZ 1 Aguascalientes,23,10,2018,17,38,17,48,28,1,1,2,3,1,2,3,2,2,,,,,,,,,,,,,,,,,,,,,,,,,,,,,,,,,,,,,,,,,,,,,,,1,1,2,2,,,2,,,,1,3,5,1,,1,1,99,2,,3,3,2,,,2,,,,,,,,,,,,,,,,,,,,1,1,,1,2,,,,2,,,,2,,2,,1,8,1,8,2,,2,,2,,2,,2,,1,8,99,,2,,2,,,,,,,2,1,1,2,1,1,2,3,3,1,1,2,13,1,5,5,11,1,Aguascalientes,2,HGZ 1 Aguascalientes,839,1,1,7.90911339743542,2018-10-23,1
11059,1,11,HGZ 1 Aguascalientes,23,10,2018,19,17,19,26,33,1,1,5,2,,,,2,1,999,,,,,,,,,,,,,,,,,,,,,,,,,,,,,,,,,,,,17,1,2,2,1,1,1,1,2,1,2,,,2,,,2,,,,2,,,,,,,,,,,,,,,2,,,,,,,,,,,,,,,,,,,,2,,,,,,,,2,,,,1,8,2,,1,10,2,,2,,2,,2,,2,,2,,2,,2,,2,,2,,,,,,,1,1,1,5,1,1,1,2,2,1,995,,,2,6,4,11,1,Aguascalientes,2,HGZ 1 Aguascalientes,839,1,1,8.43636552618281,2018-10-23,1
11084,1,11,HGZ 1 Aguascalientes,23,10,2018,16,21,16,30,26,2,1,2,2,,,,2,2,,,,,,,,,,,,,,,,,,,,,,,,,,,,,,,,,,,,,,,,,,,,,,,1,3,1,1,1,1,2,,,,2,,,,,,,,,,,,,,,2,,,,,,,,,,,,,,,,,,,,2,,,,,,,,1,,,,1,9,2,,1,9,2,,2,,2,,2,,2,,2,,2,,2,,1,10,2,,,,,,,2,2,2,2,1,2,1,2,6,,995,,,1,5,5,11,1,Aguascalientes,2,HGZ 1 Aguascalientes,839,1,1,7.90911339743542,2018-10-23,1
11096,1,11,HGZ 1 Aguascalientes,23,10,2018,8,46,8,57,32,1,1,2,2,,,,2,1,1,19,2,,3,,,1,,,,,,,,,,,,,,,,,,,,,,,,,,,,,1,2,1,2,1,1,1,2,2,1,1,4,1,1,4,1,1,1,2,1,1,15,5,1,,1,1,1,2,,4,4,1,,,2,,,,,,,,,,,,,,,,,,,,2,,,,,,,,2,,,,1,10,2,,1,9,1,10,2,,2,,2,,2,,2,,2,,2,,1,9,2,,,,,,,1,1,1,1,1,1,1,2,4,2,14,3,13,1,7,5,11,1,Aguascalientes,2,HGZ 1 Aguascalientes,839,1,1,7.90911339743542,2018-10-23,1
11102,1,11,HGZ 1 Aguascalientes,23,10,2018,11,25,11,34,34,1,1,2,2,,,,2,2,,,,,,,,,,,,,,,,,,,,,,,,,,,,,,,,,,,,,,,,,,,,,,,1,3,1,1,5,1,2,,,,2,,,,,,,,,,,,,,,2,,,,,,,,,,,,,,,,,,,,2,,,,,,,,1,,,,1,10,2,,2,,1,10,1,10,2,,2,,2,,1,10,2,,2,,2,,2,,,,,,,1,1,1,2,1,1,1,2,2,1,1,3,8,1,5,5,11,1,Aguascalientes,2,HGZ 1 Aguascalientes,839,1,1,7.90911339743542,2018-10-23,1
11120,1,11,HGZ 1 Aguascalientes,23,10,2018,10,28,10,38,27,1,1,2,2,,,,2,2,,,,,,,,,,,,,,,,,,,,,,,,,,,,,,,,,,,,,,,,,,,,,,,2,,,2,,,1,1,1,,1,999,5,1,,3,2,1,1,1,4,2,,,,2,,,,,,,,,,,,,,,,,,,,2,,,,,,,,2,,,,2,,2,,2,,2,,2,,2,,2,,2,,2,,1,9,2,,1,9,2,,,,,,,2,1,1,4,2,1,1,2,6,,10,8,,1,6,2,11,1,Aguascalientes,2,HGZ 1 Aguascalientes,839,1,1,7.90911339743542,2018-10-23,1
11122,1,11,HGZ 1 Aguascalientes,23,10,2018,11,30,11,44,33,2,8,150,2,,,,2,2,,,,,,,,,,,,,,,,,,,,,,,,,,,,,,,,,,,,,,,,,,,,,,,2,,,1,2,1,1,1,1,,2,,,,,,,,,,,,,,,2,,,,,,,,,,,,,,,,,,,,2,,,,,,,,2,,,,2,,2,,1,10,2,,2,,1,10,2,,2,,2,,2,,2,,1,99,2,,,,,,,1,1,1,1,2,2,1,2,2,1,10,11,,1,5,5,11,1,Aguascalientes,2,HGZ 1 Aguascalientes,839,1,1,7.90911339743542,2018-10-23,1
11010,1,11,HGZ 1 Aguascalientes,23,10,2018,11,52,12,6,43,1,1,2,2,,,,2,2,,,,,,,,,,,,,,,,,,,,,,,,,,,,,,,,,,,,,,,,,,,,,,,1,1,97,2,,,2,,,,2,,,,,,,,,,,,,,,2,,,,,,,,,,,,,,,,,,,,2,,,,,,,,1,,,,2,,2,,2,,2,,2,,2,,2,,2,,1,8,2,,2,,2,,2,,,,,,,2,1,1,2,2,99,1,2,6,,12,,,1,3,5,11,1,Aguascalientes,2,HGZ 1 Aguascalientes,839,1,1,7.37871592864954,2018-10-23,1
11049,1,11,HGZ 1 Aguascalientes,23,10,2018,15,24,15,33,39,1,1,5,2,,,,2,2,,,,,,,,,,,,,,,,,,,,,,,,,,,,,,,,,,,,,,,,,,,,,,,1,1,97,1,1,97,1,1,1,,1,81,5,1,,1,1,1,1,1,1,2,,,,2,,,,,,,,,,,,,,,,,,,,1,1,,1,2,,,,2,,,,1,8,2,,1,10,1,8,2,,2,,2,,1,9,2,,2,,2,,1,99,2,,,,,,,1,1,1,1,1,1,2,2,2,1,1,,,2,7,4,11,1,Aguascalientes,2,HGZ 1 Aguascalientes,839,1,1,7.87060970805397,2018-10-23,1
11053,1,11,HGZ 1 Aguascalientes,23,10,2018,16,55,17,5,35,1,1,2,2,,,,2,2,,,,,,,,,,,,,,,,,,,,,,,,,,,,,,,,,,,,,,,,,,,,,,,2,,,1,1,97,2,,,,2,,,,,,,,,,,,,,,2,,,,,,,,,,,,,,,,,,,,2,,,,,,,,1,,,,2,,2,,2,,2,,2,,1,9,2,,99,,99,,99,,2,,2,,2,,,,,,,1,1,1,2,1,1,1,2,2,1,13,,,1,7,5,11,1,Aguascalientes,2,HGZ 1 Aguascalientes,839,1,1,7.37871592864954,2018-10-23,1
11054,1,11,HGZ 1 Aguascalientes,23,10,2018,17,16,17,24,36,2,1,2,2,,,,2,1,22,,,,,,,,,,,,,,,,,,,,,,,,,,,,,,,,,,,,8,1,4,2,2,1,1,2,2,1,2,,,2,,,2,,,,2,,,,,,,,,,,,,,,2,,,,,,,,,,,,,,,,,,,,2,,,,,,,,2,,,,1,9,2,,1,9,2,,2,,2,,2,,2,,2,,2,,2,,2,,2,,,,,,,1,1,1,5,1,1,1,2,6,,12,,,1,5,5,11,1,Aguascalientes,2,HGZ 1 Aguascalientes,839,1,1,7.37871592864954,2018-10-23,1
11057,1,11,HGZ 1 Aguascalientes,23,10,2018,18,24,18,33,43,1,1,2,2,,,,2,2,,,,,,,,,,,,,,,,,,,,,,,,,,,,,,,,,,,,,,,,,,,,,,,2,,,2,,,1,1,1,,1,9,5,1,,3,1,1,2,,2,2,,,,1,3,1,1,,,,,35,2,1,2,1,1,2,,,,1,1,1,1,,1,2,,,,2,,,,2,,2,,1,10,1,10,2,,2,,1,8,2,,2,,2,,2,,1,8,2,,,,,,,1,1,1,3,1,1,1,2,2,1,28,34,,2,5,4,11,1,Aguascalientes,2,HGZ 1 Aguascalientes,839,1,1,7.87060970805397,2018-10-23,1
11058,1,11,HGZ 1 Aguascalientes,23,10,2018,18,48,19,3,35,1,1,2,2,,,,2,1,22,,,,,,,,,,,,,,,,,,,,,,,,,,,,,,,,,,,,13,2,99,2,3,1,1,2,2,1,2,,,1,1,2,2,,,,2,,,,,,,,,,,,,,,2,,,,,,,,,,,,,,,,,,,,2,,,,,,,,1,,,,1,7,2,,1,10,2,,2,,2,,2,,2,,2,,2,,2,,2,,2,,,,,,,1,1,1,1,2,1,1,2,2,1,8,9,,1,5,5,11,1,Aguascalientes,2,HGZ 1 Aguascalientes,839,1,1,7.37871592864954,2018-10-23,1
11067,1,11,HGZ 1 Aguascalientes,23,10,2018,10,15,10,23,44,1,1,2,2,,,,2,2,,,,,,,,,,,,,,,,,,,,,,,,,,,,,,,,,,,,,,,,,,,,,,,1,4,1,2,,,2,,,,2,,,,,,,,,,,,,,,2,,,,,,,,,,,,,,,,,,,,2,,,,,,,,1,,,,2,,2,,2,,1,10,1,10,2,,2,,2,,2,,2,,2,,2,,2,,,,,,,1,1,1,3,2,1,1,2,4,2,13,,,2,5,4,11,1,Aguascalientes,2,HGZ 1 Aguascalientes,839,1,1,7.87060970805397,2018-10-23,1
11068,1,11,HGZ 1 Aguascalientes,23,10,2018,10,36,10,46,43,1,1,2,2,,,,4,2,,,,,,,,,,,,,,,,,,,,,,,,,,,,,,,,,,,,,,,,,,,,,,,1,4,1,1,3,2,2,,,,1,40,4,2,30,,,,,,,,,,,2,,,,,,,,,,,,,,,,,,,,1,1,,2,5,1,,,2,,,,1,10,2,,2,,2,,1,10,2,,2,,2,,2,,2,,2,,2,,1,9,,,,,,2,1,1,1,1,99,1,2,6,,1,,,1,3,5,11,1,Aguascalientes,2,HGZ 1 Aguascalientes,839,1,1,7.37871592864954,2018-10-23,1
11071,1,11,HGZ 1 Aguascalientes,23,10,2018,11,38,11,51,39,1,1,9888,3,12,3,,2,2,,,,,,,,,,,,,,,,,,,,,,,,,,,,,,,,,,,,,,,,,,,,,,,1,3,1,2,,,2,,,,2,,,,,,,,,,,,,,,2,,,,,,,,,,,,,,,,,,,,2,,,,,,,,2,,,,2,,2,,2,,2,,1,10,2,,2,,2,,2,,2,,2,,2,,2,,,,,,,1,1,1,5,3,1,1,3,4,2,1,2,,1,5,5,11,1,Aguascalientes,2,HGZ 1 Aguascalientes,839,1,1,7.37871592864954,2018-10-23,1
11074,1,11,HGZ 1 Aguascalientes,23,10,2018,12,47,12,59,42,1,1,1,2,,,,2,1,5,,,,,,,,,,,,,,,,,,,,,,,,,,,,,,,,,,,,22,1,4,4,1,1,1,2,2,1,2,,,2,,,1,1,1,,1,2,1,1,,2,4,1,2,,3,3,999,,,2,,,,,,,,,,,,,,,,,,,,2,,,,,,,,1,,,,1,9,2,,1,9,2,,2,,2,,2,,2,,2,,2,,2,,1,10,2,,,,,,,1,1,1,97,,1,1,2,6,,995,,,2,3,9,11,1,Aguascalientes,2,HGZ 1 Aguascalientes,839,1,1,7.87060970805397,2018-10-23,1
11079,1,11,HGZ 1 Aguascalientes,23,10,2018,14,26,14,41,35,1,1,1,2,,,,2,2,,,,,,,,,,,,,,,,,,,,,,,,,,,,,,,,,,,,,,,,,,,,,,,1,3,1,2,,,2,,,,2,,,,,,,,,,,,,,,2,,,,,,,,,,,,,,,,,,,,2,,,,,,,,2,,,,1,9,2,,2,,2,,2,,2,,2,,2,,2,,2,,2,,2,,2,,,,,,,1,1,1,2,2,1,1,4,6,,1,,,1,5,5,11,1,Aguascalientes,2,HGZ 1 Aguascalientes,839,1,1,7.37871592864954,2018-10-23,1
11082,1,11,HGZ 1 Aguascalientes,23,10,2018,15,35,15,50,36,2,1,2,2,,,,3,1,8,,,,,,,,,,,,,,,,,,,,,,,,,,,,,,,,,,,,8,1,4,4,2,1,1,2,2,1,1,1,1,2,,,1,1,1,,2,,,,,,,,,,,,,,,2,,,,,,,,,,,,,,,,,,,,1,2,,1,2,,,,2,,,,1,9,2,,1,6,2,,2,,2,,2,,2,,2,,2,,2,,1,8,2,,,,,,,1,1,1,1,2,1,1,2,6,,8,,,1,5,2,11,1,Aguascalientes,2,HGZ 1 Aguascalientes,839,1,1,7.37871592864954,2018-10-23,1
11085,1,11,HGZ 1 Aguascalientes,23,10,2018,16,38,16,48,37,1,1,2,2,,,,2,2,,,,,,,,,,,,,,,,,,,,,,,,,,,,,,,,,,,,,,,,,,,,,,,1,2,1,1,2,1,2,,,,2,,,,,,,,,,,,,,,2,,,,,,,,,,,,,,,,,,,,2,,,,,,,,2,,,,1,9,2,,1,9,2,,2,,2,,2,,2,,2,,2,,2,,2,,2,,,,,,,1,1,1,1,2,1,1,3,4,2,13,,,1,5,4,11,1,Aguascalientes,2,HGZ 1 Aguascalientes,839,1,1,7.37871592864954,2018-10-23,1
11089,1,11,HGZ 1 Aguascalientes,23,10,2018,18,7,18,21,38,1,1,2,2,,,,2,2,,,,,,,,,,,,,,,,,,,,,,,,,,,,,,,,,,,,,,,,,,,,,,,1,1,1,2,,,2,,,,2,,,,,,,,,,,,,,,97,,,,,,,,,,,,,,,,,,,,2,,,,,,,,1,,,,2,,2,,2,,2,,2,,2,,2,,2,,2,,2,,2,,2,,2,,,,,,,1,1,1,3,1,1,1,2,2,1,10,,,1,5,5,11,1,Aguascalientes,2,HGZ 1 Aguascalientes,839,1,1,7.37871592864954,2018-10-23,1
11090,1,11,HGZ 1 Aguascalientes,23,10,2018,18,32,18,42,35,2,1,2,2,,,,2,2,,,,,,,,,,,,,,,,,,,,,,,,,,,,,,,,,,,,,,,,,,,,,,,1,3,1,2,,,2,,,,2,,,,,,,,,,,,,,,2,,,,,,,,,,,,,,,,,,,,2,,,,,,,,2,,,,1,9,2,,2,,2,,2,,2,,2,,2,,2,,2,,2,,2,,2,,,,,,,1,1,2,1,2,1,1,2,6,,12,,,2,5,4,11,1,Aguascalientes,2,HGZ 1 Aguascalientes,839,1,1,7.87060970805397,2018-10-23,1
11108,1,11,HGZ 1 Aguascalientes,23,10,2018,14,24,14,34,39,1,1,2,2,,,,2,1,41,,,,,,,,,,,,,,,,,,,,,,,,,,,,,,,,,,,,6,2,6,5,1,2,1,2,2,1,2,,,2,,,2,,,,2,,,,,,,,,,,,,,,2,,,,,,,,,,,,,,,,,,,,2,,,,,,,,3,6,,,1,9,2,,1,10,2,,2,,2,,2,,2,,2,,2,,2,,2,,2,,,,,,,2,1,1,1,1,1,1,2,6,,8,,,1,3,5,11,1,Aguascalientes,2,HGZ 1 Aguascalientes,839,1,1,7.37871592864954,2018-10-23,1
11111,1,11,HGZ 1 Aguascalientes,23,10,2018,15,54,16,2,38,1,1,2,2,,,,2,1,4,,,,,,,,,,,,,,,,,,,,,,,,,,,,,,,,,,,,3,1,3,4,1,1,1,2,2,1,2,,,2,,,1,1,1,,2,,,,,,,,,,,,,,,2,,,,,,,,,,,,,,,,,,,,2,,,,,,,,2,,,,2,,2,,1,10,1,9,2,,2,,2,,2,,2,,2,,2,,1,10,2,,,,,,,2,1,1,99,,99,1,2,6,,1,,,1,7,5,11,1,Aguascalientes,2,HGZ 1 Aguascalientes,839,1,1,7.37871592864954,2018-10-23,1
11116,1,11,HGZ 1 Aguascalientes,23,10,2018,8,20,8,34,38,1,1,1,2,,,,2,2,,,,,,,,,,,,,,,,,,,,,,,,,,,,,,,,,,,,,,,,,,,,,,,2,,,2,,,1,1,1,,1,21,5,1,,3,4,1,1,1,4,2,,,,2,,,,,,,,,,,,,,,,,,,,2,,,,,,,,2,,,,2,,2,,1,10,1,10,2,,2,,2,,2,,2,,2,,2,,1,9,2,,,,,,,1,1,1,5,2,1,1,2,4,2,3,8,14,1,6,2,11,1,Aguascalientes,2,HGZ 1 Aguascalientes,839,1,1,7.37871592864954,2018-10-23,1
11118,1,11,HGZ 1 Aguascalientes,23,10,2018,9,29,9,42,42,2,1,2,2,,,,5,2,,,,,,,,,,,,,,,,,,,,,,,,,,,,,,,,,,,,,,,,,,,,,,,2,,,2,,,2,,,,1,19,3,2,1,,,,,,,,,,,2,,,,,,,,,,,,,,,,,,,,2,,,,,,,,2,,,,2,,2,,1,5,2,,2,,2,,2,,2,,2,,2,,2,,2,,2,,,,,,,1,1,2,5,3,1,1,2,4,1,1,6,14,2,5,1,11,1,Aguascalientes,2,HGZ 1 Aguascalientes,839,1,1,7.87060970805397,2018-10-23,1
11001,1,11,HGZ 1 Aguascalientes,23,10,2018,8,10,8,21,47,1,1,1,2,,,,2,2,,,,,,,,,,,,,,,,,,,,,,,,,,,,,,,,,,,,,,,,,,,,,,,1,1,1,2,,,2,,,,2,,,,,,,,,,,,,,,2,,,,,,,,,,,,,,,,,,,,2,,,,,,,,1,,,,1,10,2,,2,,2,,2,,2,,2,,2,,2,,2,,2,,2,,2,,,,,,,1,1,1,1,2,99,1,2,6,,995,,,1,4,5,11,1,Aguascalientes,2,HGZ 1 Aguascalientes,839,1,1,7.77398060600995,2018-10-23,1
11002,1,11,HGZ 1 Aguascalientes,23,10,2018,8,35,8,46,49,1,1,2,2,,,,2,2,,,,,,,,,,,,,,,,,,,,,,,,,,,,,,,,,,,,,,,,,,,,,,,1,3,1,2,,,2,,,,2,,,,,,,,,,,,,,,2,,,,,,,,,,,,,,,,,,,,2,,,,,,,,2,,,,2,,2,,1,9,1,10,1,9,2,,2,,2,,2,,2,,2,,2,,2,,,,,,,1,1,1,2,2,1,1,2,2,1,1,3,,1,4,4,11,1,Aguascalientes,2,HGZ 1 Aguascalientes,839,1,1,7.77398060600995,2018-10-23,1
11005,1,11,HGZ 1 Aguascalientes,23,10,2018,9,55,10,3,50,1,1,2,1,,,,1,2,,,,,,,,,,,,,,,,,,,,,,,,,,,,,,,,,,,,,,,,,,,,,,,1,1,97,2,,,2,,,,2,,,,,,,,,,,,,,,2,,,,,,,,,,,,,,,,,,,,2,,,,,,,,1,,,,2,,2,,2,,2,,2,,2,,2,,2,,2,,2,,2,,2,,1,10,,,,,,1,1,1,4,2,1,1,1,6,,995,,,1,5,5,11,1,Aguascalientes,2,HGZ 1 Aguascalientes,839,1,1,7.77398060600995,2018-10-23,1
11007,1,11,HGZ 1 Aguascalientes,23,10,2018,10,41,10,51,49,1,1,2,3,1,,,4,2,,,,,,,,,,,,,,,,,,,,,,,,,,,,,,,,,,,,,,,,,,,,,,,1,1,97,1,1,97,2,,,,2,,,,,,,,,,,,,,,2,,,,,,,,,,,,,,,,,,,,2,,,,,,,,2,,,,2,,2,,2,,2,,1,8,1,8,2,,2,,2,,2,,2,,2,,2,,,,,,,1,1,1,2,2,1,1,3,6,,12,,,2,5,4,11,1,Aguascalientes,2,HGZ 1 Aguascalientes,839,1,1,8.29222425955129,2018-10-23,1
11012,1,11,HGZ 1 Aguascalientes,23,10,2018,12,45,12,59,52,1,1,5,2,,,,2,1,19,,,,,,,,,,,,,,,,,,,,,,,,,,,,,,,,,,,,4,1,3,2,1,1,1,2,2,1,2,,,2,,,2,,,,2,,,,,,,,,,,,,,,2,,,,,,,,,,,,,,,,,,,,2,,,,,,,,1,,,,1,10,2,,1,10,2,,2,,2,,2,,2,,2,,2,,2,,2,,2,,,,,,,1,1,1,97,,1,1,1,6,,9,,,1,5,5,11,1,Aguascalientes,2,HGZ 1 Aguascalientes,839,1,1,7.77398060600995,2018-10-23,1
11014,1,11,HGZ 1 Aguascalientes,23,10,2018,13,37,13,50,52,1,1,2,3,1,,,2,2,,,,,,,,,,,,,,,,,,,,,,,,,,,,,,,,,,,,,,,,,,,,,,,1,1,97,2,,,2,,,,2,,,,,,,,,,,,,,,2,,,,,,,,,,,,,,,,,,,,2,,,,,,,,2,,,,2,,2,,2,,2,,2,,1,9,2,,2,,2,,2,,2,,2,,2,,,,,,,1,1,1,2,2,1,1,2,6,,1,,,2,3,4,11,1,Aguascalientes,2,HGZ 1 Aguascalientes,839,1,1,8.29222425955129,2018-10-23,1
11017,1,11,HGZ 1 Aguascalientes,23,10,2018,14,50,15,4,45,1,1,2,2,,,,2,2,,,,,,,,,,,,,,,,,,,,,,,,,,,,,,,,,,,,,,,,,,,,,,,2,,,1,1,97,2,,,,2,,,,,,,,,,,,,,,2,,,,,,,,,,,,,,,,,,,,2,,,,,,,,1,,,,2,,2,,2,,2,,2,,1,9,2,,2,,2,,2,,2,,2,,2,,,,,,,1,1,1,2,2,1,1,99,99,,22,,,2,5,4,11,1,Aguascalientes,2,HGZ 1 Aguascalientes,839,1,1,8.29222425955129,2018-10-23,1
11019,1,11,HGZ 1 Aguascalientes,23,10,2018,15,45,15,55,46,1,1,2,2,,,,2,2,,,,,,,,,,,,,,,,,,,,,,,,,,,,,,,,,,,,,,,,,,,,,,,1,1,97,2,,,2,,,,2,,,,,,,,,,,,,,,2,,,,,,,,,,,,,,,,,,,,2,,,,,,,,2,,,,2,,2,,2,,2,,1,8,2,,2,,2,,2,,2,,2,,2,,2,,,,,,,2,2,2,2,2,1,2,2,6,,1,,,1,9,2,11,1,Aguascalientes,2,HGZ 1 Aguascalientes,839,1,1,7.77398060600995,2018-10-23,1
11021,1,11,HGZ 1 Aguascalientes,23,10,2018,16,24,16,33,53,1,32,1788,2,,,,2,1,5,,,,,,,,,,,,,,,,,,,,,,,,,,,,,,,,,,,,2,1,2,2,1,1,1,2,2,1,2,,,1,1,1,1,1,1,,2,,,,,,,,,,,,,,,2,,,,,,,,,,,,,,,,,,,,2,,,,,,,,2,,,,1,8,2,,1,10,2,,2,,2,,2,,2,,2,,2,,2,,1,99,2,,,,,,,1,1,1,5,2,1,1,2,2,2,995,,,2,6,4,11,1,Aguascalientes,2,HGZ 1 Aguascalientes,839,1,1,8.29222425955129,2018-10-23,1
11035,1,11,HGZ 1 Aguascalientes,23,10,2018,9,20,9,35,52,1,1,2041,1,,,,1,1,5,,,,,,,,,,,,,,,,,,,,,,,,,,,,,,,,,,,,3,2,4,4,3,1,1,2,2,1,2,,,2,,,1,1,1,,2,,,,,,,,,,,,,,,2,,,,,,,,,,,,,,,,,,,,2,,,,,,,,1,,,,1,10,2,,1,10,2,,2,,2,,2,,2,,2,,2,,2,,1,10,2,,,,,,,1,1,1,5,2,1,1,3,6,,8,,,1,7,5,11,1,Aguascalientes,2,HGZ 1 Aguascalientes,839,1,1,7.77398060600995,2018-10-23,1
11037,1,11,HGZ 1 Aguascalientes,23,10,2018,10,14,10,26,48,1,1,2041,2,,,,2,1,9,,,,,,,,,,,,,,,,,,,,,,,,,,,,,,,,,,,,2,2,5,3,2,1,1,2,2,1,2,,,1,1,1,1,1,1,,2,,,,,,,,,,,,,,,2,,,,,,,,,,,,,,,,,,,,2,,,,,,,,2,,,,1,9,2,,1,8,2,,2,,2,,2,,2,,2,,2,,2,,1,9,2,,,,,,,1,1,1,4,2,1,1,2,6,,995,,,2,3,4,11,1,Aguascalientes,2,HGZ 1 Aguascalientes,839,1,1,8.29222425955129,2018-10-23,1
11043,1,11,HGZ 1 Aguascalientes,23,10,2018,12,47,13,2,45,1,1,2041,2,,,,2,1,49,,,,,,,,,,,,,,,,,,,,,,,,,,,,,,,,,,,,12,1,1,2,3,1,1,2,2,1,2,,,2,,,1,1,2,1,2,,,,,,,,,,,,,,,2,,,,,,,,,,,,,,,,,,,,2,,,,,,,,2,,,,1,8,2,,1,9,2,,2,,2,,2,,2,,2,,2,,2,,1,8,2,,,,,,,1,1,1,5,1,99,1,2,2,1,13,3,8,1,7,10,11,1,Aguascalientes,2,HGZ 1 Aguascalientes,839,1,1,7.77398060600995,2018-10-23,1
11075,1,11,HGZ 1 Aguascalientes,23,10,2018,13,9,13,22,46,1,1,6,2,,,,2,1,5,,,,,,,,,,,,,,,,,,,,,,,,,,,,,,,,,,,,36,2,1,2,1,1,1,2,2,1,2,,,2,,,1,1,2,1,2,,,,,,,,,,,,,,,2,,,,,,,,,,,,,,,,,,,,2,,,,,,,,2,,,,1,10,2,,1,10,2,,2,,2,,2,,2,,2,,2,,2,,1,7,2,,,,,,,1,1,1,4,2,1,1,2,6,,4,3,,2,5,4,11,1,Aguascalientes,2,HGZ 1 Aguascalientes,839,1,1,8.29222425955129,2018-10-23,1