Folio,Deleg,Unidmed,Id_Unid,Fecha_D,Fecha_M,Fecha_A,Hr_Ini_H,Hr_Ini_M,Hr_Fin_H,Hr_Fin_M,Tipopac,Sat1,Sat1_Mot1,Sat1_Mot2,Sat1_Mot3,Sat3,Probsal,Semambe,Cartembe,Utilcartembe,Portale,Ingportale,Infoportale,Anticoncepe,Noanticoncepe,Tourobse,Infotourobse,Cartembp,Utilcartembp,Portalp,Ingportalp,Infoportalp,Tourobsp,Infotourobsp,Comunincomp,Motcomunincomp1,Motcomunincomp2,Motcomunincomp3,Infoprocp,Anticoncepp,Noanticoncepp,Tactop,Autortactop,Metdolor,Presentp,Dudasemb,Infoedosaludp,Infomabbp,Califembp,Motcalifembp1,Motcalifembp2,Motcalifembp3,Citapre,Tmedreg2,Durasis_C,Preosad,Tratocomf,Comincomcons,Consdesp,Filtrosaux1,Temsad1,Filtrosaux2,Temsad2,Recmedhoy,Filtrofarm2,Totmed,Motnosurt,Btratou,Btratou_Mot1,Btratou_Mot2,Btratou_Mot3,Calfatna_A,Calfatnb_A,Calfatna_C,Calfatnb_C,Calfatna_E,Calfatnb_E,Calfatna_G,Calfatnb_G,Calfatna_H,Calfatnb_H,Calfatna_N,Calfatnb_N,Calfatna_K,Calfatnb_K,Calfatna_L,Calfatnb_L,Calfatna_J,Calfatnb_J,Calfatna_M,Calfatnb_M,Calfatna_F,Calfatnb_F,Mottratot1,Mottratot2,Mottratot3,Mottratot4,Mottratot5,Saludar,Escuchar,Responder,Tiemuv,Mejoratratou,Gafet,Amable,Calfinmb_F,Limp1,Limp2,Recomej_A,Recomej_B,Recomej_C,Edad,Edad_C,Sexo,Escolar,Ocupa,Id_Unidad,Cve_Delegaci�N,Delegaci�N,Nivel,Unidad,Promedio_Diario2017,Microzona,Estrato,Moscondia,Fe_Finalnr,Fecha,Entidad
1001,1,UMF 8 Aguascalientes,1,16,7,2018,8,31,8,38,1,2,,,,2,15,,,,,,,,,,,,,,,,,,,,,,,,,,,,,,,,,,,,2,3,1,1,2,2,1,2,,2,,1,1,1,,1,,,,1,9,1,10,2,,2,,2,,1,8,2,,2,,2,,2,,2,,,,,,,1,1,1,4,1,1,1,3,6,,13,,,32,,2,6,4,1,1,Aguascalientes,1,UMF 8 Aguascalientes,1660,0,2,1,18.3489617441311,2018-07-16,1
1002,1,UMF 8 Aguascalientes,1,16,7,2018,9,10,9,26,1,2,,,,2,11,,,,,,,,,,,,,,,,,,,,,,,,,,,,,,,,,,,,2,2,1,1,2,2,1,2,,2,,1,1,1,,1,,,,1,10,1,10,2,,2,,2,,1,10,2,,2,,2,,2,,2,,,,,,,1,1,1,5,1,1,1,3,6,,1,,,47,,2,5,4,1,1,Aguascalientes,1,UMF 8 Aguascalientes,1660,0,2,1,16.6066774413750,2018-07-16,1
1003,1,UMF 8 Aguascalientes,1,16,7,2018,9,26,9,42,1,3,,,,3,39,,,,,,,,,,,,,,,,,,,,,,,,,,,,,,,,,,,,2,1,1,1,2,2,1,2,,2,,1,1,1,,2,,,,1,9,1,10,2,,2,,2,,1,10,2,,2,,2,,2,,1,9,,,,,,1,1,1,2,1,1,1,3,3,2,13,,,22,,1,5,4,1,1,Aguascalientes,1,UMF 8 Aguascalientes,1660,0,2,1,19.1030159470918,2018-07-16,1
1004,1,UMF 8 Aguascalientes,1,16,7,2018,9,42,9,51,2,2,,,,2,86,,,,,,,,,,,,,,,,,,,,,,,,,,,,,,,,,,,,2,2,1,1,2,2,1,2,,2,,1,1,1,,2,,,,1,10,1,10,2,,2,,2,,1,10,2,,2,,2,,2,,2,,,,,,,1,1,1,5,1,1,1,2,6,,995,,,32,,1,5,5,1,1,Aguascalientes,1,UMF 8 Aguascalientes,1660,0,2,1,18.7653474421171,2018-07-16,1
1005,1,UMF 8 Aguascalientes,1,16,7,2018,10,27,10,46,2,2,,,,2,44,,,,,,,,,,,,,,,,,,,,,,,,,,,,,,,,,,,,1,2,2,1,2,2,1,2,,2,,2,2,,,2,,,,1,10,1,9,2,,2,,2,,2,,2,,2,,2,,2,,2,,,,,,,1,1,1,1,2,1,1,2,2,1,995,,,21,,2,6,4,1,1,Aguascalientes,1,UMF 8 Aguascalientes,1660,0,2,1,18.6791376973924,2018-07-16,1
1006,1,UMF 8 Aguascalientes,1,16,7,2018,11,44,11,51,1,2,,,,2,4,,,,,,,,,,,,,,,,,,,,,,,,,,,,,,,,,,,,1,3,1,1,2,2,1,2,,2,,1,1,1,,2,,,,1,10,1,10,2,,2,,2,,1,10,2,,2,,2,,1,10,2,,,,,,,1,1,1,2,2,99,1,2,2,1,42,,,54,,1,5,5,1,1,Aguascalientes,1,UMF 8 Aguascalientes,1660,0,2,1,16.9835261739669,2018-07-16,1
1007,1,UMF 8 Aguascalientes,1,16,7,2018,11,53,12,15,1,2,,,,2,10,,,,,,,,,,,,,,,,,,,,,,,,,,,,,,,,,,,,2,2,1,1,2,2,1,2,,2,,1,1,1,,2,,,,1,10,1,10,2,,2,,2,,1,10,2,,2,,2,,2,,2,,,,,,,1,1,1,1,2,1,1,2,6,,995,,,32,,1,5,4,1,1,Aguascalientes,1,UMF 8 Aguascalientes,1660,0,2,1,18.7653474421171,2018-07-16,1
1008,1,UMF 8 Aguascalientes,1,16,7,2018,12,16,12,25,1,3,,,,3,4,,,,,,,,,,,,,,,,,,,,,,,,,,,,,,,,,,,,1,2,2,2,1,2,1,1,2,2,,1,1,1,,4,1,2,,1,10,1,7,2,,2,,2,,1,10,2,,2,,2,,2,,1,8,,,,,,2,1,1,3,2,1,1,2,2,1,142,,,63,,1,3,5,1,1,Aguascalientes,1,UMF 8 Aguascalientes,1660,0,2,1,16.4071257556470,2018-07-16,1
1009,1,UMF 8 Aguascalientes,1,16,7,2018,12,45,12,56,1,2,,,,2,5,,,,,,,,,,,,,,,,,,,,,,,,,,,,,,,,,,,,2,1,1,1,2,2,1,2,,2,,1,1,1,,1,,,,1,10,1,10,2,,2,,2,,1,10,2,,2,,2,,2,,2,,,,,,,1,1,1,2,2,99,1,2,4,2,13,,,40,,1,5,5,1,1,Aguascalientes,1,UMF 8 Aguascalientes,1660,0,2,1,16.0264985340036,2018-07-16,1
1010,1,UMF 8 Aguascalientes,1,16,7,2018,12,57,13,15,1,2,,,,2,4,,,,,,,,,,,,,,,,,,,,,,,,,,,,,,,,,,,,1,2,1,1,2,2,1,2,,2,,1,1,1,,2,,,,1,10,1,10,2,,2,,2,,1,10,2,,2,,2,,2,,2,,,,,,,1,1,1,2,2,1,1,2,6,,995,,,70,,2,3,8,1,1,Aguascalientes,1,UMF 8 Aguascalientes,1660,0,2,1,15.7705623012569,2018-07-16,1
1011,1,UMF 8 Aguascalientes,1,16,7,2018,13,15,13,27,1,2,,,,2,4,,,,,,,,,,,,,,,,,,,,,,,,,,,,,,,,,,,,1,3,1,1,2,2,2,2,,2,,1,1,1,,1,,,,1,8,1,8,2,,2,,2,,1,6,2,,2,,2,,2,,2,,,,,,,99,1,1,2,2,1,1,2,6,,995,,,51,,1,3,5,1,1,Aguascalientes,1,UMF 8 Aguascalientes,1660,0,2,1,16.9835261739669,2018-07-16,1
1012,1,UMF 8 Aguascalientes,1,16,7,2018,13,27,13,40,1,2,,,,2,6,,,,,,,,,,,,,,,,,,,,,,,,,,,,,,,,,,,,1,3,1,1,2,2,1,2,,2,,1,1,1,,2,,,,1,10,1,10,2,,2,,2,,1,10,2,,2,,2,,2,,2,,,,,,,1,1,1,1,2,1,1,2,6,,995,,,59,,1,3,10,1,1,Aguascalientes,1,UMF 8 Aguascalientes,1660,0,2,1,16.4071257556470,2018-07-16,1
1013,1,UMF 8 Aguascalientes,1,16,7,2018,13,41,13,48,1,2,,,,2,42,,,,,,,,,,,,,,,,,,,,,,,,,,,,,,,,,,,,2,4,1,1,2,2,1,2,,2,,1,1,1,,2,,,,1,7,1,9,2,,2,,2,,1,9,2,,2,,2,,2,,2,,,,,,,1,1,1,5,1,1,1,5,5,2,13,,,29,,2,5,4,1,1,Aguascalientes,1,UMF 8 Aguascalientes,1660,0,2,1,18.3489617441311,2018-07-16,1
1014,1,UMF 8 Aguascalientes,1,16,7,2018,13,49,14,6,1,2,,,,2,37,,,,,,,,,,,,,,,,,,,,,,,,,,,,,,,,,,,,2,2,1,2,1,2,1,2,,2,,1,1,1,,3,,,,1,10,1,10,2,,2,,2,,1,10,2,,2,,2,,2,,2,,,,,,,1,1,1,2,1,1,1,2,6,,995,,,44,,2,7,4,1,1,Aguascalientes,1,UMF 8 Aguascalientes,1660,0,2,1,15.6708853592976,2018-07-16,1
1015,1,UMF 8 Aguascalientes,1,16,7,2018,14,7,14,21,1,2,,,,2,4,,,,,,,,,,,,,,,,,,,,,,,,,,,,,,,,,,,,1,2,1,1,2,2,1,2,,2,,1,1,1,,2,,,,1,8,1,10,2,,2,,2,,1,10,2,,2,,2,,2,,2,,,,,,,99,1,1,2,2,1,1,3,4,2,13,,,43,,1,2,5,1,1,Aguascalientes,1,UMF 8 Aguascalientes,1660,0,2,1,16.0264985340036,2018-07-16,1
1016,1,UMF 8 Aguascalientes,1,16,7,2018,14,21,14,28,1,2,,,,2,5,,,,,,,,,,,,,,,,,,,,,,,,,,,,,,,,,,,,2,2,1,1,2,2,1,2,,2,,1,1,1,,1,,,,1,10,1,10,2,,2,,2,,1,10,2,,2,,2,,2,,2,,,,,,,1,1,1,1,2,1,1,1,6,,13,,,35,,1,3,5,1,1,Aguascalientes,1,UMF 8 Aguascalientes,1660,0,2,1,16.0264985340036,2018-07-16,1
1017,1,UMF 8 Aguascalientes,1,16,7,2018,14,28,14,42,1,2,,,,2,39,,,,,,,,,,,,,,,,,,,,,,,,,,,,,,,,,,,,2,2,1,1,2,2,1,2,,2,,1,1,1,,2,,,,1,10,1,10,2,,2,,2,,1,10,2,,2,,2,,2,,2,,,,,,,1,1,1,1,1,1,1,1,6,,995,,,26,,2,3,4,1,1,Aguascalientes,1,UMF 8 Aguascalientes,1660,0,2,1,18.3489617441311,2018-07-16,1
1018,1,UMF 8 Aguascalientes,1,16,7,2018,14,43,14,50,2,1,,,,1,47,,,,,,,,,,,,,,,,,,,,,,,,,,,,,,,,,,,,2,2,1,1,2,2,1,2,,2,,1,1,1,,2,,,,1,10,1,10,2,,2,,2,,1,10,2,,2,,2,,99,,2,,,,,,,1,1,1,3,1,1,1,2,2,1,13,,,26,,1,5,5,1,1,Aguascalientes,1,UMF 8 Aguascalientes,1660,0,2,1,18.7653474421171,2018-07-16,1
1019,1,UMF 8 Aguascalientes,1,16,7,2018,16,49,16,56,1,2,,,,2,4,,,,,,,,,,,,,,,,,,,,,,,,,,,,,,,,,,,,1,2,1,1,2,2,1,2,,2,,1,1,1,,1,,,,1,9,1,10,2,,2,,2,,1,9,2,,2,,2,,2,,2,,,,,,,1,1,1,2,2,99,1,2,6,,995,,,61,,2,5,9,1,1,Aguascalientes,1,UMF 8 Aguascalientes,1660,0,2,1,16.0430668150502,2018-07-16,1
1020,1,UMF 8 Aguascalientes,1,16,7,2018,16,57,17,21,1,2,,,,2,5,,,,,,,,,,,,,,,,,,,,,,,,,,,,,,,,,,,,1,1,1,1,2,2,1,2,,2,,1,1,1,,1,,,,1,10,1,10,2,,2,,2,,1,10,2,,2,,2,,2,,2,,,,,,,1,1,1,3,2,99,1,2,6,,995,,,25,,1,9,1,1,1,Aguascalientes,1,UMF 8 Aguascalientes,1660,0,2,1,19.1030159470918,2018-07-16,1
1021,1,UMF 8 Aguascalientes,1,16,7,2018,17,22,17,29,1,2,,,,2,4,,,,,,,,,,,,,,,,,,,,,,,,,,,,,,,,,,,,1,2,1,1,2,2,1,2,,2,,1,1,1,,2,,,,1,10,1,10,2,,99,,2,,1,10,2,,2,,2,,2,,2,,,,,,,1,1,1,2,2,1,1,2,6,,995,,,77,,2,7,9,1,1,Aguascalientes,1,UMF 8 Aguascalientes,1660,0,2,1,15.7705623012569,2018-07-16,1
1022,1,UMF 8 Aguascalientes,1,16,7,2018,17,51,18,14,2,2,,,,2,19,,,,,,,,,,,,,,,,,,,,,,,,,,,,,,,,,,,,1,1,1,1,2,2,1,2,,2,,1,1,1,,2,,,,1,10,1,10,99,,2,,2,,1,10,2,,2,,2,,2,,2,,,,,,,1,1,1,2,2,1,1,2,6,,995,,,23,,1,7,2,1,1,Aguascalientes,1,UMF 8 Aguascalientes,1660,0,2,1,19.1030159470918,2018-07-16,1
1023,1,UMF 8 Aguascalientes,1,16,7,2018,18,14,18,33,1,2,,,,2,9,,,,,,,,,,,,,,,,,,,,,,,,,,,,,,,,,,,,1,1,1,1,2,2,1,2,,2,,1,1,1,,1,,,,1,10,1,10,2,,2,,2,,1,10,2,,2,,2,,2,,2,,,,,,,2,2,2,2,2,2,2,2,6,,1,,,51,,1,5,5,1,1,Aguascalientes,1,UMF 8 Aguascalientes,1660,0,2,1,16.9835261739669,2018-07-16,1
1024,1,UMF 8 Aguascalientes,1,16,7,2018,18,33,18,45,1,2,,,,2,4,,,,,,,,,,,,,,,,,,,,,,,,,,,,,,,,,,,,1,2,1,1,2,2,1,2,,2,,1,1,1,,1,,,,1,9,1,9,2,,2,,2,,1,9,2,,2,,2,,2,,2,,,,,,,99,1,1,2,2,99,1,2,6,,995,,,77,,1,1,5,1,1,Aguascalientes,1,UMF 8 Aguascalientes,1660,0,2,1,16.1284374052006,2018-07-16,1
1025,1,UMF 8 Aguascalientes,1,16,7,2018,18,46,18,53,1,2,,,,2,5,,,,,,,,,,,,,,,,,,,,,,,,,,,,,,,,,,,,1,2,1,1,2,2,1,2,,2,,1,1,1,,2,,,,1,9,1,9,2,,2,,2,,1,8,2,,2,,2,,2,,2,,,,,,,1,1,1,2,2,99,1,2,6,,94,,,54,,2,9,2,1,1,Aguascalientes,1,UMF 8 Aguascalientes,1660,0,2,1,16.6066774413750,2018-07-16,1
1026,1,UMF 8 Aguascalientes,1,16,7,2018,8,24,8,37,1,3,,,,3,9,,,,,,,,,,,,,,,,,,,,,,,,,,,,,,,,,,,,2,3,1,1,2,2,99,2,,2,,1,1,1,,2,,,,1,8,1,9,2,,2,,2,,1,8,2,,2,,2,,2,,2,,,,,,,1,1,1,2,2,1,1,2,6,,9,,,57,,1,5,12,1,1,Aguascalientes,1,UMF 8 Aguascalientes,1660,0,2,1,16.4071257556470,2018-07-16,1
1027,1,UMF 8 Aguascalientes,1,16,7,2018,8,37,8,44,1,2,,,,2,65,,,,,,,,,,,,,,,,,,,,,,,,,,,,,,,,,,,,1,1,1,1,2,2,1,2,,2,,1,1,1,,2,,,,1,9,1,10,2,,2,,2,,1,10,2,,2,,2,,2,,2,,,,,,,1,1,1,3,2,99,1,2,6,,995,,,36,,2,5,4,1,1,Aguascalientes,1,UMF 8 Aguascalientes,1660,0,2,1,15.6708853592976,2018-07-16,1
1028,1,UMF 8 Aguascalientes,1,16,7,2018,8,47,9,2,1,2,,,,2,39,,,,,,,,,,,,,,,,,,,,,,,,,,,,,,,,,,,,2,1,1,1,2,2,1,2,,2,,1,1,1,,2,,,,2,,1,9,2,,2,,2,,1,8,2,,2,,2,,2,,2,,,,,,,1,1,1,97,,1,1,2,6,,10,9,,44,,2,3,12,1,1,Aguascalientes,1,UMF 8 Aguascalientes,1660,0,2,1,15.6708853592976,2018-07-16,1
1029,1,UMF 8 Aguascalientes,1,16,7,2018,9,2,9,21,1,1,,,,1,51,,,,,,,,,,,,,,,,,,,,,,,,,,,,,,,,,,,,2,2,1,1,2,2,1,2,,1,1,1,1,1,,1,,,,1,10,1,10,1,9,2,,2,,1,10,2,,2,,2,,2,,2,,,,,,,1,1,1,97,,1,1,2,6,,995,,,28,,1,6,5,1,1,Aguascalientes,1,UMF 8 Aguascalientes,1660,0,2,1,18.7653474421171,2018-07-16,1
1030,1,UMF 8 Aguascalientes,1,16,7,2018,10,7,10,15,1,3,,,,3,41,,,,,,,,,,,,,,,,,,,,,,,,,,,,,,,,,,,,2,1,1,1,2,2,1,2,,1,2,2,2,,,2,,,,1,9,1,9,2,,2,,2,,2,,2,,2,,2,,2,,2,,,,,,,1,1,1,1,1,1,1,2,6,,1,15,9,59,,1,5,5,1,1,Aguascalientes,1,UMF 8 Aguascalientes,1660,0,2,1,16.4071257556470,2018-07-16,1
1031,1,UMF 8 Aguascalientes,1,16,7,2018,10,57,11,14,1,2,,,,2,27,,,,,,,,,,,,,,,,,,,,,,,,,,,,,,,,,,,,1,1,1,1,2,2,1,2,,2,,1,1,1,,1,,,,1,10,1,10,2,,2,,2,,2,,1,10,2,,2,,2,,2,,,,,,,1,1,1,2,2,1,1,2,2,1,995,,,69,,1,3,5,1,1,Aguascalientes,1,UMF 8 Aguascalientes,1660,0,2,1,16.1284374052006,2018-07-16,1
1032,1,UMF 8 Aguascalientes,1,16,7,2018,11,15,11,28,1,2,,,,1,4,,,,,,,,,,,,,,,,,,,,,,,,,,,,,,,,,,,,1,1,1,1,2,2,1,2,,1,1,1,1,1,,1,,,,1,10,1,10,2,,2,,2,,1,10,2,,2,,2,,2,,2,,,,,,,1,1,1,2,2,1,1,2,6,,15,,,78,,2,3,9,1,1,Aguascalientes,1,UMF 8 Aguascalientes,1660,0,2,1,15.7705623012569,2018-07-16,1
1033,1,UMF 8 Aguascalientes,1,16,7,2018,11,52,12,7,1,2,,,,2,4,,,,,,,,,,,,,,,,,,,,,,,,,,,,,,,,,,,,1,1,1,1,2,2,1,2,,1,1,1,1,1,,1,,,,1,10,1,10,2,,2,,2,,1,10,2,,2,,2,,2,,2,,,,,,,1,1,1,3,2,1,1,3,6,,13,,,65,,1,7,5,1,1,Aguascalientes,1,UMF 8 Aguascalientes,1660,0,2,1,16.1284374052006,2018-07-16,1
1034,1,UMF 8 Aguascalientes,1,16,7,2018,12,7,12,16,1,2,,,,2,5,,,,,,,,,,,,,,,,,,,,,,,,,,,,,,,,,,,,2,1,1,1,2,2,1,2,,2,,1,1,1,,1,,,,1,9,1,10,2,,2,,2,,1,9,2,,2,,2,,2,,2,,,,,,,1,1,1,97,,1,1,2,6,,9,8,1,27,,1,7,11,1,1,Aguascalientes,1,UMF 8 Aguascalientes,1660,0,2,1,18.7653474421171,2018-07-16,1
1035,1,UMF 8 Aguascalientes,1,16,7,2018,12,39,12,50,1,2,,,,2,27,,,,,,,,,,,,,,,,,,,,,,,,,,,,,,,,,,,,2,1,1,1,2,2,1,1,1,2,,1,1,1,,4,2,,,1,10,1,1,2,,2,,2,,1,8,2,,2,,2,,99,,2,,,,,,,1,2,2,2,2,1,2,3,6,,1,,,36,,1,7,12,1,1,Aguascalientes,1,UMF 8 Aguascalientes,1660,0,2,1,16.0264985340036,2018-07-16,1
1036,1,UMF 8 Aguascalientes,1,16,7,2018,12,52,13,0,1,2,,,,2,20,,,,,,,,,,,,,,,,,,,,,,,,,,,,,,,,,,,,2,3,1,1,2,2,1,2,,2,,1,1,1,,1,,,,1,10,1,10,2,,2,,2,,1,9,2,,2,,2,,2,,2,,,,,,,1,1,1,2,1,1,1,3,6,,13,,,63,,2,3,12,1,1,Aguascalientes,1,UMF 8 Aguascalientes,1660,0,2,1,16.0430668150502,2018-07-16,1
1037,1,UMF 8 Aguascalientes,1,16,7,2018,14,51,14,58,1,2,,,,2,5,,,,,,,,,,,,,,,,,,,,,,,,,,,,,,,,,,,,2,4,1,1,2,2,1,2,,2,,1,1,1,,2,,,,1,10,1,10,2,,2,,2,,1,9,2,,2,,2,,2,,2,,,,,,,1,1,1,2,2,1,1,3,6,,13,,,63,,1,9,5,1,1,Aguascalientes,1,UMF 8 Aguascalientes,1660,0,2,1,16.4071257556470,2018-07-16,1
1038,1,UMF 8 Aguascalientes,1,16,7,2018,14,58,15,5,1,2,,,,2,61,,,,,,,,,,,,,,,,,,,,,,,,,,,,,,,,,,,,1,1,1,1,2,2,1,2,,2,,2,2,,,2,,,,1,9,1,10,2,,2,,2,,2,,2,,2,,2,,2,,2,,,,,,,99,1,1,1,1,1,1,2,6,,13,,,52,,1,1,12,1,1,Aguascalientes,1,UMF 8 Aguascalientes,1660,0,2,1,16.9835261739669,2018-07-16,1
1039,1,UMF 8 Aguascalientes,1,16,7,2018,15,15,15,22,1,2,,,,2,39,,,,,,,,,,,,,,,,,,,,,,,,,,,,,,,,,,,,1,4,1,1,2,2,1,2,,1,2,1,1,1,,2,,,,1,10,1,10,2,,2,,2,,1,9,2,,2,,2,,2,,2,,,,,,,1,1,1,1,2,1,1,1,6,,995,,,58,,2,7,12,1,1,Aguascalientes,1,UMF 8 Aguascalientes,1660,0,2,1,16.0430668150502,2018-07-16,1
1040,1,UMF 8 Aguascalientes,1,16,7,2018,15,22,15,29,1,2,,,,2,999,,,,,,,,,,,,,,,,,,,,,,,,,,,,,,,,,,,,1,1,1,1,2,2,1,2,,2,,1,1,1,,2,,,,1,10,1,10,2,,2,,2,,1,9,2,,2,,2,,2,,2,,,,,,,1,1,1,97,,1,1,2,6,,995,,,53,,1,3,11,1,1,Aguascalientes,1,UMF 8 Aguascalientes,1660,0,2,1,16.9835261739669,2018-07-16,1
1041,1,UMF 8 Aguascalientes,1,16,7,2018,15,30,15,41,1,2,,,,1,5,,,,,,,,,,,,,,,,,,,,,,,,,,,,,,,,,,,,2,3,1,1,2,2,1,2,,2,,1,1,1,,2,,,,1,10,1,10,2,,2,,2,,2,,2,,2,,2,,2,,2,,,,,,,1,1,1,97,,1,1,2,6,,1,13,,31,,1,5,5,1,1,Aguascalientes,1,UMF 8 Aguascalientes,1660,0,2,1,18.7653474421171,2018-07-16,1
1042,1,UMF 8 Aguascalientes,1,16,7,2018,16,5,16,12,1,2,,,,2,22,,,,,,,,,,,,,,,,,,,,,,,,,,,,,,,,,,,,1,1,1,1,2,2,1,2,,1,1,1,1,1,,2,,,,1,9,1,10,2,,2,,2,,99,,2,,2,,2,,2,,2,,,,,,,1,1,1,1,2,1,1,2,6,,1,13,,84,,2,1,9,1,1,Aguascalientes,1,UMF 8 Aguascalientes,1660,0,2,1,15.7705623012569,2018-07-16,1
1043,1,UMF 8 Aguascalientes,1,16,7,2018,16,33,16,53,1,2,,,,2,27,,,,,,,,,,,,,,,,,,,,,,,,,,,,,,,,,,,,1,1,1,1,2,2,1,2,,2,,1,1,1,,2,,,,1,9,1,10,2,,2,,2,,1,7,99,,2,,2,,2,,2,,,,,,,2,1,1,2,2,1,1,2,6,,1,15,,66,,1,1,5,1,1,Aguascalientes,1,UMF 8 Aguascalientes,1660,0,2,1,16.1284374052006,2018-07-16,1
1044,1,UMF 8 Aguascalientes,1,16,7,2018,16,53,17,18,1,2,,,,2,9,,,,,,,,,,,,,,,,,,,,,,,,,,,,,,,,,,,,2,3,1,1,2,2,1,2,,1,1,1,1,1,,2,,,,1,10,1,9,2,,2,,2,,1,9,2,,2,,2,,2,,2,,,,,,,1,1,1,1,1,1,1,3,6,,13,,,40,,2,5,12,1,1,Aguascalientes,1,UMF 8 Aguascalientes,1660,0,2,1,15.6708853592976,2018-07-16,1
1045,1,UMF 8 Aguascalientes,1,16,7,2018,17,18,17,25,1,2,,,,2,5,,,,,,,,,,,,,,,,,,,,,,,,,,,,,,,,,,,,1,1,1,1,2,2,1,2,,2,,1,1,1,,2,,,,1,9,1,10,2,,2,,2,,1,8,2,,2,,2,,2,,2,,,,,,,1,1,1,97,,99,1,2,6,,1,,,36,,1,5,5,1,1,Aguascalientes,1,UMF 8 Aguascalientes,1660,0,2,1,16.0264985340036,2018-07-16,1
1046,1,UMF 8 Aguascalientes,1,16,7,2018,17,51,18,9,1,2,,,,2,61,,,,,,,,,,,,,,,,,,,,,,,,,,,,,,,,,,,,2,6,1,2,2,2,1,2,,1,1,2,2,,,2,,,,1,6,1,10,2,,2,,2,,2,,2,,2,,2,,2,,2,,,,,,,1,1,1,1,2,1,1,3,3,2,13,,,40,,1,7,5,1,1,Aguascalientes,1,UMF 8 Aguascalientes,1660,0,2,1,16.0264985340036,2018-07-16,1
1047,1,UMF 8 Aguascalientes,1,16,7,2018,18,23,18,30,1,4,1,,,2,999,,,,,,,,,,,,,,,,,,,,,,,,,,,,,,,,,,,,2,1,2,2,2,2,2,2,,2,,2,2,,,3,,,,1,10,1,5,2,,2,,2,,2,,2,,2,,2,,2,,2,,,,,,,2,2,2,97,,1,1,2,4,2,1,,,72,,2,7,4,1,1,Aguascalientes,1,UMF 8 Aguascalientes,1660,0,2,1,15.7705623012569,2018-07-16,1
1048,1,UMF 8 Aguascalientes,1,16,7,2018,18,38,19,3,1,2,,,,2,21,,,,,,,,,,,,,,,,,,,,,,,,,,,,,,,,,,,,1,1,2,2,2,2,1,1,2,2,,1,1,1,,1,,,,1,10,1,10,2,,2,,2,,2,,2,,2,,2,,2,,2,,,,,,,1,1,1,3,1,99,1,3,6,,13,,,45,,1,5,11,1,1,Aguascalientes,1,UMF 8 Aguascalientes,1660,0,2,1,16.9835261739669,2018-07-16,1
1049,1,UMF 8 Aguascalientes,1,16,7,2018,19,13,19,33,1,2,,,,2,51,,,,,,,,,,,,,,,,,,,,,,,,,,,,,,,,,,,,1,2,2,1,1,2,1,2,,2,,1,1,1,,2,,,,1,10,1,7,1,8,2,,2,,1,9,2,,2,,2,,2,,2,,,,,,,2,1,1,97,,99,1,2,2,99,1,13,,23,,1,5,11,1,1,Aguascalientes,1,UMF 8 Aguascalientes,1660,0,2,1,19.1030159470918,2018-07-16,1
1050,1,UMF 8 Aguascalientes,1,16,7,2018,8,8,8,15,1,2,,,,2,27,,,,,,,,,,,,,,,,,,,,,,,,,,,,,,,,,,,,2,1,1,1,2,2,1,2,,2,,1,1,1,,2,,,,1,10,1,10,2,,2,,2,,1,8,2,,2,,2,,2,,2,,,,,,,1,1,2,4,2,1,1,2,6,,995,,,62,,1,5,5,1,1,Aguascalientes,1,UMF 8 Aguascalientes,1660,0,2,1,16.4071257556470,2018-07-16,1
1051,1,UMF 8 Aguascalientes,1,16,7,2018,8,38,8,45,1,2,,,,2,4,,,,,,,,,,,,,,,,,,,,,,,,,,,,,,,,,,,,1,1,1,2,1,2,1,2,,2,,1,1,1,,2,,,,1,10,1,10,2,,2,,2,,1,10,2,,2,,2,,2,,2,,,,,,,1,1,1,3,2,1,1,2,6,,9,,,39,,2,6,4,1,1,Aguascalientes,1,UMF 8 Aguascalientes,1660,0,2,1,15.6708853592976,2018-07-16,1
1052,1,UMF 8 Aguascalientes,1,16,7,2018,8,45,8,55,1,2,,,,2,13,,,,,,,,,,,,,,,,,,,,,,,,,,,,,,,,,,,,2,2,1,1,2,2,1,2,,2,,1,1,1,,2,,,,1,5,1,10,2,,2,,2,,1,8,2,,2,,2,,2,,2,,,,,,,1,1,1,4,1,1,1,2,6,,1,,,32,,2,5,4,1,1,Aguascalientes,1,UMF 8 Aguascalientes,1660,0,2,1,18.3489617441311,2018-07-16,1
1053,1,UMF 8 Aguascalientes,1,16,7,2018,8,56,9,6,1,4,1,,,3,54,,,,,,,,,,,,,,,,,,,,,,,,,,,,,,,,,,,,1,2,1,1,2,2,1,2,,2,,1,1,1,,2,,,,1,1,1,10,2,,2,,2,,1,8,2,,2,,2,,2,,2,,,,,,,1,1,1,3,2,1,1,4,5,2,1,,,59,,2,7,4,1,1,Aguascalientes,1,UMF 8 Aguascalientes,1660,0,2,1,16.0430668150502,2018-07-16,1
1054,1,UMF 8 Aguascalientes,1,16,7,2018,9,24,9,37,1,2,,,,2,25,,,,,,,,,,,,,,,,,,,,,,,,,,,,,,,,,,,,1,1,1,1,2,2,1,2,,2,,1,1,1,,2,,,,1,9,1,10,2,,2,,2,,1,10,2,,2,,2,,2,,2,,,,,,,1,1,1,3,1,1,1,2,2,99,995,,,80,,2,6,9,1,1,Aguascalientes,1,UMF 8 Aguascalientes,1660,0,2,1,15.7705623012569,2018-07-16,1
1055,1,UMF 8 Aguascalientes,1,16,7,2018,9,37,9,56,1,2,,,,2,27,,,,,,,,,,,,,,,,,,,,,,,,,,,,,,,,,,,,1,1,1,2,1,2,1,2,,2,,1,1,1,,2,,,,1,8,1,9,2,,2,,2,,1,8,2,,2,,2,,2,,2,,,,,,,1,1,1,4,2,1,1,3,6,,995,,,62,,1,5,5,1,1,Aguascalientes,1,UMF 8 Aguascalientes,1660,0,2,1,16.4071257556470,2018-07-16,1
1056,1,UMF 8 Aguascalientes,1,16,7,2018,10,25,10,32,2,2,,,,2,19,,,,,,,,,,,,,,,,,,,,,,,,,,,,,,,,,,,,1,3,1,1,2,2,1,2,,2,,1,1,2,3,2,,,,1,9,1,2,2,,2,,2,,1,6,2,,2,,2,,2,,2,,,,,,,1,1,1,3,2,1,1,2,6,,1,,,53,,1,6,5,1,1,Aguascalientes,1,UMF 8 Aguascalientes,1660,0,2,1,16.9835261739669,2018-07-16,1
1057,1,UMF 8 Aguascalientes,1,16,7,2018,10,35,10,44,1,2,,,,2,1,37,2,,3,,,1,,3,,,,,,,,,,,,,,,,,,,,,,,,,,,1,2,1,99,1,2,1,2,,2,,2,2,,,2,,,,1,9,1,9,2,,2,,99,,2,,2,,2,,2,,2,,2,,,,,,,1,1,1,3,2,1,1,2,6,,995,,,20,,1,6,6,1,1,Aguascalientes,1,UMF 8 Aguascalientes,1660,0,2,1,19.1030159470918,2018-07-16,1
1059,1,UMF 8 Aguascalientes,1,16,7,2018,11,21,11,30,1,2,,,,2,4,,,,,,,,,,,,,,,,,,,,,,,,,,,,,,,,,,,,1,1,1,1,2,2,2,1,2,1,2,1,1,1,,2,,,,1,8,1,8,1,8,2,,2,,1,8,2,,1,8,2,,2,,2,,,,,,,1,1,1,3,2,1,1,2,3,2,10,9,8,78,,1,4,5,1,1,Aguascalientes,1,UMF 8 Aguascalientes,1660,0,2,1,16.1284374052006,2018-07-16,1
1060,1,UMF 8 Aguascalientes,1,16,7,2018,11,52,11,59,2,4,1,,,4,43,,,,,,,,,,,,,,,,,,,,,,,,,,,,,,,,,,,,2,1,2,1,2,2,1,2,,2,,2,2,,,3,,,,2,,2,,1,10,2,,2,,2,,2,,2,,1,8,2,,2,,,,,,,1,1,1,1,1,1,1,2,5,2,1,,,20,,1,6,5,1,1,Aguascalientes,1,UMF 8 Aguascalientes,1660,0,2,1,19.1030159470918,2018-07-16,1
1062,1,UMF 8 Aguascalientes,1,16,7,2018,12,23,12,32,1,4,3,,,3,59,,,,,,,,,,,,,,,,,,,,,,,,,,,,,,,,,,,,2,1,1,1,2,2,1,2,,2,,1,1,1,,3,,,,1,8,1,8,2,,2,,2,,2,,2,,2,,2,,1,8,2,,,,,,,1,1,1,4,2,1,1,2,3,1,1,2,3,65,,1,5,5,1,1,Aguascalientes,1,UMF 8 Aguascalientes,1660,0,2,1,16.1284374052006,2018-07-16,1
1063,1,UMF 8 Aguascalientes,1,16,7,2018,12,53,13,12,1,3,,,,3,15,,,,,,,,,,,,,,,,,,,,,,,,,,,,,,,,,,,,1,1,2,1,2,2,1,2,,1,3,1,1,1,,2,,,,1,9,1,10,2,,2,,2,,1,10,2,,2,,2,,2,,2,,,,,,,1,1,1,1,2,1,1,2,6,,9,3,12,56,,1,6,1,1,1,Aguascalientes,1,UMF 8 Aguascalientes,1660,0,2,1,16.4071257556470,2018-07-16,1
1064,1,UMF 8 Aguascalientes,1,16,7,2018,13,12,13,19,1,2,,,,2,15,,,,,,,,,,,,,,,,,,,,,,,,,,,,,,,,,,,,2,1,1,1,2,2,1,2,,2,,1,1,1,,2,,,,1,10,1,10,2,,2,,2,,1,10,2,,2,,2,,2,,2,,,,,,,1,1,1,5,2,99,1,2,6,,995,,,66,,2,5,10,1,1,Aguascalientes,1,UMF 8 Aguascalientes,1660,0,2,1,15.7705623012569,2018-07-16,1
1065,1,UMF 8 Aguascalientes,1,16,7,2018,15,1,15,8,1,2,,,,2,5,,,,,,,,,,,,,,,,,,,,,,,,,,,,,,,,,,,,2,3,1,1,2,2,1,2,,2,,1,1,1,,2,,,,1,6,1,10,2,,2,,2,,1,9,2,,2,,2,,2,,1,8,,,,,,1,1,1,1,2,1,1,2,6,,995,,,20,,2,7,4,1,1,Aguascalientes,1,UMF 8 Aguascalientes,1660,0,2,1,18.6791376973924,2018-07-16,1
1066,1,UMF 8 Aguascalientes,1,16,7,2018,15,18,15,25,1,3,,,,3,5,,,,,,,,,,,,,,,,,,,,,,,,,,,,,,,,,,,,2,2,1,1,2,2,1,2,,2,,1,1,1,,2,,,,1,8,1,10,2,,2,,2,,1,8,2,,2,,2,,2,,2,,,,,,,1,1,1,5,1,1,1,2,6,,995,,,47,,2,5,4,1,1,Aguascalientes,1,UMF 8 Aguascalientes,1660,0,2,1,16.6066774413750,2018-07-16,1
1067,1,UMF 8 Aguascalientes,1,16,7,2018,15,27,15,35,1,5,1,3,,3,20,,,,,,,,,,,,,,,,,,,,,,,,,,,,,,,,,,,,2,2,1,1,2,2,1,2,,2,,1,1,1,,2,,,,1,8,1,8,2,,2,,2,,1,8,2,,2,,2,,2,,1,5,5,,,,,1,1,1,5,1,1,1,3,5,2,1,13,,35,,1,6,4,1,1,Aguascalientes,1,UMF 8 Aguascalientes,1660,0,2,1,16.0264985340036,2018-07-16,1
1068,1,UMF 8 Aguascalientes,1,16,7,2018,15,36,15,54,1,2,,,,2,4,,,,,,,,,,,,,,,,,,,,,,,,,,,,,,,,,,,,1,2,1,1,2,2,1,2,,2,,1,1,1,,2,,,,1,8,1,8,2,,2,,2,,1,8,2,,2,,2,,2,,2,,,,,,,1,1,1,2,2,1,1,3,4,2,14,,,42,,2,6,4,1,1,Aguascalientes,1,UMF 8 Aguascalientes,1660,0,2,1,15.6708853592976,2018-07-16,1
1069,1,UMF 8 Aguascalientes,1,16,7,2018,15,55,16,2,1,2,,,,2,99,,,,,,,,,,,,,,,,,,,,,,,,,,,,,,,,,,,,1,1,1,1,2,2,1,2,,2,,1,1,1,,2,,,,1,10,1,10,2,,2,,2,,1,9,2,,1,8,2,,2,,2,,,,,,,1,1,1,2,1,1,1,2,6,,1,3,13,66,,2,7,4,1,1,Aguascalientes,1,UMF 8 Aguascalientes,1660,0,2,1,15.7705623012569,2018-07-16,1
1070,1,UMF 8 Aguascalientes,1,16,7,2018,16,25,16,32,1,4,1,,,4,20,,,,,,,,,,,,,,,,,,,,,,,,,,,,,,,,,,,,1,2,2,2,2,2,1,2,,2,,1,1,2,1,3,,,,1,8,1,6,2,,2,,2,,1,8,2,,2,,2,,2,,2,,,,,,,2,1,1,2,3,1,1,2,6,,1,,,60,,1,7,9,1,1,Aguascalientes,1,UMF 8 Aguascalientes,1660,0,2,1,16.4071257556470,2018-07-16,1
1071,1,UMF 8 Aguascalientes,1,16,7,2018,16,54,17,16,1,2,,,,2,32,,,,,,,,,,,,,,,,,,,,,,,,,,,,,,,,,,,,2,4,,1,2,2,1,2,,2,,1,1,1,,2,,,,1,8,1,10,2,,2,,2,,1,8,2,,2,,2,,2,,2,,,,,,,1,1,1,3,2,1,1,2,2,1,8,,,54,,1,5,5,1,1,Aguascalientes,1,UMF 8 Aguascalientes,1660,0,2,1,16.9835261739669,2018-07-16,1
1072,1,UMF 8 Aguascalientes,1,16,7,2018,17,16,17,40,1,2,,,,2,12,,,,,,,,,,,,,,,,,,,,,,,,,,,,,,,,,,,,2,4,2,2,2,2,1,2,,2,,1,1,2,1,2,,,,1,8,1,7,2,,2,,2,,1,7,2,,2,,2,,2,,2,,,,,,,1,1,1,2,1,1,1,2,6,,1,,,35,,2,6,4,1,1,Aguascalientes,1,UMF 8 Aguascalientes,1660,0,2,1,15.6708853592976,2018-07-16,1
1073,1,UMF 8 Aguascalientes,1,16,7,2018,17,40,18,5,1,2,,,,2,1,28,2,,3,,,1,,,,,,,,,,,,,,,,,,,,,,,,,,,,,1,2,1,2,2,2,1,2,,2,,1,1,1,,2,,,,1,7,1,10,2,,2,,2,,1,10,2,,2,,2,,2,,2,,,,,,,1,1,1,3,2,1,1,3,6,,9,8,,23,,1,7,5,1,1,Aguascalientes,1,UMF 8 Aguascalientes,1660,0,2,1,19.1030159470918,2018-07-16,1
1074,1,UMF 8 Aguascalientes,1,16,7,2018,18,5,18,26,1,2,,,,2,4,,,,,,,,,,,,,,,,,,,,,,,,,,,,,,,,,,,,1,1,1,2,2,2,1,2,,2,,1,1,1,,2,,,,1,8,1,9,2,,2,,2,,1,8,2,,2,,2,,2,,2,,,,,,,1,1,1,3,2,1,1,2,6,,14,,,67,,2,6,9,1,1,Aguascalientes,1,UMF 8 Aguascalientes,1660,0,2,1,15.7705623012569,2018-07-16,1
1075,1,UMF 8 Aguascalientes,1,16,7,2018,18,27,18,34,1,3,,,,3,4,,,,,,,,,,,,,,,,,,,,,,,,,,,,,,,,,,,,1,1,1,2,2,2,1,2,,2,,1,1,1,,2,,,,1,8,1,8,2,,2,,2,,1,8,2,,1,8,2,,2,,2,,,,,,,1,1,1,3,1,1,1,2,6,,1,3,14,53,,1,7,5,1,1,Aguascalientes,1,UMF 8 Aguascalientes,1660,0,2,1,16.9835261739669,2018-07-16,1
1076,1,UMF 8 Aguascalientes,1,16,7,2018,19,3,19,10,1,2,,,,2,4,,,,,,,,,,,,,,,,,,,,,,,,,,,,,,,,,,,,1,1,1,1,2,2,1,2,,2,,1,1,1,,2,,,,1,10,1,10,2,,2,,2,,1,10,2,,2,,2,,2,,2,,,,,,,1,1,1,4,2,1,1,2,3,1,995,,,61,,2,7,9,1,1,Aguascalientes,1,UMF 8 Aguascalientes,1660,0,2,1,16.0430668150502,2018-07-16,1
1077,1,UMF 8 Aguascalientes,1,16,7,2018,8,30,8,40,1,2,,,,2,33,,,,,,,,,,,,,,,,,,,,,,,,,,,,,,,,,,,,2,1,2,1,2,2,2,1,4,2,,1,1,1,,1,,,,1,6,1,8,2,,2,,2,,1,10,2,,2,,2,,2,,2,,,,,,,2,1,1,3,1,1,1,2,6,,1,3,,53,,1,6,4,1,1,Aguascalientes,1,UMF 8 Aguascalientes,1660,0,2,1,16.9835261739669,2018-07-16,1
1078,1,UMF 8 Aguascalientes,1,16,7,2018,8,41,8,48,2,4,8,,,2,7,,,,,,,,,,,,,,,,,,,,,,,,,,,,,,,,,,,,2,3,1,1,2,2,1,2,,2,,2,2,,,1,,,,1,8,1,10,2,,2,,2,,2,,2,,2,,2,,2,,1,10,,,,,,1,1,1,1,1,1,1,2,3,1,1,14,,35,,1,5,5,1,1,Aguascalientes,1,UMF 8 Aguascalientes,1660,0,2,1,16.0264985340036,2018-07-16,1
1079,1,UMF 8 Aguascalientes,1,16,7,2018,8,53,9,5,1,1,,,,1,15,,,,,,,,,,,,,,,,,,,,,,,,,,,,,,,,,,,,2,2,1,1,2,2,1,1,2,2,,1,1,1,,1,,,,1,10,1,10,2,,2,,2,,2,,2,,2,,2,,2,,2,,,,,,,2,1,1,3,2,1,1,2,2,1,9,8,,40,,2,5,1,1,1,Aguascalientes,1,UMF 8 Aguascalientes,1660,0,2,1,15.6708853592976,2018-07-16,1