Folio,Deleg,Unidmed,Id_Unid,Fecha_D,Fecha_M,Fecha_A,Hr_Ini_H,Hr_Ini_M,Hr_Fin_H,Hr_Fin_M,Edad,Tipopac,Edoproc,Id_Unidproc,Sat1,Sat1_Mot1,Sat1_Mot2,Sat1_Mot3,Sat3,Filtroch,Probsal,Semambe,Cartembe,Utilcartembe,Portale,Ingportale,Infoportale,Anticoncepe,Noanticoncepe,Tourobse,Infotourobse,Cartembp,Utilcartembp,Portalp,Ingportalp,Infoportalp,Tourobsp,Infotourobsp,Comunincomp,Motcomunincomp1,Motcomunincomp2,Motcomunincomp3,Infoprocp,Anticoncepp,Noanticoncepp,Tactop,Autortactop,Metdolor,Presentp,Dudasemb,Infoedosaludp,Infomabbp,Califembp,Motcalifembp1,Motcalifembp2,Motcalifembp3,Especialid,Tipocons,Tmedreg3,Satiemesp,Pres_Med,Durasis_C,Preosad,Tratocomf,Comincomcons,Consdesp,Filtrosaux1,Temsad1,Temsad1b,Filtrosaux2,Temsad2,Temsad2b,Recmedhoy,Filtrofarm2,Totmed,Motnosurt,Filtrourg,Probsal_Urg,Mot_Urg,Atnurg,Noatnurg,Turgtriag,Turgtriag2,Tram_Urg,Cartcol,Medenfcol,Clasiftiem,Calteurg,Califurg,Motcalifurg1,Motcalifurg2,Motcalifurg3,Filtrocir,Progciru,Topera,Fechaop,Suspop1,Suspop3,Suspop2,Suspop4,Motoper,Opfinsem,Infofam1,Infofam,Medciru,Medciru2,Calciru,Motcalifcir1,Motcalifcir2,Motcalifcir3,Trabsocciru,Ciclocir,Filtrohos,Tobscama,Razontesp,Infprealta,Calhosp,Motcalifhosp1,Motcalifhosp2,Motcalifhosp3,Btratou,Btratou_Mot1,Btratou_Mot2,Btratou_Mot3,Calfatna_A,Calfatnb_A,Calfatna_B,Calfatnb_B,Calfatna_C,Calfatnb_C,Calfatna_E,Calfatnb_E,Calfatna_G,Calfatnb_G,Calfatna_H,Calfatnb_H,Calfatna_I,Calfatnb_I,Calfatna_J,Calfatnb_J,Calfatna_K,Calfatnb_K,Calfatna_L,Calfatnb_L,Calfatna_M,Calfatnb_M,Calfatna_N,Calfatnb_N,Calfatna_F,Calfatnb_F,Mottratot1,Mottratot2,Mottratot3,Mottratot4,Mottratot5,Saludar,Escuchar,Responder,Tiemuv,Mejoratratou,Gafet,Amable,Calfinmb_F,Limp1,Limp2,Recomej_A,Recomej_B,Recomej_C,Sexo,Escolar,Ocupa,Id_Unidad,Cve_Delegaci�N,Delegaci�N,Nivel,Unidad,Promedio_Diario2017,Microzona,Estrato,Moscondia,Fe_Finalnr,Fecha,Entidad
30010064,7,Hospital de Especialidades No. 71 Torre�n,3001,11,7,2018,9,51,10,13,34,1,5,247,2,,,,2,1,7,,,,,,,,,,,,,,,,,,,,,,,,,,,,,,,,,,,,5,1,3,2,1,1,1,2,2,1,2,,,2,,,2,2,,,2,,,,,,,,,,,,,,,,2,,,,,,,,,,,,,,,,,,,,2,,,,,,,,2,,,,1,8,2,,1,10,1,10,2,,2,,2,,2,,2,,2,,2,,2,,2,,,,,,,1,1,1,97,,1,1,2,2,99,1,,,1,5,5,3001,7,Coahuila,3,Hospital de Especialidades No. 71 Torre�n,414,0,232,1,4.92411469561769,2018-07-11,5
30010070,7,Hospital de Especialidades No. 71 Torre�n,3001,11,7,2018,11,45,12,5,32,1,5,9888,2,,,,2,1,32,,,,,,,,,,,,,,,,,,,,,,,,,,,,,,,,,,,,9,1,3,2,1,2,1,2,2,1,1,7,2,2,,,1,1,1,,2,,,,,,,,,,,,,,,,2,,,,,,,,,,,,,,,,,,,,2,,,,,,,,2,,,,1,9,2,,1,9,2,,2,,2,,2,,2,,2,,2,,99,,1,9,2,,,,,,,2,2,2,97,,2,1,2,3,2,1,,,1,9,10,3001,7,Coahuila,3,Hospital de Especialidades No. 71 Torre�n,414,0,232,1,4.92411469561769,2018-07-11,5
30010075,7,Hospital de Especialidades No. 71 Torre�n,3001,11,7,2018,14,29,14,43,56,1,5,246,2,,,,2,1,38,,,,,,,,,,,,,,,,,,,,,,,,,,,,,,,,,,,,14,1,2,2,1,1,1,2,2,1,1,3,2,2,,,1,1,1,,1,29,1,1,,1,,1,1,1,1,2,2,,,,2,,,,,,,,,,,,,,,,,,,,2,,,,,,,,2,,,,1,10,2,,1,10,2,,1,9,2,,2,,2,,1,5,2,,2,,1,9,2,,,,,,,1,1,1,1,2,1,1,2,2,2,1,40,,1,7,5,3001,7,Coahuila,3,Hospital de Especialidades No. 71 Torre�n,414,0,232,1,5.28187179940335,2018-07-11,5
30010076,7,Hospital de Especialidades No. 71 Torre�n,3001,11,7,2018,15,45,15,58,52,1,5,233,2,,,,2,1,2,,,,,,,,,,,2,,3,,,2,2,3,1,,,1,1,,2,,2,2,1,2,2,2,,,,999,1,1,2,1,1,1,2,2,1,1,3,1,1,4,1,1,1,1,,2,,,,,,,,,,,,,,,,2,,,,,,,,,,,,,,,,,,,,1,5,2,1,2,,,,2,,,,1,9,1,9,1,10,1,10,2,,2,,2,,2,,2,,2,,2,,1,9,2,,,,,,,1,1,1,1,1,1,1,2,5,2,1,12,13,1,7,5,3001,7,Coahuila,3,Hospital de Especialidades No. 71 Torre�n,414,0,232,1,4.96839115166463,2018-07-11,5
30010081,7,Hospital de Especialidades No. 71 Torre�n,3001,11,7,2018,18,13,18,29,37,1,5,248,2,,,,2,1,15,,,,,,,,,,,,,,,,,,,,,,,,,,,,,,,,,,,,21,1,4,2,2,1,1,2,2,2,1,1,1,2,,,1,1,1,,2,,,,,,,,,,,,,,,,2,,,,,,,,,,,,,,,,,,,,2,,,,,,,,2,,,,1,8,2,,1,6,2,,2,,2,,2,,2,,2,,2,,2,,1,10,2,,,,,,,1,1,1,1,2,99,2,2,6,,1,45,,1,7,5,3001,7,Coahuila,3,Hospital de Especialidades No. 71 Torre�n,414,0,232,1,4.88039935232926,2018-07-11,5
30010001,7,Hospital de Especialidades No. 71 Torre�n,3001,11,7,2018,9,38,9,51,34,1,5,255,1,,,,1,1,11,,,,,,,,,,,,,,,,,,,,,,,,,,,,,,,,,,,,9,2,3,2,1,1,1,2,2,1,1,4,1,2,,,2,2,,,2,,,,,,,,,,,,,,,,2,,,,,,,,,,,,,,,,,,,,2,,,,,,,,1,,,,1,10,1,10,1,10,1,10,1,10,2,,2,,2,,1,10,2,,2,,2,,2,,,,,,,1,1,1,2,2,1,1,2,4,2,1,13,,2,5,2,3001,7,Coahuila,3,Hospital de Especialidades No. 71 Torre�n,414,0,232,1,5.19542102186078,2018-07-11,5
30010003,7,Hospital de Especialidades No. 71 Torre�n,3001,11,7,2018,10,4,10,14,55,1,5,233,1,,,,1,1,5,,,,,,,,,,,,,,,,,,,,,,,,,,,,,,,,,,,,18,2,1,1,1,2,1,2,2,1,1,7,1,2,,,1,1,1,,2,,,,,,,,,,,,,,,,2,,,,,,,,,,,,,,,,,,,,2,,,,,,,,1,,,,1,10,2,,1,10,2,,2,,2,,2,,2,,2,,2,,2,,1,10,2,,,,,,,1,1,1,2,1,1,1,4,6,,1,2,13,1,3,5,3001,7,Coahuila,3,Hospital de Especialidades No. 71 Torre�n,414,0,232,1,5.28187179940335,2018-07-11,5
30010020,7,Hospital de Especialidades No. 71 Torre�n,3001,11,7,2018,17,35,17,48,62,1,5,255,1,,,,2,1,30,,,,,,,,,,,,,,,,,,,,,,,,,,,,,,,,,,,,4,2,6,2,1,1,1,2,2,1,1,3,1,2,,,1,1,1,,2,,,,,,,,,,,,,,,,2,,,,,,,,,,,,,,,,,,,,2,,,,,,,,1,,,,1,5,2,,1,9,1,9,2,,2,,2,,2,,2,,2,,2,,1,9,2,,,,,,,1,1,1,2,1,1,1,2,4,2,1,13,9,2,9,2,3001,7,Coahuila,3,Hospital de Especialidades No. 71 Torre�n,414,0,232,1,5.57288964162754,2018-07-11,5
30010054,7,Hospital de Especialidades No. 71 Torre�n,3001,11,7,2018,8,52,9,15,42,1,5,9888,2,,,,2,1,80,,,,,,,,,,,,,,,,,,,,,,,,,,,,,,,,,,,,999,1,5,2,1,1,1,2,2,1,2,,,2,,,1,1,1,,2,,,,,,,,,,,,,,,,2,,,,,,,,,,,,,,,,,,,,2,,,,,,,,2,,,,1,8,1,10,1,9,2,,2,,2,,2,,2,,2,,2,,2,,1,99,2,,,,,,,1,1,1,1,1,1,1,1,6,,1,,,2,4,2,3001,7,Coahuila,3,Hospital de Especialidades No. 71 Torre�n,414,0,232,1,5.14929707318414,2018-07-11,5
30010055,7,Hospital de Especialidades No. 71 Torre�n,3001,11,7,2018,9,19,9,30,47,1,5,9888,2,,,,2,1,999,,,,,,,,,,,,,,,,,,,,,,,,,,,,,,,,,,,,18,2,3,2,1,1,1,2,2,1,1,6,1,2,,,1,1,1,,2,,,,,,,,,,,,,,,,2,,,,,,,,,,,,,,,,,,,,2,,,,,,,,2,,,,2,,2,,1,10,2,,1,10,2,,2,,2,,2,,2,,2,,99,,2,,,,,,,1,1,1,2,1,1,1,1,2,1,1,,,1,3,5,3001,7,Coahuila,3,Hospital de Especialidades No. 71 Torre�n,414,0,232,1,4.96839115166463,2018-07-11,5
30010040,7,Hospital de Especialidades No. 71 Torre�n,3001,11,7,2018,16,40,16,52,70,1,5,9888,2,,,,2,1,11,,,,,,,,,,,,,,,,,,,,,,,,,,,,,,,,,,,,13,2,2,2,1,1,1,2,2,1,1,5,1,2,,,1,1,1,,2,,,,,,,,,,,,,,,,1,3,3,1,,,,,3,2,1,2,1,1,2,,,,1,2,1,2,,1,2,,,,2,,,,1,10,2,,1,10,1,8,2,,2,,2,,2,,2,,2,,2,,1,10,2,,,,,,,1,1,1,1,1,1,1,2,2,1,1,,,1,3,5,3001,7,Coahuila,3,Hospital de Especialidades No. 71 Torre�n,414,0,232,1,4.91572768784297,2018-07-11,5
30010044,7,Hospital de Especialidades No. 71 Torre�n,3001,11,7,2018,18,34,18,44,45,1,5,9888,2,,,,2,1,8,,,,,,,,,,,,,,,,,,,,,,,,,,,,,,,,,,,,12,2,3,2,1,1,1,2,2,1,1,4,1,1,5,1,1,1,1,,2,,,,,,,,,,,,,,,,2,,,,,,,,,,,,,,,,,,,,2,,,,,,,,2,,,,2,,2,,1,9,2,,1,8,1,5,2,,2,,2,,2,,2,,1,10,2,,,,,,,1,1,1,97,,1,1,2,2,1,1,,,1,5,8,3001,7,Coahuila,3,Hospital de Especialidades No. 71 Torre�n,414,0,232,1,4.96839115166463,2018-07-11,5
30010045,7,Hospital de Especialidades No. 71 Torre�n,3001,11,7,2018,18,45,18,56,30,1,5,9888,2,,,,2,1,999,,,,,,,,,,,,,,,,,,,,,,,,,,,,,,,,,,,,17,2,3,4,1,2,1,2,2,1,2,,,2,,,2,2,,,1,71,5,1,,1,,2,1,1,2,3,2,,,,2,,,,,,,,,,,,,,,,,,,,2,,,,,,,,2,,,,1,8,2,,1,10,2,,2,,2,,2,,2,,2,,2,,2,,2,,2,,,,,,,1,1,1,3,1,1,1,2,6,,1,,,1,8,8,3001,7,Coahuila,3,Hospital de Especialidades No. 71 Torre�n,414,0,232,1,4.92411469561769,2018-07-11,5
30010046,7,Hospital de Especialidades No. 71 Torre�n,3001,11,7,2018,19,3,19,11,52,1,5,9888,2,,,,2,1,999,,,,,,,,,,,,,,,,,,,,,,,,,,,,,,,,,,,,13,2,2,2,1,1,1,2,2,1,1,6,1,2,,,1,1,1,,2,,,,,,,,,,,,,,,,2,,,,,,,,,,,,,,,,,,,,2,,,,,,,,2,,,,1,10,2,,99,,1,10,2,,2,,2,,2,,2,,2,,2,,1,99,2,,,,,,,1,1,1,2,1,1,1,2,2,1,1,,,1,7,9,3001,7,Coahuila,3,Hospital de Especialidades No. 71 Torre�n,414,0,232,1,4.96839115166463,2018-07-11,5
30010047,7,Hospital de Especialidades No. 71 Torre�n,3001,11,7,2018,19,28,19,41,38,1,5,9888,2,,,,2,1,30,,,,,,,,,,,,,,,,,,,,,,,,,,,,,,,,,,,,4,2,3,2,1,1,1,2,2,2,2,,,2,,,1,1,1,,2,,,,,,,,,,,,,,,,2,,,,,,,,,,,,,,,,,,,,2,,,,,,,,2,,,,1,10,2,,99,,2,,2,,2,,2,,2,,1,10,1,8,2,,1,99,2,,,,,,,1,1,1,1,1,1,1,2,2,1,1,,,2,8,1,3001,7,Coahuila,3,Hospital de Especialidades No. 71 Torre�n,414,0,232,1,5.14929707318414,2018-07-11,5
30010010,7,Hospital de Especialidades No. 71 Torre�n,3001,11,7,2018,12,15,12,25,20,1,5,255,1,,,,1,1,32,,,,,,,,,,,,,,,,,,,,,,,,,,,,,,,,,,,,12,2,3,2,1,2,1,2,2,1,1,4,1,2,,,1,1,1,,2,,,,,,,,,,,,,,,,2,,,,,,,,,,,,,,,,,,,,2,,,,,,,,1,,,,1,10,2,,1,10,1,8,1,9,2,,2,,2,,2,,2,,2,,1,7,2,,,,,,,1,1,1,2,2,1,1,4,5,2,2,13,4,2,8,6,3001,7,Coahuila,3,Hospital de Especialidades No. 71 Torre�n,414,0,232,1,5.18121392845645,2018-07-11,5
30010011,7,Hospital de Especialidades No. 71 Torre�n,3001,11,7,2018,12,40,12,53,23,1,5,247,1,,,,1,1,3,,,,,,,,,,,,,,,,,,,,,,,,,,,,,,,,,,,,13,2,4,2,1,1,1,2,2,1,1,2,1,2,,,2,2,,,2,,,,,,,,,,,,,,,,2,,,,,,,,,,,,,,,,,,,,2,,,,,,,,1,,,,1,10,1,10,1,10,1,10,2,,2,,2,,2,,2,,2,,2,,2,,2,,,,,,,1,1,1,2,1,1,1,1,1,1,2,,,1,7,6,3001,7,Coahuila,3,Hospital de Especialidades No. 71 Torre�n,414,0,232,1,4.91064950056999,2018-07-11,5
30010015,7,Hospital de Especialidades No. 71 Torre�n,3001,11,7,2018,14,10,14,29,68,1,5,289,1,,,,1,1,3,,,,,,,,,,,,,,,,,,,,,,,,,,,,,,,,,,,,13,2,1,1,1,2,1,2,2,1,1,2,1,1,2,1,1,1,1,,2,,,,,,,,,,,,,,,,2,,,,,,,,,,,,,,,,,,,,2,,,,,,,,1,,,,1,10,2,,1,10,2,,1,10,2,,2,,2,,2,,2,,2,,1,10,2,,,,,,,1,1,1,2,1,1,1,2,2,1,2,11,,1,3,5,3001,7,Coahuila,3,Hospital de Especialidades No. 71 Torre�n,414,0,232,1,4.91572768784297,2018-07-11,5
30010042,7,Hospital de Especialidades No. 71 Torre�n,3001,11,7,2018,17,21,17,40,26,1,5,9888,2,,,,2,1,32,,,,,,,,,,,,,,,,,,,,,,,,,,,,,,,,,,,,999,2,3,2,1,2,1,2,2,1,1,4,1,2,,,1,1,1,,2,,,,,,,,,,,,,,,,2,,,,,,,,,,,,,,,,,,,,2,,,,,,,,2,,,,1,10,2,,1,10,2,,2,,2,,2,,2,,2,,2,,2,,99,,2,,,,,,,1,1,1,1,1,1,1,1,1,1,3,,,1,6,5,3001,7,Coahuila,3,Hospital de Especialidades No. 71 Torre�n,414,0,232,1,4.92411469561769,2018-07-11,5
30010013,7,Hospital de Especialidades No. 71 Torre�n,3001,11,7,2018,13,10,13,18,48,1,5,9888,1,,,,1,1,32,,,,,,,,,,,,,,,,,,,,,,,,,,,,,,,,,,,,9,2,3,1,1,1,1,2,2,1,1,2,1,1,2,2,2,2,,,2,,,,,,,,,,,,,,,,2,,,,,,,,,,,,,,,,,,,,2,,,,,,,,1,,,,1,10,1,10,1,10,1,10,1,10,2,,2,,2,,2,,2,,2,,2,,1,10,,,,,,1,1,1,2,1,1,1,1,2,1,5,,,1,7,2,3001,7,Coahuila,3,Hospital de Especialidades No. 71 Torre�n,414,0,232,1,4.96839115166463,2018-07-11,5
30010066,7,Hospital de Especialidades No. 71 Torre�n,3001,11,7,2018,10,47,11,3,34,1,5,9888,2,,,,2,1,30,,,,,,,,,,,,,,,,,,,,,,,,,,,,,,,,,,,,4,1,1,2,1,1,1,2,1,1,1,3,2,2,,,1,1,1,,2,,,,,,,,,,,,,,,,1,3,5,1,,,,,8,2,2,,1,1,2,,,,2,2,2,,,,,,,,2,,,,1,10,2,,1,10,2,,2,,2,,2,,2,,1,10,1,10,1,10,1,99,2,,,,,,,1,1,1,1,2,99,1,99,2,1,8,9,,1,5,5,3001,7,Coahuila,3,Hospital de Especialidades No. 71 Torre�n,414,0,232,1,4.92411469561769,2018-07-11,5
30010084,7,Hospital de Especialidades No. 71 Torre�n,3001,11,7,2018,19,3,19,24,27,1,10,447,2,,,,2,1,3,,,,,,,,,,,,,,,,,,,,,,,,,,,,,,,,,,,,12,1,5,2,1,1,1,2,2,1,1,1,1,2,,,1,1,1,,2,,,,,,,,,,,,,,,,2,,,,,,,,,,,,,,,,,,,,2,,,,,,,,2,,,,1,9,2,,1,9,1,9,1,9,2,,99,,99,,2,,2,,2,,1,9,2,,,,,,,1,1,1,4,2,99,1,2,2,2,8,,,1,7,4,3001,7,Coahuila,3,Hospital de Especialidades No. 71 Torre�n,414,0,232,1,4.92411469561769,2018-07-11,5
30010002,7,Hospital de Especialidades No. 71 Torre�n,3001,11,7,2018,9,52,10,4,63,1,5,232,1,,,,2,1,22,,,,,,,,,,,,,,,,,,,,,,,,,,,,,,,,,,,,41,2,3,2,1,2,1,2,2,1,2,,,2,,,2,2,,,2,,,,,,,,,,,,,,,,2,,,,,,,,,,,,,,,,,,,,2,,,,,,,,2,,,,1,10,2,,1,10,1,10,2,,2,,2,,2,,2,,2,,2,,2,,1,10,,,,,,1,1,1,2,1,1,1,1,1,1,8,11,,1,7,5,3001,7,Coahuila,3,Hospital de Especialidades No. 71 Torre�n,414,0,232,1,5.28187179940335,2018-07-11,5
30010004,7,Hospital de Especialidades No. 71 Torre�n,3001,11,7,2018,10,14,10,22,62,1,5,232,1,,,,2,1,30,,,,,,,,,,,,,,,,,,,,,,,,,,,,,,,,,,,,4,2,2,2,1,1,1,2,2,1,2,,,2,,,2,2,,,2,,,,,,,,,,,,,,,,2,,,,,,,,,,,,,,,,,,,,2,,,,,,,,1,,,,1,10,2,,1,10,1,10,2,,2,,2,,2,,2,,2,,2,,2,,2,,,,,,,1,1,1,2,1,1,1,1,1,1,9,,,2,5,2,3001,7,Coahuila,3,Hospital de Especialidades No. 71 Torre�n,414,0,232,1,5.57288964162754,2018-07-11,5
30010017,7,Hospital de Especialidades No. 71 Torre�n,3001,11,7,2018,15,38,15,51,29,1,5,245,1,,,,1,1,40,,,,,,,,,,,,,,,,,,,,,,,,,,,,,,,,,,,,12,2,1,1,1,2,1,2,2,1,1,2,1,2,,,1,1,1,,2,,,,,,,,,,,,,,,,2,,,,,,,,,,,,,,,,,,,,2,,,,,,,,1,,,,1,10,2,,1,10,2,,2,,2,,2,,2,,2,,2,,2,,1,9,2,,,,,,,1,1,1,1,1,1,1,2,2,2,9,,,2,5,2,3001,7,Coahuila,3,Hospital de Especialidades No. 71 Torre�n,414,0,232,1,5.19542102186078,2018-07-11,5
30010058,7,Hospital de Especialidades No. 71 Torre�n,3001,11,7,2018,11,56,12,10,56,1,5,9888,2,,,,2,1,88,,,,,,,,,,,,,,,,,,,,,,,,,,,,,,,,,,,,999,2,3,2,1,1,1,2,2,1,2,,,1,5,1,1,1,1,,2,,,,,,,,,,,,,,,,2,,,,,,,,,,,,,,,,,,,,2,,,,,,,,2,,,,1,10,2,,1,10,2,,2,,2,,2,,2,,2,,2,,2,,1,10,2,,,,,,,1,1,1,5,1,1,1,2,2,1,11,,,1,3,5,3001,7,Coahuila,3,Hospital de Especialidades No. 71 Torre�n,414,0,232,1,5.28187179940335,2018-07-11,5
30010082,7,Hospital de Especialidades No. 71 Torre�n,3001,11,7,2018,18,29,18,44,54,1,10,1951,4,9,,,2,1,11,,,,,,,,,,,,,,,,,,,,,,,,,,,,,,,,,,,,9,1,3,2,2,1,1,2,2,1,1,1,1,2,,,2,2,,,97,,,,,,,,,,,,,,,,2,,,,,,,,,,,,,,,,,,,,2,,,,,,,,2,,,,1,10,2,,1,10,1,8,2,,2,,2,,2,,2,,2,,2,,2,,2,,,,,,,1,1,1,2,2,1,1,1,4,1,12,2,,1,5,5,3001,7,Coahuila,3,Hospital de Especialidades No. 71 Torre�n,414,0,232,1,4.96839115166463,2018-07-11,5
30010052,7,Hospital de Especialidades No. 71 Torre�n,3001,11,7,2018,8,32,8,44,43,1,5,9888,2,,,,2,1,32,,,,,,,,,,,,,,,,,,,,,,,,,,,,,,,,,,,,999,1,2,2,1,1,1,2,2,1,2,,,2,,,1,1,1,,2,,,,,,,,,,,,,,,,2,,,,,,,,,,,,,,,,,,,,2,,,,,,,,2,,,,1,10,2,,1,10,99,,2,,2,,2,,2,,2,,2,,2,,1,99,2,,,,,,,1,1,1,2,1,1,1,2,2,1,12,,,1,4,4,3001,7,Coahuila,3,Hospital de Especialidades No. 71 Torre�n,414,0,232,1,4.88039935232926,2018-07-11,5
30010067,7,Hospital de Especialidades No. 71 Torre�n,3001,11,7,2018,11,3,11,17,28,1,5,9888,2,,,,2,1,12,,,,,,,,,,,,,,,,,,,,,,,,,,,,,,,,,,,,9,1,1,2,2,2,2,1,2,1,2,,,2,,,1,1,1,,2,,,,,,,,,,,,,,,,2,,,,,,,,,,,,,,,,,,,,97,,,,,,,,2,,,,1,5,2,,1,8,2,,2,,2,,2,,2,,2,,2,,2,,1,10,2,,,,,,,1,1,1,1,2,2,1,2,1,2,13,8,,1,7,5,3001,7,Coahuila,3,Hospital de Especialidades No. 71 Torre�n,414,0,232,1,4.92411469561769,2018-07-11,5
30010069,7,Hospital de Especialidades No. 71 Torre�n,3001,11,7,2018,11,34,11,45,39,1,5,233,2,,,,2,1,51,,,,,,,,,,,,,,,,,,,,,,,,,,,,,,,,,,,,999,1,2,2,1,1,1,2,2,1,2,,,2,,,1,1,1,,2,,,,,,,,,,,,,,,,2,,,,,,,,,,,,,,,,,,,,2,,,,,,,,2,,,,1,8,2,,1,8,1,8,1,9,1,9,2,,2,,2,,2,,2,,1,7,2,,,,,,,1,1,1,97,,1,2,2,6,,13,2,,1,5,4,3001,7,Coahuila,3,Hospital de Especialidades No. 71 Torre�n,414,0,232,1,4.88039935232926,2018-07-11,5
30010074,7,Hospital de Especialidades No. 71 Torre�n,3001,11,7,2018,14,4,14,17,22,1,5,232,1,,,,1,1,88,,,,,,,,,,,,,,,,,,,,,,,,,,,,,,,,,,,,18,1,2,2,1,1,1,2,2,1,2,,,2,,,1,1,1,,2,,,,,,,,,,,,,,,,2,,,,,,,,,,,,,,,,,,,,2,,,,,,,,2,,,,1,10,2,,1,10,1,10,2,,2,,2,,2,,2,,1,10,2,,1,10,2,,,,,,,1,1,1,1,2,1,1,2,4,2,13,79,,2,8,6,3001,7,Coahuila,3,Hospital de Especialidades No. 71 Torre�n,414,0,232,1,5.18121392845645,2018-07-11,5
30010023,7,Hospital de Especialidades No. 71 Torre�n,3001,11,7,2018,8,15,8,28,39,1,10,1951,2,,,,2,2,,,,,,,,,,,,,,,,,,,,,,,,,,,,,,,,,,,,,,,,,,,,,,,1,4,1,2,,,2,2,,,2,,,,,,,,,,,,,,,,2,,,,,,,,,,,,,,,,,,,,2,,,,,,,,2,,,,1,10,1,10,1,10,2,,1,8,2,,2,,2,,2,,2,,2,,2,,2,,,,,,,1,1,1,3,2,1,1,2,3,2,13,,,1,9,5,3001,7,Coahuila,3,Hospital de Especialidades No. 71 Torre�n,414,0,232,1,4.88039935232926,2018-07-11,5
30010032,7,Hospital de Especialidades No. 71 Torre�n,3001,11,7,2018,12,8,12,22,47,2,5,255,1,,,,1,2,,,,,,,,,,,,,,,,,,,,,,,,,,,,,,,,,,,,,,,,,,,,,,,1,4,97,2,,,2,2,,,2,,,,,,,,,,,,,,,,2,,,,,,,,,,,,,,,,,,,,2,,,,,,,,1,,,,2,,2,,2,,1,10,1,10,2,,2,,2,,2,,1,10,2,,2,,2,,,,,,,1,1,1,2,1,99,1,3,3,1,13,,,1,7,5,3001,7,Coahuila,3,Hospital de Especialidades No. 71 Torre�n,414,0,232,1,4.96839115166463,2018-07-11,5
30010005,7,Hospital de Especialidades No. 71 Torre�n,3001,11,7,2018,10,22,10,30,28,1,5,266,1,,,,1,1,32,,,,,,,,,,,,,,,,,,,,,,,,,,,,,,,,,,,,9,2,2,2,1,1,1,2,2,1,2,,,2,,,1,1,1,,2,,,,,,,,,,,,,,,,2,,,,,,,,,,,,,,,,,,,,2,,,,,,,,1,,,,1,9,2,,1,9,2,,2,,1,10,2,,2,,2,,2,,2,,1,10,2,,,,,,,1,1,1,2,1,1,1,3,6,,13,,,1,9,2,3001,7,Coahuila,3,Hospital de Especialidades No. 71 Torre�n,414,0,232,1,4.92411469561769,2018-07-11,5
30010008,7,Hospital de Especialidades No. 71 Torre�n,3001,11,7,2018,11,9,11,26,29,1,5,9888,1,,,,1,1,27,,,,,,,,,,,,,,,,,,,,,,,,,,,,,,,,,,,,999,2,2,2,1,1,1,2,2,1,1,2,1,2,,,1,1,1,,2,,,,,,,,,,,,,,,,2,,,,,,,,,,,,,,,,,,,,2,,,,,,,,1,,,,2,,1,10,1,9,2,,2,,2,,2,,2,,2,,2,,1,9,1,6,2,,,,,,,1,1,1,1,1,1,1,2,2,2,13,,,1,7,2,3001,7,Coahuila,3,Hospital de Especialidades No. 71 Torre�n,414,0,232,1,4.92411469561769,2018-07-11,5
30010014,7,Hospital de Especialidades No. 71 Torre�n,3001,11,7,2018,13,57,14,10,24,1,5,264,1,,,,1,1,71,,,,,,,,,,,,,,,,,,,,,,,,,,,,,,,,,,,,14,2,3,2,1,1,1,2,2,1,1,2,1,1,2,1,2,2,,,2,,,,,,,,,,,,,,,,2,,,,,,,,,,,,,,,,,,,,2,,,,,,,,1,,,,1,10,2,,1,10,1,10,2,,2,,2,,1,10,2,,1,10,2,,2,,2,,,,,,,1,1,1,1,2,1,1,2,2,1,13,,,1,5,2,3001,7,Coahuila,3,Hospital de Especialidades No. 71 Torre�n,414,0,232,1,4.91064950056999,2018-07-11,5
30010018,7,Hospital de Especialidades No. 71 Torre�n,3001,11,7,2018,16,15,16,28,25,1,5,9888,1,,,,1,1,11,,,,,,,,,,,,,,,,,,,,,,,,,,,,,,,,,,,,7,2,3,1,1,2,1,2,2,1,1,3,1,2,,,2,2,,,2,,,,,,,,,,,,,,,,2,,,,,,,,,,,,,,,,,,,,2,,,,,,,,2,,,,1,10,2,,1,10,1,10,2,,2,,2,,2,,2,,2,,2,,2,,2,,,,,,,1,1,1,2,1,1,1,2,2,1,13,,,1,9,6,3001,7,Coahuila,3,Hospital de Especialidades No. 71 Torre�n,414,0,232,1,4.91064950056999,2018-07-11,5
30010022,7,Hospital de Especialidades No. 71 Torre�n,3001,11,7,2018,18,43,19,6,26,1,5,248,1,,,,1,1,7,,,,,,,,,,,,,,,,,,,,,,,,,,,,,,,,,,,,5,2,2,1,1,2,1,2,2,1,1,2,1,2,,,1,1,1,,2,,,,,,,,,,,,,,,,2,,,,,,,,,,,,,,,,,,,,2,,,,,,,,2,,,,1,9,2,,1,10,2,,2,,2,,2,,2,,2,,2,,2,,1,9,2,,,,,,,1,1,1,2,2,1,1,2,3,2,13,,,1,7,5,3001,7,Coahuila,3,Hospital de Especialidades No. 71 Torre�n,414,0,232,1,4.92411469561769,2018-07-11,5
30010041,7,Hospital de Especialidades No. 71 Torre�n,3001,11,7,2018,17,4,17,21,24,1,5,9888,2,,,,2,1,999,,,,,,,,,,,,,,,,,,,,,,,,,,,,,,,,,,,,10,2,4,2,1,1,1,2,2,2,1,4,1,2,,,1,1,1,,2,,,,,,,,,,,,,,,,1,2,5,1,,,,,999,2,1,2,1,1,2,,,,1,2,2,,,,,,,,2,,,,1,10,2,,1,10,1,10,99,,2,,2,,2,,2,,2,,2,,1,9,2,,,,,,,1,1,1,1,1,1,1,2,2,1,13,14,,1,6,8,3001,7,Coahuila,3,Hospital de Especialidades No. 71 Torre�n,414,0,232,1,4.91064950056999,2018-07-11,5
30010060,7,Hospital de Especialidades No. 71 Torre�n,3001,11,7,2018,8,46,8,59,68,1,5,9888,2,,,,2,1,3,,,,,,,,,,,,,,,,,,,,,,,,,,,,,,,,,,,,13,2,2,2,1,1,1,1,2,1,1,3,1,2,,,2,2,,,1,26,1,1,,1,,2,1,1,1,2,2,,,,2,,,,,,,,,,,,,,,,,,,,2,,,,,,,,2,,,,1,10,2,,1,10,2,,1,10,2,,2,,2,,2,,2,,2,,2,,2,,,,,,,2,1,1,1,2,99,1,2,6,,14,,,2,3,9,3001,7,Coahuila,3,Hospital de Especialidades No. 71 Torre�n,414,0,232,1,5.18657191106690,2018-07-11,5
30010050,7,Hospital de Especialidades No. 71 Torre�n,3001,11,7,2018,8,8,8,20,43,1,5,9888,2,,,,3,1,999,,,,,,,,,,,,,,,,,,,,,,,,,,,,,,,,,,,,7,2,2,2,1,1,1,2,2,1,1,5,1,2,,,2,1,1,,2,,,,,,,,,,,,,,,,2,,,,,,,,,,,,,,,,,,,,2,,,,,,,,2,,,,1,10,2,,1,10,2,,2,,1,10,2,,2,,1,10,2,,2,,1,10,2,,,,,,,1,1,1,2,1,1,1,2,2,1,14,,,1,3,5,3001,7,Coahuila,3,Hospital de Especialidades No. 71 Torre�n,414,0,232,1,4.88039935232926,2018-07-11,5
30010051,7,Hospital de Especialidades No. 71 Torre�n,3001,11,7,2018,8,20,8,32,62,1,5,9888,2,,,,2,1,3,,,,,,,,,,,,,,,,,,,,,,,,,,,,,,,,,,,,13,2,2,2,1,1,1,2,2,1,2,,,2,,,1,1,1,,2,,,,,,,,,,,,,,,,2,,,,,,,,,,,,,,,,,,,,2,,,,,,,,2,,,,2,,2,,1,8,1,10,2,,2,,2,,2,,2,,2,,2,,1,10,1,10,,,,,,1,1,1,2,1,1,1,2,2,1,14,9,,1,9,9,3001,7,Coahuila,3,Hospital de Especialidades No. 71 Torre�n,414,0,232,1,5.28187179940335,2018-07-11,5
30010039,7,Hospital de Especialidades No. 71 Torre�n,3001,11,7,2018,16,25,16,36,70,1,5,9888,2,,,,2,1,999,,,,,,,,,,,,,,,,,,,,,,,,,,,,,,,,,,,,13,2,1,2,1,1,1,2,2,1,1,1,1,1,4,1,1,1,1,,2,,,,,,,,,,,,,,,,2,,,,,,,,,,,,,,,,,,,,2,,,,,,,,2,,,,1,8,2,,1,10,2,,2,,2,,2,,2,,2,,2,,2,,1,7,2,,,,,,,1,1,1,1,1,1,1,2,2,1,14,,,1,5,5,3001,7,Coahuila,3,Hospital de Especialidades No. 71 Torre�n,414,0,232,1,4.91572768784297,2018-07-11,5
30010030,7,Hospital de Especialidades No. 71 Torre�n,3001,11,7,2018,11,42,11,53,30,1,32,1776,1,,,,1,1,32,,,,,,,,,,,,,,,,,,,,,,,,,,,,,,,,,,,,9,2,2,2,3,1,1,2,2,2,2,,,2,,,2,2,,,2,,,,,,,,,,,,,,,,2,,,,,,,,,,,,,,,,,,,,2,,,,,,,,2,,,,1,10,2,,1,9,2,,1,10,2,,2,,2,,1,10,2,,2,,2,,2,,,,,,,1,1,1,2,1,1,1,1,2,2,17,,,2,9,13,3001,7,Coahuila,3,Hospital de Especialidades No. 71 Torre�n,414,0,232,1,5.19542102186078,2018-07-11,5
30010080,7,Hospital de Especialidades No. 71 Torre�n,3001,11,7,2018,16,49,17,8,30,1,5,9888,2,,,,2,1,3,,,,,,,,,,,,,,,,,,,,,,,,,,,,,,,,,,,,13,1,2,2,1,1,1,2,2,1,1,2,1,2,,,1,1,1,,1,3,1,1,,1,,1,1,1,1,2,2,,,,2,,,,,,,,,,,,,,,,,,,,2,,,,,,,,2,,,,1,10,2,,1,7,1,9,1,8,2,,1,9,2,,2,,1,9,2,,1,9,2,,,,,,,1,1,1,97,,1,1,3,2,2,33,,,1,5,4,3001,7,Coahuila,3,Hospital de Especialidades No. 71 Torre�n,414,0,232,1,4.92411469561769,2018-07-11,5
30010078,7,Hospital de Especialidades No. 71 Torre�n,3001,11,7,2018,16,29,16,42,80,1,5,2035,2,,,,2,2,,,,,,,,,,,,,,,,,,,,,,,,,,,,,,,,,,,,,,,,,,,,,,,1,1,2,2,,,1,1,1,,2,,,,,,,,,,,,,,,,1,2,6,1,,,,,23,2,1,1,1,1,1,,,,2,2,2,,,,,,,,2,,,,2,,2,,1,10,1,10,1,10,2,,2,,2,,1,10,2,,2,,1,10,2,,,,,,,1,1,1,2,2,1,1,1,1,1,35,,,2,3,3,3001,7,Coahuila,3,Hospital de Especialidades No. 71 Torre�n,414,0,232,1,5.18657191106690,2018-07-11,5
30010079,7,Hospital de Especialidades No. 71 Torre�n,3001,11,7,2018,17,29,17,42,80,1,5,2035,2,,,,2,2,,,,,,,,,,,,,,,,,,,,,,,,,,,,,,,,,,,,,,,,,,,,,,,1,1,2,2,,,1,1,1,,2,,,,,,,,,,,,,,,,1,2,6,1,,,,,23,2,1,1,1,1,1,,,,2,2,2,,,,,,,,2,,,,2,,2,,1,10,1,10,1,10,2,,2,,2,,1,10,2,,2,,1,10,2,,,,,,,1,1,1,2,2,1,1,1,1,1,35,,,2,3,3,3001,7,Coahuila,3,Hospital de Especialidades No. 71 Torre�n,414,0,232,1,5.18657191106690,2018-07-11,5
30010027,7,Hospital de Especialidades No. 71 Torre�n,3001,11,7,2018,10,22,10,35,52,1,5,232,2,,,,2,2,,,,,,,,,,,,,,,,,,,,,,,,,,,,,,,,,,,,,,,,,,,,,,,1,4,97,1,3,97,1,1,1,,2,,,,,,,,,,,,,,,,2,,,,,,,,,,,,,,,,,,,,2,,,,,,,,2,,,,1,8,2,,1,10,1,10,1,10,1,10,2,,2,,2,,2,,1,10,1,10,2,,,,,,,1,1,1,2,2,1,1,2,2,2,64,,,1,5,5,3001,7,Coahuila,3,Hospital de Especialidades No. 71 Torre�n,414,0,232,1,4.96839115166463,2018-07-11,5
30010073,7,Hospital de Especialidades No. 71 Torre�n,3001,11,7,2018,13,16,13,33,80,1,5,233,2,,,,2,1,72,,,,,,,,,,,,,,,,,,,,,,,,,,,,,,,,,,,,24,1,3,2,1,1,1,1,2,1,1,6,1,2,,,1,1,1,,2,,,,,,,,,,,,,,,,2,,,,,,,,,,,,,,,,,,,,2,,,,,,,,2,,,,1,1,2,,1,10,2,,2,,2,,2,,2,,2,,2,,2,,1,8,2,,,,,,,1,1,1,1,1,99,1,3,2,2,66,,,1,3,5,3001,7,Coahuila,3,Hospital de Especialidades No. 71 Torre�n,414,0,232,1,4.91572768784297,2018-07-11,5
30010083,7,Hospital de Especialidades No. 71 Torre�n,3001,11,7,2018,18,44,19,2,64,1,8,160,2,,,,2,1,3,,,,,,,,,,,,,,,,,,,,,,,,,,,,,,,,,,,,13,2,6,2,1,1,1,1,2,1,1,1,1,2,,,2,2,,,2,,,,,,,,,,,,,,,,2,,,,,,,,,,,,,,,,,,,,2,,,,,,,,2,,,,1,9,2,,1,9,2,,2,,2,,2,,2,,1,10,1,10,2,,2,,2,,,,,,,2,1,1,1,2,1,1,2,2,2,79,13,,1,3,5,3001,7,Coahuila,3,Hospital de Especialidades No. 71 Torre�n,414,0,232,1,5.28187179940335,2018-07-11,5
30010025,7,Hospital de Especialidades No. 71 Torre�n,3001,11,7,2018,9,43,9,56,20,1,5,271,1,,,,2,2,,,,,,,,,,,,,,,,,,,,,,,,,,,,,,,,,,,,,,,,,,,,,,,1,5,97,2,,,2,2,,,2,,,,,,,,,,,,,,,,2,,,,,,,,,,,,,,,,,,,,2,,,,,,,,2,,,,2,,2,,2,,1,10,1,10,2,,2,,2,,2,,2,,2,,2,,2,,,,,,,1,1,1,2,2,1,1,2,4,2,79,,,1,3,5,3001,7,Coahuila,3,Hospital de Especialidades No. 71 Torre�n,414,0,232,1,4.91064950056999,2018-07-11,5
30010026,7,Hospital de Especialidades No. 71 Torre�n,3001,11,7,2018,10,9,10,22,67,1,5,232,1,,,,1,1,3,,,,,,,,,,,,,,,,,,,,,,,,,,,,,,,,,,,,13,1,3,2,1,1,1,2,2,1,1,3,1,1,3,1,2,2,,,2,,,,,,,,,,,,,,,,2,,,,,,,,,,,,,,,,,,,,2,,,,,,,,2,,,,1,10,1,10,1,10,1,10,2,,2,,2,,2,,2,,2,,2,,2,,1,10,,,,,,1,1,1,97,,1,1,2,2,2,79,,,1,5,5,3001,7,Coahuila,3,Hospital de Especialidades No. 71 Torre�n,414,0,232,1,4.91572768784297,2018-07-11,5
30010037,7,Hospital de Especialidades No. 71 Torre�n,3001,11,7,2018,15,41,15,54,44,1,8,159,4,8,,,3,1,6,,,,,,,,,,,,,,,,,,,,,,,,,,,,,,,,,,,,2,2,4,3,3,2,1,1,2,1,2,,,2,,,2,2,,,2,,,,,,,,,,,,,,,,2,,,,,,,,,,,,,,,,,,,,2,,,,,,,,2,,,,1,6,2,,1,10,2,,2,,1,10,2,,2,,2,,2,,2,,2,,2,,,,,,,2,1,1,1,1,1,1,2,2,2,79,,,2,8,12,3001,7,Coahuila,3,Hospital de Especialidades No. 71 Torre�n,414,0,232,1,5.14929707318414,2018-07-11,5