Folio,Deleg,Id_Unid,Unidmed,Fecha_D,Fecha_M,Fecha_A,Hr_Ini_H,Hr_Ini_M,Hr_Fin_H,Hr_Fin_M,Edad,Tipopac,Edoproc,Id_Unidproc,Sat1,Sat1_Mot1,Sat1_Mot2,Sat1_Mot3,Sat3,Filtroch,Probsal,Semambe,Cartembe,Utilcartembe,Portale,Ingportale,Infoportale,Anticoncepe,Noanticoncepe,Tourobse,Infotourobse,Cartembp,Utilcartembp,Portalp,Ingportalp,Infoportalp,Tourobsp,Infotourobsp,Comunincomp,Motcomunincomp1,Motcomunincomp2,Motcomunincomp3,Infoprocp,Anticoncepp,Noanticoncepp,Tactop,Autortactop,Metdolor,Presentp,Dudasemb,Infoedosaludp,Infomabbp,Califembp,Motcalifembp1,Motcalifembp2,Motcalifembp3,Especialid,Tipocons,Tmedreg3,Satiemesp,Pres_Med,Durasis_C,Preosad,Tratocomf,Comincomcons,Consdesp,Filtrosaux1,Temsad1,Temsad1b,Filtrosaux2,Temsad2,Temsad2b,Recmedhoy,Filtrofarm2,Totmed,Motnosurt,Filtrourg,Probsal_Urg,Mot_Urg,Atnurg,Noatnurg,Turgtriag,Tram_Urg,Cartcol,Medenfcol,Clasiftiem,Calteurg,Califurg,Motcalifurg1,Motcalifurg2,Motcalifurg3,Filtrocir,Progciru,Topera,Fechaop,Suspop1,Suspop3,Suspop2,Suspop4,Motoper,Opfinsem,Infofam1,Infofam,Medciru,Medciru2,Calciru,Motcalifcir1,Motcalifcir2,Motcalifcir3,Trabsocciru,Ciclocir,Filtrohos,Tobscama,Razontesp,Infprealta,Calhosp,Motcalifhosp1,Motcalifhosp2,Motcalifhosp3,Btratou,Btratou_Mot1,Btratou_Mot2,Btratou_Mot3,Calfatna_A,Calfatnb_A,Calfatna_B,Calfatnb_B,Calfatna_C,Calfatnb_C,Calfatna_E,Calfatnb_E,Calfatna_G,Calfatnb_G,Calfatna_H,Calfatnb_H,Calfatna_I,Calfatnb_I,Calfatna_J,Calfatnb_J,Calfatna_K,Calfatnb_K,Calfatna_L,Calfatnb_L,Calfatna_M,Calfatnb_M,Calfatna_N,Calfatnb_N,Calfatna_F,Calfatnb_F,Mottratot1,Mottratot2,Mottratot3,Mottratot4,Mottratot5,Saludar,Escuchar,Responder,Tiemuv,Mejoratratou,Gafet,Amable,Calfinmb_F,Limp1,Limp2,Recomej_A,Recomej_B,Recomej_C,Sexo,Escolar,Ocupa,Id_Unidad,Cve_Delegaci�N,Delegaci�N,Nivel,Unidad,Promedio_Diario2017,Microzona,Estrato,Moscondia,Fe_Finalnr,Fecha,Entidad
11001,1,11,HGZ 1 Aguascalientes,3,7,2018,8,9,8,19,25,1,1,2041,1,,,,1,2,,,,,,,,,,,,,,,,,,,,,,,,,,,,,,,,,,,,,,,,,,,,,,,1,5,97,1,3,1,2,2,,,2,,,,,,,,,,,,,,,2,,,,,,,,,,,,,,,,,,,,2,,,,,,,,1,,,,2,,2,,2,,2,,1,10,2,,2,,2,,2,,2,,2,,2,,2,,,,,,,1,1,1,3,2,1,1,1,6,,995,,,1,7,2,11,1,Aguascalientes,2,HGZ 1 Aguascalientes,839,0,12,1,7.78541591224819,2018-07-03,1
11003,1,11,HGZ 1 Aguascalientes,3,7,2018,8,32,8,47,62,1,14,783,2,,,,2,2,,,,,,,,,,,,,,,,,,,,,,,,,,,,,,,,,,,,,,,,,,,,,,,1,4,97,2,,,2,2,,,2,,,,,,,,,,,,,,,2,,,,,,,,,,,,,,,,,,,,2,,,,,,,,2,,,,2,,2,,2,,2,,1,10,2,,2,,2,,2,,2,,2,,2,,2,,,,,,,1,1,1,97,,1,1,5,4,1,995,,,2,2,9,11,1,Aguascalientes,2,HGZ 1 Aguascalientes,839,0,12,1,8.10452047789575,2018-07-03,1
11004,1,11,HGZ 1 Aguascalientes,3,7,2018,8,53,9,2,59,1,1,2,2,,,,3,2,,,,,,,,,,,,,,,,,,,,,,,,,,,,,,,,,,,,,,,,,,,,,,,1,3,97,2,,,2,2,,,2,,,,,,,,,,,,,,,2,,,,,,,,,,,,,,,,,,,,2,,,,,,,,2,,,,2,,2,,2,,2,,1,10,2,,2,,2,,2,,2,,2,,2,,2,,,,,,,1,1,1,2,2,1,1,1,2,1,9,,,1,3,5,11,1,Aguascalientes,2,HGZ 1 Aguascalientes,839,0,12,1,7.81874168032499,2018-07-03,1
11005,1,11,HGZ 1 Aguascalientes,3,7,2018,9,7,9,19,64,1,1,2,1,,,,1,2,,,,,,,,,,,,,,,,,,,,,,,,,,,,,,,,,,,,,,,,,,,,,,,1,3,97,2,,,2,2,,,2,,,,,,,,,,,,,,,2,,,,,,,,,,,,,,,,,,,,2,,,,,,,,2,,,,2,,2,,2,,2,,1,10,2,,2,,2,,2,,2,,2,,2,,2,,,,,,,1,1,1,3,2,1,1,2,6,,995,,,1,1,5,11,1,Aguascalientes,2,HGZ 1 Aguascalientes,839,0,12,1,7.81874168032499,2018-07-03,1
11006,1,11,HGZ 1 Aguascalientes,3,7,2018,9,27,9,40,53,1,14,796,2,,,,2,2,,,,,,,,,,,,,,,,,,,,,,,,,,,,,,,,,,,,,,,,,,,,,,,2,,,1,2,97,2,2,,,2,,,,,,,,,,,,,,,2,,,,,,,,,,,,,,,,,,,,2,,,,,,,,2,,,,2,,2,,2,,2,,2,,1,9,2,,2,,2,,2,,2,,2,,2,,,,,,,1,1,1,97,,1,1,2,6,,995,,,1,7,2,11,1,Aguascalientes,2,HGZ 1 Aguascalientes,839,0,12,1,7.91595879842413,2018-07-03,1
11009,1,11,HGZ 1 Aguascalientes,3,7,2018,10,2,10,12,31,1,1,2,3,,,,3,1,3,,,,,,,,,,,,,,,,,,,,,,,,,,,,,,,,,,,,2,2,4,2,3,2,1,2,2,1,2,,,2,,,2,2,,,2,,,,,,,,,,,,,,,2,,,,,,,,,,,,,,,,,,,,2,,,,,,,,2,,,,2,,2,,1,9,2,,2,,2,,2,,2,,2,,2,,2,,2,,2,,,,,,,1,1,1,2,1,2,1,3,6,,1,,,2,7,2,11,1,Aguascalientes,2,HGZ 1 Aguascalientes,839,0,12,1,9.00035375440637,2018-07-03,1
11010,1,11,HGZ 1 Aguascalientes,3,7,2018,10,16,10,27,72,1,1,2,1,,,,1,2,,,,,,,,,,,,,,,,,,,,,,,,,,,,,,,,,,,,,,,,,,,,,,,1,4,97,2,,,2,2,,,2,,,,,,,,,,,,,,,2,,,,,,,,,,,,,,,,,,,,2,,,,,,,,2,,,,2,,2,,2,,2,,1,10,2,,2,,2,,2,,2,,2,,2,,2,,,,,,,2,1,1,2,2,99,1,2,6,,11,,,1,7,9,11,1,Aguascalientes,2,HGZ 1 Aguascalientes,839,0,12,1,7.08628854992318,2018-07-03,1
11011,1,11,HGZ 1 Aguascalientes,3,7,2018,10,31,10,44,70,1,1,9,1,,,,2,2,,,,,,,,,,,,,,,,,,,,,,,,,,,,,,,,,,,,,,,,,,,,,,,1,2,1,2,,,2,2,,,2,,,,,,,,,,,,,,,2,,,,,,,,,,,,,,,,,,,,2,,,,,,,,2,,,,2,,2,,2,,2,,2,,2,,2,,2,,2,,2,,2,,2,,2,,,,,,,1,1,1,2,2,1,1,2,6,,995,,,2,3,2,11,1,Aguascalientes,2,HGZ 1 Aguascalientes,839,0,12,1,7.34529583061292,2018-07-03,1
11012,1,11,HGZ 1 Aguascalientes,3,7,2018,10,48,10,56,46,1,1,9888,2,,,,2,2,,,,,,,,,,,,,,,,,,,,,,,,,,,,,,,,,,,,,,,,,,,,,,,1,4,97,2,,,2,2,,,2,,,,,,,,,,,,,,,2,,,,,,,,,,,,,,,,,,,,2,,,,,,,,2,,,,2,,1,9,2,,2,,1,9,2,,2,,2,,2,,2,,2,,2,,2,,,,,,,1,1,1,2,2,1,1,2,2,1,12,,,1,5,5,11,1,Aguascalientes,2,HGZ 1 Aguascalientes,839,0,12,1,7.91595879842413,2018-07-03,1
11013,1,11,HGZ 1 Aguascalientes,3,7,2018,11,1,11,13,29,1,1,2,2,,,,2,2,,,,,,,,,,,,,,,,,,,,,,,,,,,,,,,,,,,,,,,,,,,,,,,1,4,97,2,,,2,2,,,2,,,,,,,,,,,,,,,2,,,,,,,,,,,,,,,,,,,,2,,,,,,,,1,,,,2,,2,,2,,2,,1,10,2,,2,,2,,2,,2,,2,,2,,2,,,,,,,1,1,1,2,1,99,1,2,4,2,13,,,1,7,5,11,1,Aguascalientes,2,HGZ 1 Aguascalientes,839,0,12,1,8.68298639372650,2018-07-03,1
11014,1,11,HGZ 1 Aguascalientes,3,7,2018,11,20,11,32,20,1,1,1,2,,,,2,2,,,,,,,,,,,,,,,,,,,,,,,,,,,,,,,,,,,,,,,,,,,,,,,1,2,97,2,,,2,2,,,2,,,,,,,,,,,,,,,2,,,,,,,,,,,,,,,,,,,,2,,,,,,,,2,,,,2,,2,,2,,2,,1,9,2,,2,,2,,2,,2,,2,,2,,2,,,,,,,2,1,1,5,1,1,2,1,6,,1,,,1,7,2,11,1,Aguascalientes,2,HGZ 1 Aguascalientes,839,0,12,1,7.78541591224819,2018-07-03,1
11015,1,11,HGZ 1 Aguascalientes,3,7,2018,11,39,11,47,65,1,1,2,1,,,,1,2,,,,,,,,,,,,,,,,,,,,,,,,,,,,,,,,,,,,,,,,,,,,,,,1,4,97,2,,,2,2,,,2,,,,,,,,,,,,,,,2,,,,,,,,,,,,,,,,,,,,2,,,,,,,,2,,,,2,,2,,2,,2,,1,9,2,,2,,2,,2,,2,,2,,2,,2,,,,,,,2,1,1,1,3,2,1,3,4,1,13,,,1,5,9,11,1,Aguascalientes,2,HGZ 1 Aguascalientes,839,0,12,1,7.08628854992318,2018-07-03,1
11016,1,11,HGZ 1 Aguascalientes,3,7,2018,11,52,12,3,60,1,32,9888,2,,,,2,2,,,,,,,,,,,,,,,,,,,,,,,,,,,,,,,,,,,,,,,,,,,,,,,2,,,1,2,97,2,2,,,2,,,,,,,,,,,,,,,2,,,,,,,,,,,,,,,,,,,,2,,,,,,,,1,,,,2,,1,10,2,,2,,2,,1,10,2,,2,,2,,2,,2,,2,,2,,,,,,,1,1,1,5,1,1,1,3,3,1,1,,,1,3,5,11,1,Aguascalientes,2,HGZ 1 Aguascalientes,839,0,12,1,7.81874168032499,2018-07-03,1
11017,1,11,HGZ 1 Aguascalientes,3,7,2018,12,7,12,18,58,1,1,2,2,,,,2,2,,,,,,,,,,,,,,,,,,,,,,,,,,,,,,,,,,,,,,,,,,,,,,,1,5,1,2,,,2,2,,,2,,,,,,,,,,,,,,,2,,,,,,,,,,,,,,,,,,,,2,,,,,,,,1,,,,2,,1,10,2,,2,,2,,2,,2,,2,,2,,2,,2,,2,,2,,,,,,,1,1,1,1,2,99,1,2,6,,1,,,2,8,9,11,1,Aguascalientes,2,HGZ 1 Aguascalientes,839,0,12,1,8.10452047789575,2018-07-03,1
11018,1,11,HGZ 1 Aguascalientes,3,7,2018,12,26,12,37,60,1,1,2,1,,,,1,1,15,,,,,,,,,,,,,,,,,,,,,,,,,,,,,,,,,,,,6,1,4,2,1,1,1,2,2,1,2,,,2,,,2,2,,,2,,,,,,,,,,,,,,,2,,,,,,,,,,,,,,,,,,,,2,,,,,,,,2,,,,1,10,2,,1,10,2,,2,,2,,2,,2,,2,,2,,2,,2,,2,,,,,,,1,1,1,3,2,1,1,3,6,,22,12,,1,3,5,11,1,Aguascalientes,2,HGZ 1 Aguascalientes,839,0,12,1,7.81874168032499,2018-07-03,1
11019,1,11,HGZ 1 Aguascalientes,3,7,2018,12,41,12,55,65,1,1,2,1,,,,1,2,,,,,,,,,,,,,,,,,,,,,,,,,,,,,,,,,,,,,,,,,,,,,,,2,,,1,3,97,2,2,,,2,,,,,,,,,,,,,,,2,,,,,,,,,,,,,,,,,,,,2,,,,,,,,1,,,,2,,2,,2,,2,,2,,1,10,2,,2,,2,,2,,2,,2,,2,,,,,,,1,1,1,2,2,1,1,1,2,1,995,,,1,3,5,11,1,Aguascalientes,2,HGZ 1 Aguascalientes,839,0,12,1,7.08628854992318,2018-07-03,1
11022,1,11,HGZ 1 Aguascalientes,3,7,2018,13,18,13,30,22,1,1,10,2,,,,2,1,2,,,,,,,,,,,99,,3,,,3,,2,,,,1,1,,2,,1,1,1,1,1,2,,,,1,1,1,2,1,1,1,1,2,1,1,3,1,2,,,1,2,,,2,,,,,,,,,,,,,,,2,,,,,,,,,,,,,,,,,,,,2,,,,,,,,2,,,,2,,2,,1,9,2,,2,,2,,2,,2,,2,,2,,2,,2,,2,,,,,,,1,1,1,2,2,1,1,2,2,1,1,,,1,3,5,11,1,Aguascalientes,2,HGZ 1 Aguascalientes,839,0,12,1,7.78541591224819,2018-07-03,1
11024,1,11,HGZ 1 Aguascalientes,3,7,2018,13,44,13,53,45,1,1,2,3,,,,3,1,9,,,,,,,,,,,,,,,,,,,,,,,,,,,,,,,,,,,,6,2,6,2,3,1,1,2,2,1,1,6,1,2,,,2,2,,,2,,,,,,,,,,,,,,,2,,,,,,,,,,,,,,,,,,,,2,,,,,,,,1,,,,1,9,2,,1,10,2,,2,,2,,2,,2,,2,,2,,2,,2,,2,,,,,,,1,1,1,2,1,1,1,2,6,,1,,,2,5,1,11,1,Aguascalientes,2,HGZ 1 Aguascalientes,839,0,12,1,8.20529092877523,2018-07-03,1
11025,1,11,HGZ 1 Aguascalientes,3,7,2018,13,59,14,10,53,1,1,2,1,,,,1,2,,,,,,,,,,,,,,,,,,,,,,,,,,,,,,,,,,,,,,,,,,,,,,,1,2,1,2,,,2,2,,,2,,,,,,,,,,,,,,,1,2,2,1,,,,,9,2,1,1,1,1,1,,,,2,2,2,,,,,,,,1,,,,1,9,2,,1,10,1,10,2,,2,,2,,2,,2,,2,,2,,2,,2,,,,,,,1,1,1,1,2,1,1,1,6,,995,,,1,7,9,11,1,Aguascalientes,2,HGZ 1 Aguascalientes,839,0,12,1,7.91595879842413,2018-07-03,1
11026,1,11,HGZ 1 Aguascalientes,3,7,2018,14,16,14,25,49,1,1,2,2,,,,2,1,19,,,,,,,,,,,,,,,,,,,,,,,,,,,,,,,,,,,,4,2,4,5,2,1,1,2,2,1,2,,,2,,,2,2,,,2,,,,,,,,,,,,,,,2,,,,,,,,,,,,,,,,,,,,2,,,,,,,,2,,,,1,7,2,,1,9,2,,2,,2,,2,,2,,2,,2,,2,,2,,2,,,,,,,1,1,1,5,2,1,1,2,2,1,9,8,,2,7,9,11,1,Aguascalientes,2,HGZ 1 Aguascalientes,839,0,12,1,8.20529092877523,2018-07-03,1
11027,1,11,HGZ 1 Aguascalientes,3,7,2018,14,32,14,45,49,1,1,4,1,,,,1,2,,,,,,,,,,,,,,,,,,,,,,,,,,,,,,,,,,,,,,,,,,,,,,,1,2,1,1,2,1,2,2,,,2,,,,,,,,,,,,,,,1,2,6,1,,,,,36,1,1,1,1,1,1,,,,1,2,1,2,,1,1,,,,1,,,,2,,2,,2,,1,10,2,,2,,2,,2,,2,,2,,2,,2,,2,,,,,,,1,1,1,1,2,1,1,2,2,1,995,,,1,5,4,11,1,Aguascalientes,2,HGZ 1 Aguascalientes,839,0,12,1,7.91595879842413,2018-07-03,1
11028,1,11,HGZ 1 Aguascalientes,3,7,2018,14,52,15,4,65,1,1,2,4,9,,,4,2,,,,,,,,,,,,,,,,,,,,,,,,,,,,,,,,,,,,,,,,,,,,,,,1,4,97,2,,,2,2,,,2,,,,,,,,,,,,,,,2,,,,,,,,,,,,,,,,,,,,2,,,,,,,,1,,,,1,10,2,,2,,1,10,1,8,2,,2,,1,9,2,,2,,2,,2,,2,,,,,,,1,1,1,1,1,1,1,1,1,1,1,,,1,7,8,11,1,Aguascalientes,2,HGZ 1 Aguascalientes,839,0,12,1,7.08628854992318,2018-07-03,1
11029,1,11,HGZ 1 Aguascalientes,3,7,2018,15,10,15,22,43,1,1,2,2,,,,2,2,,,,,,,,,,,,,,,,,,,,,,,,,,,,,,,,,,,,,,,,,,,,,,,1,2,97,2,,,2,2,,,2,,,,,,,,,,,,,,,2,,,,,,,,,,,,,,,,,,,,2,,,,,,,,2,,,,2,,1,9,2,,2,,1,10,2,,2,,2,,2,,2,,2,,2,,2,,,,,,,1,1,1,2,2,1,1,3,4,1,995,,,1,5,5,11,1,Aguascalientes,2,HGZ 1 Aguascalientes,839,0,12,1,8.21969461091431,2018-07-03,1
11030,1,11,HGZ 1 Aguascalientes,3,7,2018,15,27,15,39,61,1,32,1781,2,,,,2,2,,,,,,,,,,,,,,,,,,,,,,,,,,,,,,,,,,,,,,,,,,,,,,,1,4,1,2,,,2,2,,,2,,,,,,,,,,,,,,,2,,,,,,,,,,,,,,,,,,,,2,,,,,,,,2,,,,2,,2,,2,,2,,2,,2,,2,,2,,2,,2,,1,8,2,,2,,,,,,,1,1,1,2,2,99,1,3,3,2,13,,,1,1,9,11,1,Aguascalientes,2,HGZ 1 Aguascalientes,839,0,12,1,7.81874168032499,2018-07-03,1
11031,1,11,HGZ 1 Aguascalientes,3,7,2018,15,47,16,1,28,1,32,9888,2,,,,2,1,88,,,,,,,,,,,,,,,,,,,,,,,,,,,,,,,,,,,,13,2,6,4,3,1,1,2,2,1,2,,,2,,,2,2,,,2,,,,,,,,,,,,,,,2,,,,,,,,,,,,,,,,,,,,2,,,,,,,,2,,,,1,10,2,,1,10,2,,2,,2,,2,,2,,2,,2,,2,,2,,2,,,,,,,1,1,1,2,2,1,1,2,2,2,11,10,9,2,5,4,11,1,Aguascalientes,2,HGZ 1 Aguascalientes,839,0,12,1,9.00035375440637,2018-07-03,1
11032,1,11,HGZ 1 Aguascalientes,3,7,2018,16,8,16,21,21,2,1,2,1,,,,1,2,,,,,,,,,,,,,,,,,,,,,,,,,,,,,,,,,,,,,,,,,,,,,,,1,2,1,2,,,2,2,,,2,,,,,,,,,,,,,,,2,,,,,,,,,,,,,,,,,,,,2,,,,,,,,2,,,,2,,2,,2,,1,10,2,,2,,2,,2,,2,,2,,2,,2,,2,,,,,,,2,1,1,2,2,1,1,2,6,,999,,,1,7,4,11,1,Aguascalientes,2,HGZ 1 Aguascalientes,839,0,12,1,7.78541591224819,2018-07-03,1
11033,1,11,HGZ 1 Aguascalientes,3,7,2018,16,26,16,38,42,1,1,2,3,,,,2,1,88,,,,,,,,,,,,,,,,,,,,,,,,,,,,,,,,,,,,13,2,6,5,3,1,1,2,2,1,2,,,2,,,2,2,,,2,,,,,,,,,,,,,,,2,,,,,,,,,,,,,,,,,,,,2,,,,,,,,2,,,,1,8,2,,1,10,2,,2,,2,,2,,2,,2,,2,,2,,2,,2,,,,,,,1,1,1,3,1,1,1,2,6,,18,,,2,5,10,11,1,Aguascalientes,2,HGZ 1 Aguascalientes,839,0,12,1,8.52012843240978,2018-07-03,1
11034,1,11,HGZ 1 Aguascalientes,3,7,2018,16,43,16,52,59,1,1,2,2,,,,2,1,3,,,,,,,,,,,,,,,,,,,,,,,,,,,,,,,,,,,,2,2,1,1,3,1,1,2,2,1,2,,,2,,,1,1,1,,2,,,,,,,,,,,,,,,2,,,,,,,,,,,,,,,,,,,,2,,,,,,,,1,,,,1,9,2,,1,10,2,,2,,2,,2,,2,,2,,2,,2,,1,99,2,,,,,,,1,1,1,2,2,1,1,2,6,,995,,,2,5,9,11,1,Aguascalientes,2,HGZ 1 Aguascalientes,839,0,12,1,8.10452047789575,2018-07-03,1
11035,1,11,HGZ 1 Aguascalientes,3,7,2018,16,57,17,7,66,1,1,5,2,,,,2,2,,,,,,,,,,,,,,,,,,,,,,,,,,,,,,,,,,,,,,,,,,,,,,,2,,,1,2,97,2,2,,,2,,,,,,,,,,,,,,,2,,,,,,,,,,,,,,,,,,,,2,,,,,,,,2,,,,2,,1,8,2,,2,,2,,2,,2,,2,,2,,2,,2,,2,,2,,,,,,,1,1,1,1,2,1,1,2,6,,995,,,2,1,1,11,1,Aguascalientes,2,HGZ 1 Aguascalientes,839,0,12,1,7.34529583061292,2018-07-03,1
11036,1,11,HGZ 1 Aguascalientes,3,7,2018,17,13,17,22,42,1,1,2041,3,,,,3,2,,,,,,,,,,,,,,,,,,,,,,,,,,,,,,,,,,,,,,,,,,,,,,,2,,,1,4,1,2,2,,,2,,,,,,,,,,,,,,,2,,,,,,,,,,,,,,,,,,,,2,,,,,,,,2,,,,2,,2,,2,,1,8,2,,2,,2,,2,,2,,2,,2,,2,,2,,,,,,,1,1,1,1,2,1,1,2,2,1,9,8,,2,7,10,11,1,Aguascalientes,2,HGZ 1 Aguascalientes,839,0,12,1,8.52012843240978,2018-07-03,1
11037,1,11,HGZ 1 Aguascalientes,3,7,2018,17,26,17,41,48,1,1,2,2,,,,2,2,,,,,,,,,,,,,,,,,,,,,,,,,,,,,,,,,,,,,,,,,,,,,,,1,2,1,2,,,2,2,,,2,,,,,,,,,,,,,,,2,,,,,,,,,,,,,,,,,,,,2,,,,,,,,2,,,,2,,2,,2,,1,8,2,,2,,2,,2,,2,,2,,1,8,2,,2,,,,,,,99,1,1,1,1,1,1,2,6,,995,,,1,3,5,11,1,Aguascalientes,2,HGZ 1 Aguascalientes,839,0,12,1,7.91595879842413,2018-07-03,1
11038,1,11,HGZ 1 Aguascalientes,3,7,2018,17,46,17,57,56,2,1,2041,4,105,,,2,1,72,,,,,,,,,,,,,,,,,,,,,,,,,,,,,,,,,,,,8,2,5,4,3,1,1,2,2,1,1,99,2,2,,,1,1,1,,1,61,6,1,,3,1,1,2,,3,2,,,,2,,,,,,,,,,,,,,,,,,,,2,,,,,,,,2,,,,1,10,1,8,1,10,1,10,2,,2,,2,,2,,2,,2,,2,,1,10,2,,,,,,,99,2,1,4,3,1,1,2,6,,11,9,12,1,5,6,11,1,Aguascalientes,2,HGZ 1 Aguascalientes,839,0,12,1,7.81874168032499,2018-07-03,1
11039,1,11,HGZ 1 Aguascalientes,3,7,2018,18,4,18,15,62,1,1,2,1,,,,1,1,30,,,,,,,,,,,,,,,,,,,,,,,,,,,,,,,,,,,,12,1,1,1,2,1,1,1,2,1,1,5,1,1,4,1,2,2,,,2,,,,,,,,,,,,,,,2,,,,,,,,,,,,,,,,,,,,2,,,,,,,,1,,,,2,,2,,1,10,1,10,2,,2,,2,,2,,2,,2,,2,,2,,2,,,,,,,1,1,1,1,2,1,1,1,6,,995,,,2,4,9,11,1,Aguascalientes,2,HGZ 1 Aguascalientes,839,0,12,1,8.10452047789575,2018-07-03,1
11040,1,11,HGZ 1 Aguascalientes,3,7,2018,18,23,18,37,49,1,1,4,4,1,8,14,4,2,,,,,,,,,,,,,,,,,,,,,,,,,,,,,,,,,,,,,,,,,,,,,,,1,7,1,2,,,2,2,,,2,,,,,,,,,,,,,,,2,,,,,,,,,,,,,,,,,,,,2,,,,,,,,2,,,,2,,1,9,2,,2,,2,,2,,2,,2,,2,,2,,2,,2,,2,,,,,,,1,1,1,3,1,1,1,3,3,1,1,,,1,5,4,11,1,Aguascalientes,2,HGZ 1 Aguascalientes,839,0,12,1,7.91595879842413,2018-07-03,1
11041,1,11,HGZ 1 Aguascalientes,3,7,2018,8,18,8,33,58,1,1,2,1,,,,1,1,3,,,,,,,,,,,,,,,,,,,,,,,,,,,,,,,,,,,,2,2,1,2,2,1,1,2,2,1,2,,,1,5,1,2,2,,,2,,,,,,,,,,,,,,,2,,,,,,,,,,,,,,,,,,,,2,,,,,,,,1,,,,1,10,2,,1,10,2,,2,,1,10,2,,2,,2,,2,,2,,2,,2,,,,,,,1,1,1,3,1,1,1,2,6,,995,,,1,3,11,11,1,Aguascalientes,2,HGZ 1 Aguascalientes,839,0,12,1,7.81874168032499,2018-07-03,1
11042,1,11,HGZ 1 Aguascalientes,3,7,2018,8,43,8,53,41,1,1,1,2,,,,2,1,42,,,,,,,,,,,,,,,,,,,,,,,,,,,,,,,,,,,,13,1,1,2,1,2,1,2,99,1,1,2,1,1,3,1,1,1,1,,2,,,,,,,,,,,,,,,2,,,,,,,,,,,,,,,,,,,,2,,,,,,,,2,,,,1,10,1,10,1,8,2,,2,,2,,2,,2,,2,,2,,2,,1,10,2,,,,,,,1,1,1,1,1,1,1,2,6,,995,,,1,3,11,11,1,Aguascalientes,2,HGZ 1 Aguascalientes,839,0,12,1,8.21969461091431,2018-07-03,1
11043,1,11,HGZ 1 Aguascalientes,3,7,2018,9,4,9,18,67,1,1,2,3,,,,3,1,4,,,,,,,,,,,,,,,,,,,,,,,,,,,,,,,,,,,,5,2,5,2,1,1,1,2,2,1,1,5,1,1,2,1,1,1,2,1,2,,,,,,,,,,,,,,,2,,,,,,,,,,,,,,,,,,,,2,,,,,,,,2,,,,1,6,2,,1,10,2,,2,,2,,2,,2,,2,,2,,2,,1,10,2,,,,,,,1,1,1,2,2,2,1,3,6,,1,,,1,7,5,11,1,Aguascalientes,2,HGZ 1 Aguascalientes,839,0,12,1,7.08628854992318,2018-07-03,1
11045,1,11,HGZ 1 Aguascalientes,3,7,2018,9,38,9,48,59,1,1,5,2,,,,2,1,11,,,,,,,,,,,,,,,,,,,,,,,,,,,,,,,,,,,,9,2,1,2,1,1,1,2,2,1,1,2,1,1,2,1,1,1,2,1,1,14,5,1,,1,4,2,2,,2,1,,,,1,2,1,1,,,,,31,1,1,4,2,2,2,,,,2,1,1,1,,1,2,,,,2,,,,1,9,2,,1,10,1,10,2,,2,,2,,2,,2,,2,,2,,1,9,1,10,,,,,,1,1,1,1,2,1,1,2,2,1,90,,,2,2,8,11,1,Aguascalientes,2,HGZ 1 Aguascalientes,839,0,12,1,8.10452047789575,2018-07-03,1
11046,1,11,HGZ 1 Aguascalientes,3,7,2018,9,57,10,6,53,1,1,5,4,21,,,4,1,9,,,,,,,,,,,,,,,,,,,,,,,,,,,,,,,,,,,,2,2,1,2,1,1,1,2,1,1,2,,,1,2,1,1,1,1,,1,17,5,1,,3,4,2,1,2,2,1,,,,2,,,,,,,,,,,,,,,,,,,,2,,,,,,,,2,,,,1,10,2,,1,8,1,10,2,,2,,2,,2,,2,,2,,2,,1,10,2,,,,,,,1,1,2,2,2,1,2,2,2,1,1,12,,1,5,11,11,1,Aguascalientes,2,HGZ 1 Aguascalientes,839,0,12,1,7.91595879842413,2018-07-03,1
11047,1,11,HGZ 1 Aguascalientes,3,7,2018,10,14,10,26,79,1,1,5,3,,,,3,1,3,,,,,,,,,,,,,,,,,,,,,,,,,,,,,,,,,,,,36,2,2,2,1,2,1,2,2,1,2,,,2,,,1,1,1,,2,,,,,,,,,,,,,,,2,,,,,,,,,,,,,,,,,,,,2,,,,,,,,2,,,,1,10,2,,1,10,2,,2,,2,,2,,2,,2,,2,,2,,1,10,2,,,,,,,1,1,1,3,1,1,1,2,3,99,9,8,1,1,3,5,11,1,Aguascalientes,2,HGZ 1 Aguascalientes,839,0,12,1,7.08628854992318,2018-07-03,1
11048,1,11,HGZ 1 Aguascalientes,3,7,2018,10,35,10,49,33,1,1,2,2,,,,2,1,22,,,,,,,,,,,,,,,,,,,,,,,,,,,,,,,,,,,,2,2,1,4,2,1,1,2,2,2,1,5,1,1,2,2,2,2,,,2,,,,,,,,,,,,,,,2,,,,,,,,,,,,,,,,,,,,2,,,,,,,,2,,,,1,10,2,,1,6,1,10,2,,2,,2,,2,,2,,2,,2,,2,,2,,,,,,,2,2,2,1,1,1,1,2,6,,1,8,9,1,5,5,11,1,Aguascalientes,2,HGZ 1 Aguascalientes,839,0,12,1,8.68298639372650,2018-07-03,1
11050,1,11,HGZ 1 Aguascalientes,3,7,2018,11,12,11,27,54,1,1,2,2,,,,2,2,,,,,,,,,,,,,,,,,,,,,,,,,,,,,,,,,,,,,,,,,,,,,,,1,2,1,1,2,2,2,2,,,2,,,,,,,,,,,,,,,2,,,,,,,,,,,,,,,,,,,,2,,,,,,,,2,,,,1,8,2,,1,10,2,,1,10,1,10,2,,2,,99,,99,,99,,99,,99,,,,,,,1,1,1,1,1,1,1,2,6,,995,,,1,3,11,11,1,Aguascalientes,2,HGZ 1 Aguascalientes,839,0,12,1,7.91595879842413,2018-07-03,1
11051,1,11,HGZ 1 Aguascalientes,3,7,2018,11,34,11,47,50,1,1,2,2,,,,2,1,3,,,,,,,,,,,,,,,,,,,,,,,,,,,,,,,,,,,,2,1,4,2,1,1,1,2,2,1,2,,,1,9,1,1,2,,,2,,,,,,,,,,,,,,,2,,,,,,,,,,,,,,,,,,,,2,,,,,,,,1,,,,2,,2,,1,10,2,,2,,1,10,1,10,2,,2,,2,,2,,2,,2,,,,,,,1,1,1,1,2,1,1,3,2,1,14,1,,1,7,12,11,1,Aguascalientes,2,HGZ 1 Aguascalientes,839,0,12,1,7.91595879842413,2018-07-03,1
11052,1,11,HGZ 1 Aguascalientes,3,7,2018,11,58,12,13,68,1,1,1,2,,,,2,1,30,,,,,,,,,,,,,,,,,,,,,,,,,,,,,,,,,,,,999,2,5,4,1,1,1,2,2,2,2,,,2,,,2,2,,,2,,,,,,,,,,,,,,,2,,,,,,,,,,,,,,,,,,,,2,,,,,,,,2,,,,1,10,2,,1,10,2,,2,,2,,2,,2,,99,,99,,99,,2,,2,,,,,,,99,2,1,4,2,1,1,2,6,,1,12,,1,3,8,11,1,Aguascalientes,2,HGZ 1 Aguascalientes,839,0,12,1,7.08628854992318,2018-07-03,1
11053,1,11,HGZ 1 Aguascalientes,3,7,2018,12,23,12,35,48,1,1,2,2,,,,2,1,8,,,,,,,,,,,,,,,,,,,,,,,,,,,,,,,,,,,,17,2,4,4,1,1,1,2,2,1,2,,,2,,,2,2,,,2,,,,,,,,,,,,,,,2,,,,,,,,,,,,,,,,,,,,2,,,,,,,,2,,,,1,10,2,,1,10,2,,2,,2,,2,,2,,2,,99,,99,,99,,99,,,,,,,1,1,1,3,1,1,1,2,6,,1,8,9,1,6,7,11,1,Aguascalientes,2,HGZ 1 Aguascalientes,839,0,12,1,7.91595879842413,2018-07-03,1
11054,1,11,HGZ 1 Aguascalientes,3,7,2018,12,44,12,54,40,2,1,2041,2,,,,2,1,10,,,,,,,,,,,,,,,,,,,,,,,,,,,,,,,,,,,,8,2,4,2,1,1,1,2,2,1,2,,,1,2,1,1,1,2,1,2,,,,,,,,,,,,,,,2,,,,,,,,,,,,,,,,,,,,2,,,,,,,,1,,,,1,10,2,,99,,2,,2,,2,,2,,2,,2,,2,,2,,1,8,2,,,,,,,1,1,1,1,1,1,1,2,6,,10,1,,1,5,5,11,1,Aguascalientes,2,HGZ 1 Aguascalientes,839,0,12,1,8.21969461091431,2018-07-03,1
11055,1,11,HGZ 1 Aguascalientes,3,7,2018,13,5,13,13,52,1,1,5,2,,,,2,1,14,,,,,,,,,,,,,,,,,,,,,,,,,,,,,,,,,,,,10,1,6,5,1,1,2,2,2,1,1,2,1,1,2,1,1,1,1,,2,,,,,,,,,,,,,,,2,,,,,,,,,,,,,,,,,,,,2,,,,,,,,2,,,,1,10,2,,1,10,1,10,2,,2,,2,,2,,2,,2,,2,,1,99,2,,,,,,,2,1,1,5,1,1,1,2,2,1,9,10,,2,7,9,11,1,Aguascalientes,2,HGZ 1 Aguascalientes,839,0,12,1,8.20529092877523,2018-07-03,1
11056,1,11,HGZ 1 Aguascalientes,3,7,2018,13,21,13,33,54,1,1,2,2,,,,2,2,,,,,,,,,,,,,,,,,,,,,,,,,,,,,,,,,,,,,,,,,,,,,,,1,5,1,1,5,1,1,1,1,,1,13,5,1,,2,4,2,2,,2,1,,,,2,,,,,,,,,,,,,,,,,,,,2,,,,,,,,1,,,,1,10,2,,1,10,2,,2,,2,,2,,2,,2,,2,,2,,1,10,2,,,,,,,1,1,1,3,2,1,1,2,6,,995,,,1,7,12,11,1,Aguascalientes,2,HGZ 1 Aguascalientes,839,0,12,1,7.91595879842413,2018-07-03,1
11057,1,11,HGZ 1 Aguascalientes,3,7,2018,13,41,13,50,19,1,1,4,2,,,,2,1,13,,,,,,,,,,,,,,,,,,,,,,,,,,,,,,,,,,,,6,2,6,4,1,1,1,2,2,1,2,,,1,2,1,2,2,,,1,33,5,1,,2,4,2,2,,2,2,,,,2,,,,,,,,,,,,,,,,,,,,2,,,,,,,,2,,,,1,10,2,,1,10,2,,2,,2,,2,,2,,99,,99,,2,,2,,2,,,,,,,1,1,1,2,2,1,1,2,6,,8,,,1,7,1,11,1,Aguascalientes,2,HGZ 1 Aguascalientes,839,0,12,1,7.78541591224819,2018-07-03,1
11058,1,11,HGZ 1 Aguascalientes,3,7,2018,14,0,14,10,53,1,1,2,2,,,,2,2,,,,,,,,,,,,,,,,,,,,,,,,,,,,,,,,,,,,,,,,,,,,,,,1,4,1,1,4,1,2,2,,,2,,,,,,,,,,,,,,,2,,,,,,,,,,,,,,,,,,,,2,,,,,,,,1,,,,1,10,2,,1,10,1,10,1,10,2,,2,,2,,2,,2,,2,,2,,2,,,,,,,1,1,1,1,2,1,1,2,2,1,1,11,,2,7,2,11,1,Aguascalientes,2,HGZ 1 Aguascalientes,839,0,12,1,8.20529092877523,2018-07-03,1
11059,1,11,HGZ 1 Aguascalientes,3,7,2018,14,17,14,30,46,1,1,6,4,4,14,11,5,1,66,,,,,,,,,,,,,,,,,,,,,,,,,,,,,,,,,,,,10,2,6,5,2,1,2,1,2,1,2,,,2,,,1,1,1,,2,,,,,,,,,,,,,,,2,,,,,,,,,,,,,,,,,,,,2,,,,,,,,3,,,,1,8,2,,1,8,2,,2,,2,,2,,2,,2,,99,,99,,99,,2,,,,,,,2,2,1,5,3,2,2,3,6,,1,11,,2,5,4,11,1,Aguascalientes,2,HGZ 1 Aguascalientes,839,0,12,1,8.20529092877523,2018-07-03,1
11060,1,11,HGZ 1 Aguascalientes,3,7,2018,14,42,14,53,39,1,1,1,5,14,,,5,1,55,,,,,,,,,,,,,,,,,,,,,,,,,,,,,,,,,,,,16,1,6,5,2,2,2,1,2,2,1,99,1,2,,,2,2,,,2,,,,,,,,,,,,,,,2,,,,,,,,,,,,,,,,,,,,2,,,,,,,,5,5,2,,2,,2,,1,7,2,,2,,2,,2,,2,,2,,2,,2,,2,,2,,,,,,,2,2,2,99,,1,2,2,6,,12,,,1,7,5,11,1,Aguascalientes,2,HGZ 1 Aguascalientes,839,0,12,1,8.21969461091431,2018-07-03,1
11061,1,11,HGZ 1 Aguascalientes,3,7,2018,15,0,15,9,27,1,1,10,2,,,,2,1,47,,,,,,,,,,,,,,,,,,,,,,,,,,,,,,,,,,,,14,2,4,2,1,1,1,2,2,1,1,6,1,2,,,1,1,1,,2,,,,,,,,,,,,,,,2,,,,,,,,,,,,,,,,,,,,2,,,,,,,,2,,,,1,9,2,,1,10,2,,2,,2,,2,,2,,2,,2,,2,,1,10,2,,,,,,,1,1,1,3,1,1,1,2,2,1,995,,,1,7,5,11,1,Aguascalientes,2,HGZ 1 Aguascalientes,839,0,12,1,8.68298639372650,2018-07-03,1
11062,1,11,HGZ 1 Aguascalientes,3,7,2018,15,17,15,28,58,1,1,5,3,,,,3,1,3,,,,,,,,,,,,,,,,,,,,,,,,,,,,,,,,,,,,2,2,6,4,2,1,1,1,2,1,2,,,2,,,2,2,,,1,2,5,1,,3,4,1,1,2,2,2,,,,2,,,,,,,,,,,,,,,,,,,,2,,,,,,,,3,,,,1,8,2,,1,8,2,,2,,2,,2,,2,,2,,2,,2,,2,,2,,,,,,,2,1,2,3,2,1,2,2,6,,1,,,2,5,7,11,1,Aguascalientes,2,HGZ 1 Aguascalientes,839,0,12,1,8.10452047789575,2018-07-03,1
11063,1,11,HGZ 1 Aguascalientes,3,7,2018,15,36,15,49,62,1,1,5,2,,,,2,1,3,,,,,,,,,,,,,,,,,,,,,,,,,,,,,,,,,,,,2,1,1,2,1,2,1,2,2,1,2,,,2,,,2,2,,,2,,,,,,,,,,,,,,,2,,,,,,,,,,,,,,,,,,,,2,,,,,,,,2,,,,1,10,2,,1,10,2,,2,,2,,2,,2,,2,,2,,2,,2,,2,,,,,,,1,1,1,97,,1,1,2,6,,995,,,1,3,11,11,1,Aguascalientes,2,HGZ 1 Aguascalientes,839,0,12,1,7.81874168032499,2018-07-03,1
11064,1,11,HGZ 1 Aguascalientes,3,7,2018,15,59,16,11,34,1,1,5,2,,,,2,1,10,,,,,,,,,,,,,,,,,,,,,,,,,,,,,,,,,,,,15,2,1,2,1,2,1,2,2,1,1,4,1,2,,,2,2,,,2,,,,,,,,,,,,,,,2,,,,,,,,,,,,,,,,,,,,1,1,,1,1,,,,1,,,,2,,2,,1,10,2,,2,,2,,2,,2,,2,,2,,2,,2,,2,,,,,,,99,1,1,1,2,1,1,2,6,,1,,,1,6,5,11,1,Aguascalientes,2,HGZ 1 Aguascalientes,839,0,12,1,8.68298639372650,2018-07-03,1
11065,1,11,HGZ 1 Aguascalientes,3,7,2018,16,18,16,27,65,1,1,2,2,,,,2,1,11,,,,,,,,,,,,,,,,,,,,,,,,,,,,,,,,,,,,6,2,6,4,1,1,1,2,2,1,2,,,2,,,2,2,,,2,,,,,,,,,,,,,,,2,,,,,,,,,,,,,,,,,,,,2,,,,,,,,3,,,,1,8,2,,1,8,2,,2,,2,,2,,2,,2,,2,,99,,2,,2,,,,,,,1,1,1,3,2,1,1,2,6,,1,,,2,2,4,11,1,Aguascalientes,2,HGZ 1 Aguascalientes,839,0,12,1,7.34529583061292,2018-07-03,1
11066,1,11,HGZ 1 Aguascalientes,3,7,2018,16,36,16,46,57,1,1,2,2,,,,2,1,43,,,,,,,,,,,,,,,,,,,,,,,,,,,,,,,,,,,,12,1,4,4,1,1,1,2,2,1,2,,,2,,,1,1,1,,2,,,,,,,,,,,,,,,2,,,,,,,,,,,,,,,,,,,,2,,,,,,,,2,,,,1,9,1,9,1,10,2,,99,,99,,99,,2,,2,,2,,2,,1,10,2,,,,,,,2,1,1,2,2,1,1,2,2,1,12,,,1,1,5,11,1,Aguascalientes,2,HGZ 1 Aguascalientes,839,0,12,1,7.81874168032499,2018-07-03,1
11067,1,11,HGZ 1 Aguascalientes,3,7,2018,16,54,17,7,28,1,1,2,2,,,,2,2,,,,,,,,,,,,,,,,,,,,,,,,,,,,,,,,,,,,,,,,,,,,,,,1,3,1,2,,,1,1,1,,2,,,,,,,,,,,,,,,2,,,,,,,,,,,,,,,,,,,,2,,,,,,,,2,,,,1,10,2,,1,10,2,,2,,2,,2,,2,,2,,2,,2,,1,10,2,,,,,,,1,1,1,2,2,1,1,2,6,,1,9,,1,5,5,11,1,Aguascalientes,2,HGZ 1 Aguascalientes,839,0,12,1,8.68298639372650,2018-07-03,1
11068,1,11,HGZ 1 Aguascalientes,3,7,2018,17,15,17,28,73,1,1,2041,2,,,,2,1,4,,,,,,,,,,,,,,,,,,,,,,,,,,,,,,,,,,,,3,2,1,2,1,1,1,2,2,1,2,,,2,,,2,2,,,1,10,5,1,,2,4,2,2,,2,2,,,,2,,,,,,,,,,,,,,,,,,,,2,,,,,,,,2,,,,1,10,2,,1,10,2,,2,,2,,2,,2,,2,,2,,2,,2,,99,,,,,,,1,1,1,5,2,1,1,2,6,,995,,,1,4,5,11,1,Aguascalientes,2,HGZ 1 Aguascalientes,839,0,12,1,7.08628854992318,2018-07-03,1
11069,1,11,HGZ 1 Aguascalientes,3,7,2018,17,39,17,52,29,1,1,3,2,,,,2,1,58,,,,,,,,,,,,,,,,,,,,,,,,,,,,,,,,,,,,12,2,1,2,1,1,1,2,2,2,2,,,2,,,1,1,1,,2,,,,,,,,,,,,,,,2,,,,,,,,,,,,,,,,,,,,2,,,,,,,,2,,,,1,8,2,,1,10,2,,2,,2,,2,,2,,2,,2,,2,,1,8,2,,,,,,,1,1,1,5,1,1,1,2,6,,1,57,,1,5,5,11,1,Aguascalientes,2,HGZ 1 Aguascalientes,839,0,12,1,8.68298639372650,2018-07-03,1