folio,deleg,id_unid,unidmed,fecha_d,fecha_m,fecha_a,hr_ini_h,hr_ini_m,hr_fin_h,hr_fin_m,edad,tipopac,sat1,sat3,probsal,tmedreg2,durasis_c,preosad,tratocomf,preven3,filtrosaux1,temsad1,temsad1a,filtrosaux2,temsad2,temsad2a,filtrofarm2,tfarsurt,totmed,motnosurt,resurt1,btratou,calfatna_a,calfatna_c,calfatna_e,calfatna_f,calfatna_g,calfatna_h,calfatna_n,calfatna_j,calfatna_k,calfatna_l,calfatna_m,calfatnb_a,calfatnb_c,calfatnb_e,calfatnb_f,calfatnb_g,calfatnb_h,calfatnb_n,calfatnb_j,calfatnb_k,calfatnb_l,calfatnb_m,calfinmb_f,limp1,limp2,recomej_a,recomej_b,recomej_c,recomuni,sugeren,sexo,escolar,Delegaci�n,Nivel,nivel_f,promedio_diario2014,estrato,MOSCondia,FE_FinalNR
"12,105,058",1,2,UMF 1 Aguascalientes,27,10,15,18,57,19,6,48,1,1,1,151,1,1,1,2,2,2,,,2,,,1,1,1,,3,2,1,1,2,2,2,2,1,2,2,2,2,2,1,,,,,2,,,,,2,6,,9,5,,1,26,1,5,Aguascalientes,1,1,"1,346",1.00,0.24,24.18
"12,105,057",1,2,UMF 1 Aguascalientes,27,10,15,18,4,18,9,56,1,2,2,1,1,2,2,2,1,1,3,1,2,,,1,1,1,,3,1,1,1,2,2,2,2,1,2,2,2,2,2,1,,,,,2,,,,,2,6,,3,4,7,1,996,1,3,Aguascalientes,1,1,"1,346",1.00,0.24,28.27
"12,105,056",1,2,UMF 1 Aguascalientes,27,10,15,17,29,17,34,59,1,2,2,11,2,1,1,2,2,2,,,2,,,1,1,1,,3,2,1,1,2,2,2,2,2,2,1,2,2,2,2,,,,,,,2,,,2,3,2,3,,,1,996,2,7,Aguascalientes,1,1,"1,346",1.00,0.24,28.88
"12,105,055",1,2,UMF 1 Aguascalientes,27,10,15,17,4,17,11,22,1,2,2,170,2,1,1,1,2,2,,,2,,,1,1,1,,3,1,1,1,1,2,1,2,1,2,2,2,2,1,3,1,,1,,3,,,,,3,5,2,6,9,1,3,996,2,7,Aguascalientes,1,1,"1,346",1.00,0.24,28.12
"12,105,054",1,2,UMF 1 Aguascalientes,27,10,15,16,42,16,49,49,1,4,4,7,2,1,1,2,1,2,,,2,,,1,1,2,2,3,2,1,1,2,2,2,2,1,2,2,1,2,1,4,,,,,1,,,1,,2,2,2,9,3,4,1,1,1,5,Aguascalientes,1,1,"1,346",1.00,0.24,24.18
"12,105,052",1,2,UMF 1 Aguascalientes,27,10,15,16,14,16,23,62,1,4,4,2,6,2,2,1,2,2,,,1,4,1,1,1,1,,3,1,1,1,2,2,1,2,1,2,2,2,1,1,2,,,1,,1,,,,3,2,2,2,1,3,6,4,1,1,9,Aguascalientes,1,1,"1,346",1.00,0.24,28.27
"12,105,051",1,2,UMF 1 Aguascalientes,27,10,15,15,44,15,49,56,1,2,2,1,1,2,1,2,1,1,1,1,2,,,1,1,1,,3,2,2,1,1,2,2,2,1,2,2,2,2,,1,1,,,,2,,,,,2,6,,4,3,9,1,996,1,3,Aguascalientes,1,1,"1,346",1.00,0.24,28.27
"12,105,050",1,2,UMF 1 Aguascalientes,27,10,15,15,21,15,26,22,2,1,2,7,2,1,1,2,1,2,,,1,1,1,1,1,1,,3,2,1,1,2,2,2,2,1,2,2,2,2,2,1,,,,,1,,,,,1,1,1,3,4,,1,996,1,5,Aguascalientes,1,1,"1,346",1.00,0.24,27.52
"12,105,049",1,2,UMF 1 Aguascalientes,27,10,15,15,6,15,11,22,2,2,2,7,4,1,2,2,2,2,,,1,3,1,1,1,1,,3,1,1,1,2,2,2,2,1,2,2,2,2,2,1,,,,,2,,,,,2,2,1,12,,,1,996,1,4,Aguascalientes,1,1,"1,346",1.00,0.24,27.52
"12,105,046",1,2,UMF 1 Aguascalientes,27,10,15,12,55,13,2,54,1,4,2,2,4,1,1,1,1,2,,,2,,,1,1,1,,3,2,1,1,2,2,2,2,1,2,2,2,2,2,4,,,,,2,,,,,4,5,2,1,4,3,1,998,1,5,Aguascalientes,1,1,"1,346",1.00,0.24,24.18
"12,105,045",1,2,UMF 1 Aguascalientes,27,10,15,12,15,12,21,55,1,2,2,1,4,1,1,2,2,1,3,1,2,,,1,1,2,1,3,2,2,1,1,2,2,2,1,2,2,1,2,,2,1,,,,2,,,2,,4,5,2,5,4,3,1,996,1,3,Aguascalientes,1,1,"1,346",1.00,0.24,28.27
"12,105,044",1,2,UMF 1 Aguascalientes,27,10,15,11,45,11,50,50,1,2,2,28,1,1,1,2,1,2,,,2,,,1,1,1,,3,1,1,1,1,2,2,2,1,2,2,2,2,2,2,2,,,,2,,,,,2,6,,9,4,,1,996,1,3,Aguascalientes,1,1,"1,346",1.00,0.24,24.18
"12,105,041",1,2,UMF 1 Aguascalientes,27,10,15,11,17,11,23,36,1,2,2,44,1,2,1,2,1,1,2,1,2,,,1,1,1,,3,1,1,1,2,2,2,2,1,2,2,2,2,2,1,,,,,1,,,,,1,2,1,9,2,,1,10,1,3,Aguascalientes,1,1,"1,346",1.00,0.24,27.12
"12,105,040",1,2,UMF 1 Aguascalientes,27,10,15,10,49,10,54,25,2,2,2,38,1,1,1,2,1,2,,,2,,,1,1,1,,3,1,1,2,1,2,2,2,1,2,2,2,2,2,,1,,,,2,,,,,5,5,2,5,1,4,1,996,2,9,Aguascalientes,1,1,"1,346",1.00,0.24,28.12
"12,105,038",1,2,UMF 1 Aguascalientes,27,10,15,10,28,10,33,40,1,1,2,7,2,1,1,2,1,2,,,1,1,1,1,1,1,,3,1,1,1,2,1,2,2,1,2,2,2,2,2,1,,1,,,2,,,,,2,4,2,5,2,1,1,996,1,5,Aguascalientes,1,1,"1,346",1.00,0.24,27.12
"12,105,036",1,2,UMF 1 Aguascalientes,27,10,15,10,7,10,13,65,1,2,2,1,2,1,1,2,1,1,3,1,2,,,1,1,1,,3,2,1,1,1,2,2,2,1,2,2,2,2,2,2,2,,,,2,,,,,2,2,2,2,4,9,1,996,1,2,Aguascalientes,1,1,"1,346",1.00,0.24,24.90
"12,105,035",1,2,UMF 1 Aguascalientes,27,10,15,9,48,9,53,39,1,4,2,7,2,1,2,2,1,2,,,2,,,1,1,1,,3,1,1,1,1,2,2,2,1,2,1,2,2,1,1,1,,,,2,,1,,,2,2,2,1,4,,1,1,1,5,Aguascalientes,1,1,"1,346",1.00,0.24,27.12
"12,105,033",1,2,UMF 1 Aguascalientes,27,10,15,9,25,9,30,32,1,2,2,13,2,1,1,2,1,2,,,1,1,1,1,1,1,,3,2,1,2,1,1,1,2,1,2,2,2,2,2,,2,2,2,,2,,,,,2,2,1,4,9,,1,996,1,5,Aguascalientes,1,1,"1,346",1.00,0.24,28.74
"12,105,032",1,2,UMF 1 Aguascalientes,27,10,15,8,57,9,4,72,1,2,2,2,3,1,1,2,2,1,1,1,2,,,1,1,1,,3,1,1,1,2,2,2,2,2,2,2,2,2,1,1,,,,,,,,,,2,6,,8,,,1,10,1,3,Aguascalientes,1,1,"1,346",1.00,0.24,24.90
"12,105,031",1,2,UMF 1 Aguascalientes,27,10,15,8,37,8,43,35,1,2,2,13,2,1,1,1,2,2,,,2,,,1,1,1,,3,1,1,1,2,2,2,2,1,2,2,2,2,2,1,,,,,2,,,,,2,2,2,1,3,10,2,1,1,5,Aguascalientes,1,1,"1,346",1.00,0.24,27.12
"12,105,030",1,2,UMF 1 Aguascalientes,27,10,15,8,4,8,12,34,1,2,2,12,1,2,1,2,1,1,4,1,1,1,1,1,1,1,,3,1,2,1,2,2,2,2,1,2,2,1,2,,1,,,,,1,,,2,,2,2,2,4,9,1,1,998,1,7,Aguascalientes,1,1,"1,346",1.00,0.24,28.74
"11,343,070",1,2,UMF 1 Aguascalientes,27,10,15,19,10,19,17,60,1,2,2,2,3,1,1,2,2,2,,,2,,,1,1,1,,3,2,1,1,1,2,2,2,1,2,2,2,2,2,2,2,,,,2,,,,,2,6,,1,,,2,1,2,8,Aguascalientes,1,1,"1,346",1.00,0.24,28.88
"11,343,069",1,2,UMF 1 Aguascalientes,27,10,15,18,26,18,32,40,1,2,2,2,1,1,1,2,1,2,,,2,,,1,1,1,,3,2,1,1,2,2,2,2,1,2,2,2,2,2,2,,,,,2,,,,,2,4,2,5,,,3,996,1,5,Aguascalientes,1,1,"1,346",1.00,0.24,27.12
"11,343,067",1,2,UMF 1 Aguascalientes,27,10,15,17,45,17,51,61,1,2,2,2,1,1,1,2,2,2,,,2,,,1,1,1,,3,2,1,1,2,2,2,2,1,2,2,2,2,2,2,,,,,2,,,,,2,6,,12,,,2,996,1,2,Aguascalientes,1,1,"1,346",1.00,0.24,28.27
"11,343,066",1,2,UMF 1 Aguascalientes,27,10,15,17,14,17,19,25,1,2,2,3,6,1,1,2,2,2,,,2,,,1,1,1,,3,1,1,1,1,2,2,2,1,2,2,2,2,2,2,2,,,,2,,,,,2,2,1,12,,,2,10,1,5,Aguascalientes,1,1,"1,346",1.00,0.24,27.52
"11,343,065",1,2,UMF 1 Aguascalientes,27,10,15,16,49,16,56,23,2,2,2,7,2,1,1,2,2,1,1,1,2,,,1,1,1,,3,1,1,1,2,2,2,2,1,2,2,2,2,2,2,,,,,1,,,,,2,4,2,5,,,2,996,1,5,Aguascalientes,1,1,"1,346",1.00,0.24,27.52
"11,343,064",1,2,UMF 1 Aguascalientes,27,10,15,16,22,16,30,39,1,1,1,19,1,1,1,2,2,2,,,2,,,1,1,1,,3,2,1,1,1,2,2,2,1,2,2,2,2,2,2,2,,,,2,,,,,3,6,,2,,,99,3,2,4,Aguascalientes,1,1,"1,346",1.00,0.24,27.70
"11,343,063",1,2,UMF 1 Aguascalientes,27,10,15,15,57,16,4,48,1,2,2,14,4,1,1,2,1,2,,,2,,,1,1,1,,3,2,1,1,1,2,2,2,1,2,2,2,2,2,2,2,,,,2,,,,,2,2,1,1,2,,2,26,1,7,Aguascalientes,1,1,"1,346",1.00,0.24,24.18
"11,343,062",1,2,UMF 1 Aguascalientes,27,10,15,15,15,15,20,72,1,2,2,2,1,1,1,2,1,2,,,2,,,1,1,1,,3,1,1,1,1,2,2,2,1,2,2,2,2,2,2,2,,,,2,,,,,2,6,,12,,,2,12,1,3,Aguascalientes,1,1,"1,346",1.00,0.24,24.90
"11,343,061",1,2,UMF 1 Aguascalientes,27,10,15,14,42,14,48,20,1,2,2,50,1,1,1,2,1,2,,,2,,,1,1,1,,3,1,1,1,2,2,2,2,1,2,2,2,2,2,2,,,,,2,,,,,2,4,1,5,,,2,12,1,5,Aguascalientes,1,1,"1,346",1.00,0.24,27.52
"11,343,060",1,2,UMF 1 Aguascalientes,27,10,15,13,10,13,15,28,1,2,2,3,2,1,1,2,1,1,2,1,1,2,1,1,1,1,,3,2,1,1,1,2,2,2,1,2,2,2,2,2,2,2,,,,2,,,,,2,2,1,5,,,2,996,1,5,Aguascalientes,1,1,"1,346",1.00,0.24,28.74
"11,343,059",1,2,UMF 1 Aguascalientes,27,10,15,12,29,12,34,73,1,2,2,1,1,1,1,2,2,2,,,2,,,1,1,1,,3,1,1,1,1,2,2,2,1,2,2,2,2,2,2,2,,,,2,,,,,2,6,,12,,,2,996,2,5,Aguascalientes,1,1,"1,346",1.00,0.24,25.43
"11,343,058",1,2,UMF 1 Aguascalientes,27,10,15,11,58,12,3,54,1,2,2,2,2,1,1,2,1,1,3,1,2,,,1,1,1,,3,2,1,1,2,2,2,2,1,2,2,2,2,2,2,,,,,2,,,,,2,6,,12,,,2,12,1,2,Aguascalientes,1,1,"1,346",1.00,0.24,24.18
"11,343,057",1,2,UMF 1 Aguascalientes,27,10,15,11,27,11,32,42,2,2,2,3,1,1,1,2,2,2,,,2,,,1,1,1,,3,1,1,1,1,2,2,2,1,2,2,2,2,2,2,2,,,,2,,,,,2,2,1,12,,,2,12,1,3,Aguascalientes,1,1,"1,346",1.00,0.24,27.12
"11,343,056",1,2,UMF 1 Aguascalientes,27,10,15,10,58,11,5,35,1,2,2,21,4,1,1,2,2,1,1,1,1,1,1,2,,,,3,1,1,1,1,2,1,2,2,2,2,2,2,2,2,2,,2,,,,,,,2,6,,12,,,2,12,1,1,Aguascalientes,1,1,"1,346",1.00,0.24,27.12
"11,343,055",1,2,UMF 1 Aguascalientes,27,10,15,10,34,10,39,24,2,2,2,3,2,1,1,2,1,2,,,2,,,1,1,1,,3,2,1,1,1,2,2,2,1,2,2,2,2,2,2,2,,,,2,,,,,4,4,2,5,998,,2,996,1,5,Aguascalientes,1,1,"1,346",1.00,0.24,27.52
"11,343,054",1,2,UMF 1 Aguascalientes,27,10,15,10,16,10,21,37,1,2,2,19,1,1,1,2,1,2,,,2,,,2,,,,3,2,1,1,1,1,2,2,2,2,2,2,2,2,2,2,2,,,,,,,,2,6,,12,,,2,996,2,3,Aguascalientes,1,1,"1,346",1.00,0.24,27.70
"11,343,053",1,2,UMF 1 Aguascalientes,27,10,15,9,57,10,2,32,2,1,2,3,2,1,1,2,2,2,,,2,,,1,1,1,,3,2,1,1,1,2,2,2,1,2,2,2,2,2,2,2,,,,2,,,,,2,2,1,12,,,2,15,1,5,Aguascalientes,1,1,"1,346",1.00,0.24,28.74
"11,343,051",1,2,UMF 1 Aguascalientes,27,10,15,9,36,9,41,59,1,2,2,1,2,1,1,2,1,1,2,1,2,,,1,1,1,,3,2,1,1,2,2,2,2,1,2,2,2,2,2,2,,,,,2,,,,,4,4,2,5,,,2,996,1,3,Aguascalientes,1,1,"1,346",1.00,0.24,28.27
"11,343,050",1,2,UMF 1 Aguascalientes,27,10,15,9,6,9,11,25,2,2,2,16,2,1,1,2,1,2,,,2,,,1,1,1,,3,1,1,1,1,2,2,2,1,2,2,2,2,2,2,2,,,,2,,,,,2,2,2,5,,,2,996,1,5,Aguascalientes,1,1,"1,346",1.00,0.24,27.52
"11,343,049",1,2,UMF 1 Aguascalientes,27,10,15,8,47,8,52,22,1,2,2,7,1,1,1,2,2,2,,,2,,,1,1,1,,3,2,1,1,2,2,2,2,1,2,2,2,2,2,2,,,,,2,,,,,4,6,,3,5,,2,996,2,8,Aguascalientes,1,1,"1,346",1.00,0.24,28.12
"11,343,047",1,2,UMF 1 Aguascalientes,27,10,15,8,17,8,22,42,1,2,2,58,1,1,1,2,1,1,3,1,2,,,1,1,1,,3,2,1,1,2,2,2,2,1,2,2,2,2,2,1,,,,,2,,,,,2,6,,12,,,2,996,2,7,Aguascalientes,1,1,"1,346",1.00,0.24,27.70
"10,320,059",1,2,UMF 1 Aguascalientes,27,10,15,19,26,19,31,49,1,2,2,12,2,1,2,2,1,1,3,1,2,,,1,1,1,,3,2,1,2,2,2,2,2,1,2,2,2,2,1,,,,,,2,,,,,1,6,,1,,,2,996,1,5,Aguascalientes,1,1,"1,346",1.00,0.24,24.18
"10,320,058",1,2,UMF 1 Aguascalientes,27,10,15,18,15,18,20,60,1,1,1,2,2,1,2,2,1,1,2,1,1,2,1,1,1,1,,3,1,1,1,2,2,2,2,1,2,2,2,2,2,1,,,,,2,,,,,2,6,,12,,,1,996,1,2,Aguascalientes,1,1,"1,346",1.00,0.24,28.27
"10,320,057",1,2,UMF 1 Aguascalientes,27,10,15,17,52,17,57,59,1,1,1,7,4,1,1,2,1,2,,,2,,,1,1,1,,3,1,1,1,1,2,2,2,1,2,2,2,2,1,1,2,,,,1,,,,,2,6,,4,7,9,1,19,1,3,Aguascalientes,1,1,"1,346",1.00,0.24,28.27
"10,320,056",1,2,UMF 1 Aguascalientes,27,10,15,17,16,17,24,74,1,2,2,20,6,1,1,2,2,1,3,1,2,,,1,1,1,,3,2,1,2,2,2,2,2,1,2,2,2,2,2,,,,,,2,,,,,2,6,,4,9,9,1,996,2,4,Aguascalientes,1,1,"1,346",1.00,0.24,25.43
"10,320,055",1,2,UMF 1 Aguascalientes,27,10,15,16,51,16,57,70,1,1,1,2,4,1,1,2,1,2,,,2,,,1,1,1,,3,2,1,1,2,2,1,1,1,2,2,2,2,2,2,,,2,2,2,,,,,2,2,2,5,,,1,996,2,3,Aguascalientes,1,1,"1,346",1.00,0.24,25.43
"10,320,054",1,2,UMF 1 Aguascalientes,27,10,15,16,24,16,29,50,1,1,1,28,1,1,1,2,1,2,,,1,1,1,1,1,1,,3,2,1,1,2,2,2,2,1,2,2,2,2,1,1,,,,,1,,,,,1,6,,12,,,1,996,1,3,Aguascalientes,1,1,"1,346",1.00,0.24,24.18
"10,320,053",1,2,UMF 1 Aguascalientes,27,10,15,16,3,16,8,77,1,1,1,2,1,1,1,2,2,2,,,2,,,1,1,1,,3,2,2,1,2,2,2,2,1,2,2,2,2,,2,,,,,2,,,,,2,2,1,12,,,1,12,1,3,Aguascalientes,1,1,"1,346",1.00,0.24,24.90
"10,320,052",1,2,UMF 1 Aguascalientes,27,10,15,15,33,15,39,75,1,2,2,1,1,1,1,2,2,2,,,2,,,1,1,1,,3,2,1,1,2,2,1,2,1,2,2,2,2,2,1,,,2,,5,,,,,2,6,,1,,,1,996,1,2,Aguascalientes,1,1,"1,346",1.00,0.24,24.90
"10,320,051",1,2,UMF 1 Aguascalientes,27,10,15,15,7,15,15,69,1,2,2,1,1,1,1,2,1,1,3,2,2,,,1,1,1,,3,2,1,1,2,2,2,2,1,2,2,2,2,2,2,,,,,2,,,,,2,6,,2,3,,1,15,2,7,Aguascalientes,1,1,"1,346",1.00,0.24,25.43
"10,320,050",1,2,UMF 1 Aguascalientes,27,10,15,13,21,13,31,59,1,2,2,28,1,1,2,2,2,2,,,2,,,1,1,1,,3,2,1,1,2,2,2,2,1,2,2,2,2,1,1,,,,,2,,,,,1,2,1,1,2,,1,1,1,4,Aguascalientes,1,1,"1,346",1.00,0.24,28.27
"10,320,049",1,2,UMF 1 Aguascalientes,27,10,15,12,33,12,40,60,1,1,1,2,1,1,1,2,1,2,,,2,,,1,1,1,,1,2,1,1,2,2,2,2,1,2,2,2,2,1,1,,,,,1,,,,,2,2,1,12,,,1,996,1,1,Aguascalientes,1,1,"1,346",1.00,0.24,28.27
"10,320,048",1,2,UMF 1 Aguascalientes,27,10,15,12,5,12,10,23,1,2,2,33,1,1,1,2,1,1,4,1,2,,,1,1,1,,3,2,1,1,1,2,2,2,1,2,2,2,2,2,1,2,,,,2,,,,,4,5,2,5,6,8,1,996,1,7,Aguascalientes,1,1,"1,346",1.00,0.24,27.52
"10,320,047",1,2,UMF 1 Aguascalientes,27,10,15,11,31,11,38,50,1,1,2,2,1,1,1,2,2,2,,,2,,,1,1,1,,3,2,1,1,2,2,2,2,1,2,2,2,2,5,1,,,,,1,,,,,2,2,1,1,3,4,1,996,1,7,Aguascalientes,1,1,"1,346",1.00,0.24,24.18
"10,320,046",1,2,UMF 1 Aguascalientes,27,10,15,11,5,11,11,42,1,1,1,23,4,,1,2,1,2,,,2,,,1,1,1,,3,2,1,1,2,2,1,2,1,1,2,2,1,1,1,,,2,,2,2,,,1,2,2,1,7,8,,1,996,1,5,Aguascalientes,1,1,"1,346",1.00,0.24,27.12
"10,320,045",1,2,UMF 1 Aguascalientes,27,10,15,10,39,10,45,66,1,1,1,20,1,1,1,2,1,1,2,1,1,3,1,2,,,,3,2,1,1,2,2,2,2,2,2,2,2,2,1,1,,,,,,,,,,2,6,,12,,,1,996,1,5,Aguascalientes,1,1,"1,346",1.00,0.24,24.90
"10,320,044",1,2,UMF 1 Aguascalientes,27,10,15,10,23,10,34,62,1,4,2,17,2,1,2,2,1,1,2,1,1,2,1,1,1,1,,1,2,1,1,2,1,2,2,1,2,2,2,2,1,1,,1,,,1,,,,,4,6,,1,5,2,2,1,2,4,Aguascalientes,1,1,"1,346",1.00,0.24,28.88
"10,320,043",1,2,UMF 1 Aguascalientes,27,10,15,9,59,10,6,43,1,2,2,1,1,1,1,2,1,1,3,1,2,,,1,1,1,,3,2,2,2,2,2,2,2,1,2,1,2,2,,,,,,,2,,3,,,2,5,2,5,1,,2,13,1,5,Aguascalientes,1,1,"1,346",1.00,0.24,27.12
"10,320,042",1,2,UMF 1 Aguascalientes,27,10,15,9,41,9,47,50,1,2,2,43,1,1,1,2,1,2,,,2,,,2,,,,3,2,2,2,1,2,1,2,2,2,2,2,2,,,2,,2,,,,,,,2,6,,2,1,11,2,3,1,7,Aguascalientes,1,1,"1,346",1.00,0.24,24.18
"10,320,041",1,2,UMF 1 Aguascalientes,27,10,15,9,12,9,19,66,1,1,2,2,1,1,1,2,1,1,1,1,2,,,1,1,2,98,3,1,1,1,2,2,2,2,1,2,2,2,2,1,1,,,,,1,,,,,2,6,,5,1,,1,3,2,3,Aguascalientes,1,1,"1,346",1.00,0.24,25.43
"10,320,040",1,2,UMF 1 Aguascalientes,27,10,15,8,52,8,57,36,1,1,1,33,1,2,1,2,1,1,3,1,2,,,1,1,1,,3,1,1,1,2,2,2,2,1,2,2,2,2,2,1,,,,,2,,,,,2,6,,1,5,10,1,996,1,7,Aguascalientes,1,1,"1,346",1.00,0.24,27.12
"10,320,039",1,2,UMF 1 Aguascalientes,27,10,15,8,26,8,32,50,1,1,1,1,2,1,1,2,2,1,2,1,2,,,1,1,1,,3,2,1,1,2,2,2,2,1,2,1,2,2,2,2,,,,,2,,2,,,2,6,,12,,,1,996,2,2,Aguascalientes,1,1,"1,346",1.00,0.24,24.70
"9,963,056",1,2,UMF 1 Aguascalientes,27,10,15,19,28,19,39,48,1,1,1,54,1,1,1,2,1,2,,,1,1,1,1,1,1,,3,2,1,1,2,2,2,1,1,2,2,2,2,1,1,,,,1,2,,,,,2,6,,998,,,1,996,1,9,Aguascalientes,1,1,"1,346",1.00,0.24,24.18
"9,963,055",1,2,UMF 1 Aguascalientes,27,10,15,18,47,19,0,41,1,1,1,170,3,1,1,2,1,1,6,1,2,,,1,1,1,,3,1,1,1,2,2,1,2,1,2,2,2,2,2,1,,,2,,2,,,,,2,2,1,12,,,1,12,1,5,Aguascalientes,1,1,"1,346",1.00,0.24,27.12
"9,963,053",1,2,UMF 1 Aguascalientes,27,10,15,18,2,18,8,47,1,2,2,20,1,1,1,2,1,1,3,1,1,2,1,1,1,1,,3,2,1,1,2,2,2,2,1,2,2,2,2,1,2,,,,,2,,,,,4,5,2,5,9,,1,996,1,7,Aguascalientes,1,1,"1,346",1.00,0.24,24.18
"9,963,052",1,2,UMF 1 Aguascalientes,27,10,15,17,23,17,58,25,1,2,2,8,3,2,1,2,2,2,,,2,,,1,1,1,,3,2,1,1,2,2,2,2,1,2,2,2,2,2,2,,,,,2,,,,,2,6,,7,2,,2,996,2,7,Aguascalientes,1,1,"1,346",1.00,0.24,28.12
"9,963,051",1,2,UMF 1 Aguascalientes,27,10,15,16,56,17,1,55,1,2,2,12,2,2,1,1,1,1,4,1,2,,,1,1,1,,3,2,1,1,1,2,2,2,1,2,2,2,2,2,2,2,,,,5,,,,,2,6,,1,3,9,2,996,1,2,Aguascalientes,1,1,"1,346",1.00,0.24,28.27
"9,963,050",1,2,UMF 1 Aguascalientes,27,10,15,16,30,16,37,65,1,2,2,998,2,1,1,2,1,2,,,1,1,1,1,1,1,,3,1,1,1,2,2,2,2,2,2,2,2,2,2,2,,,,,,,,,,4,4,2,1,3,,1,996,2,8,Aguascalientes,1,1,"1,346",1.00,0.24,25.43
"9,963,048",1,2,UMF 1 Aguascalientes,27,10,15,16,7,16,14,37,1,3,2,20,1,2,1,1,2,1,4,1,2,,,1,1,1,,3,2,1,1,2,2,2,2,1,2,2,2,2,2,2,,,,,2,,,,,2,5,2,1,6,7,4,996,1,5,Aguascalientes,1,1,"1,346",1.00,0.24,27.12
"9,963,047",1,2,UMF 1 Aguascalientes,27,10,15,15,37,15,42,62,1,2,2,2,2,2,1,2,1,2,,,2,,,1,1,1,,3,2,1,1,2,2,2,2,1,2,2,2,2,2,1,,,,,2,,,,,2,4,2,12,,,1,996,1,3,Aguascalientes,1,1,"1,346",1.00,0.24,28.27
"9,963,046",1,2,UMF 1 Aguascalientes,27,10,15,14,50,14,55,26,1,2,2,4,3,1,1,2,1,2,,,1,1,1,1,1,1,,3,1,1,1,1,2,2,1,1,2,2,2,2,2,2,1,,,1,2,,,,,2,2,2,12,,,1,996,2,7,Aguascalientes,1,1,"1,346",1.00,0.24,29.36
"9,963,045",1,2,UMF 1 Aguascalientes,27,10,15,13,37,13,45,48,1,2,2,1,1,1,1,2,1,1,3,1,1,3,1,1,1,1,,2,1,1,1,2,2,2,2,1,2,2,2,2,1,2,,,,,2,,,,,2,5,2,1,,,1,996,1,7,Aguascalientes,1,1,"1,346",1.00,0.24,24.18
"9,963,043",1,2,UMF 1 Aguascalientes,27,10,15,12,41,12,46,48,1,2,2,2,1,1,1,2,1,2,,,2,,,1,1,1,,3,2,1,1,2,2,2,2,1,2,2,2,2,2,2,,,,,2,,,,,3,6,,12,,,2,996,1,3,Aguascalientes,1,1,"1,346",1.00,0.24,24.18
"9,963,042",1,2,UMF 1 Aguascalientes,27,10,15,12,9,12,14,46,1,2,2,1,1,1,1,2,1,1,1,1,2,,,1,1,1,,1,1,1,1,2,2,2,2,1,2,2,2,2,2,2,,,,,1,,,,,1,2,2,3,,,1,14,2,9,Aguascalientes,1,1,"1,346",1.00,0.24,24.70
"9,963,041",1,2,UMF 1 Aguascalientes,27,10,15,11,36,11,43,68,1,2,2,1,3,1,1,2,1,2,,,1,1,1,1,1,1,,3,2,1,1,1,2,2,2,1,2,2,2,2,2,2,2,,,,2,,,,,2,2,1,12,,,2,996,1,2,Aguascalientes,1,1,"1,346",1.00,0.24,24.90
"9,963,040",1,2,UMF 1 Aguascalientes,27,10,15,11,10,11,18,20,1,2,2,3,2,1,1,2,1,2,,,2,,,1,1,1,,3,2,1,1,2,2,2,2,1,2,2,2,2,2,2,,,,,2,,,,,2,2,2,1,3,9,2,996,1,5,Aguascalientes,1,1,"1,346",1.00,0.24,27.52
"9,963,039",1,2,UMF 1 Aguascalientes,27,10,15,10,44,10,50,38,1,2,2,170,1,2,1,2,2,2,,,1,3,1,1,1,1,,3,1,1,1,2,2,2,2,1,2,1,2,2,2,2,,,,,2,,2,,,4,6,,5,998,,2,996,1,5,Aguascalientes,1,1,"1,346",1.00,0.24,27.12
"9,963,038",1,2,UMF 1 Aguascalientes,27,10,15,10,23,10,28,26,1,2,2,4,1,1,1,2,1,2,,,2,,,1,1,1,,3,2,1,1,2,2,2,2,1,2,2,2,2,2,3,,,,,2,,,,,3,6,,998,,,2,1,1,5,Aguascalientes,1,1,"1,346",1.00,0.24,28.74
"9,963,037",1,2,UMF 1 Aguascalientes,27,10,15,10,0,10,7,64,1,3,4,16,1,1,2,2,1,2,,,2,,,1,1,2,1,3,4,1,1,2,2,2,2,2,2,2,2,2,2,4,,,,,,,,,,2,2,2,1,4,3,3,1,1,5,Aguascalientes,1,1,"1,346",1.00,0.24,28.27
"9,963,036",1,2,UMF 1 Aguascalientes,27,10,15,9,45,9,52,23,1,2,2,15,2,1,1,2,1,2,,,2,,,1,1,1,,3,2,1,1,1,2,2,2,1,2,2,2,2,1,2,2,,,,2,,,,,2,6,,2,10,9,2,996,1,6,Aguascalientes,1,1,"1,346",1.00,0.24,27.52
"9,963,035",1,2,UMF 1 Aguascalientes,27,10,15,9,18,9,25,35,1,2,2,18,1,1,1,2,1,2,,,2,,,1,1,2,1,3,1,1,1,2,2,2,2,1,2,1,2,1,1,1,,,,,1,,2,,2,2,2,1,4,9,,1,14,1,9,Aguascalientes,1,1,"1,346",1.00,0.24,27.12
"9,963,034",1,2,UMF 1 Aguascalientes,27,10,15,8,54,8,59,58,1,2,2,4,1,1,1,1,2,2,,,2,,,1,1,1,,3,2,1,1,2,2,2,2,1,2,2,2,2,2,3,,,,,2,,,,,2,6,,1,,,3,26,1,3,Aguascalientes,1,1,"1,346",1.00,0.24,28.27
"9,963,033",1,2,UMF 1 Aguascalientes,27,10,15,8,33,8,39,62,1,2,2,44,1,1,1,2,2,2,,,2,,,1,1,1,,3,1,1,1,2,2,2,2,1,2,2,2,2,1,1,,,,,2,,,,,2,6,,6,2,,1,996,1,1,Aguascalientes,1,1,"1,346",1.00,0.24,28.27
"9,744,063",1,2,UMF 1 Aguascalientes,27,10,15,19,5,19,11,76,1,1,1,1,2,1,1,2,2,2,,,2,,,1,1,1,,3,1,1,1,2,2,2,2,1,2,2,2,2,2,2,,,,,2,,,,,1,6,,12,,,1,996,1,1,Aguascalientes,1,1,"1,346",1.00,0.24,24.90
"9,744,062",1,2,UMF 1 Aguascalientes,27,10,15,18,11,18,18,40,1,2,2,20,1,1,1,2,1,1,5,1,2,,,1,1,1,,3,2,1,1,2,2,2,2,1,2,2,2,2,2,2,,,,,2,,,,,2,6,,3,4,1,2,996,2,5,Aguascalientes,1,1,"1,346",1.00,0.24,27.70
"9,744,061",1,2,UMF 1 Aguascalientes,27,10,15,17,38,17,46,51,1,2,2,20,2,1,1,2,2,2,,,2,,,1,1,1,,3,2,1,1,2,2,2,2,1,2,2,2,2,2,2,,,,,2,,,,,2,6,,2,3,5,2,996,2,1,Aguascalientes,1,1,"1,346",1.00,0.24,24.70
"9,744,060",1,2,UMF 1 Aguascalientes,27,10,15,17,12,17,18,68,1,2,1,1,2,1,1,2,1,2,,,2,,,1,1,1,,3,1,1,1,2,2,2,2,1,2,2,2,2,1,1,,,,,2,,,,,4,4,2,5,9,8,2,996,2,7,Aguascalientes,1,1,"1,346",1.00,0.24,25.43
"9,744,058",1,2,UMF 1 Aguascalientes,27,10,15,16,46,16,51,83,1,1,1,13,1,1,1,2,1,2,,,2,,,2,,,,3,1,1,1,1,2,2,2,1,2,2,2,2,1,1,1,,,,2,,,,,2,2,1,12,,,1,996,2,1,Aguascalientes,1,1,"1,346",1.00,0.24,25.43
"9,744,057",1,2,UMF 1 Aguascalientes,27,10,15,16,18,16,24,30,1,1,1,17,1,1,1,2,1,1,3,1,2,,,1,1,1,,3,2,1,1,1,2,2,2,1,2,2,2,2,1,1,2,,,,2,,,,,2,4,2,5,8,3,1,996,1,7,Aguascalientes,1,1,"1,346",1.00,0.24,28.74
"9,744,056",1,2,UMF 1 Aguascalientes,27,10,15,15,53,15,58,51,1,2,2,1,2,1,1,2,1,1,3,1,1,1,1,1,1,1,,3,2,1,1,1,2,2,2,1,2,2,2,2,2,2,2,,,,2,,,,,2,2,1,12,,,1,996,1,2,Aguascalientes,1,1,"1,346",1.00,0.24,24.18
"9,744,055",1,2,UMF 1 Aguascalientes,27,10,15,15,27,15,34,75,1,1,1,48,1,1,1,2,1,1,3,1,2,,,1,1,1,,1,1,1,1,2,2,2,2,1,2,2,2,2,1,1,,,,,2,,,,,1,2,1,12,,,2,996,1,3,Aguascalientes,1,1,"1,346",1.00,0.24,24.90
"9,744,054",1,2,UMF 1 Aguascalientes,27,10,15,14,59,15,4,35,1,4,4,7,2,1,1,2,2,2,,,1,1,1,1,1,1,,3,2,1,1,2,2,2,2,1,2,2,2,2,2,1,,,,,2,,,,,2,5,2,1,6,5,2,996,1,3,Aguascalientes,1,1,"1,346",1.00,0.24,27.12
"9,744,053",1,2,UMF 1 Aguascalientes,27,10,15,13,3,13,10,44,1,2,2,8,1,2,1,2,2,2,,,2,,,1,1,1,,3,1,1,1,1,2,2,2,1,2,2,2,2,2,2,2,,,,2,,,,,2,2,1,11,1,2,2,1,1,3,Aguascalientes,1,1,"1,346",1.00,0.24,27.12
"9,744,052",1,2,UMF 1 Aguascalientes,27,10,15,12,23,12,29,21,1,2,2,2,1,1,1,2,1,1,1,1,2,,,1,1,1,,3,2,1,1,2,2,2,1,1,2,2,2,2,2,1,,,,1,1,,,,,1,2,1,4,6,2,2,996,1,7,Aguascalientes,1,1,"1,346",1.00,0.24,27.52
"9,744,051",1,2,UMF 1 Aguascalientes,27,10,15,11,52,11,57,23,1,2,2,1,2,1,1,2,1,1,3,1,2,,,1,1,1,,3,2,1,1,1,2,1,2,1,2,2,2,2,2,2,2,,2,,2,,,,,3,5,2,4,7,,2,996,1,5,Aguascalientes,1,1,"1,346",1.00,0.24,27.52
"9,744,050",1,2,UMF 1 Aguascalientes,27,10,15,11,23,11,28,45,1,1,1,11,2,1,1,2,2,2,,,2,,,1,1,1,,3,1,1,1,2,2,1,1,1,2,2,1,2,1,1,,,2,2,2,,,1,,2,2,2,4,9,,1,996,2,8,Aguascalientes,1,1,"1,346",1.00,0.24,24.70
"9,744,049",1,2,UMF 1 Aguascalientes,27,10,15,10,53,11,1,58,1,1,1,7,5,1,1,2,1,1,1,1,1,1,1,1,1,1,,3,2,1,1,2,2,2,2,1,2,2,2,2,2,1,,,,,2,,,,,2,5,2,7,9,5,2,996,1,1,Aguascalientes,1,1,"1,346",1.00,0.24,28.27
"9,744,048",1,2,UMF 1 Aguascalientes,27,10,15,10,30,10,36,30,2,2,2,51,1,1,1,2,2,2,,,2,,,1,1,1,,3,2,1,1,1,2,2,2,1,2,2,2,1,2,2,2,,,,2,,,,2,2,2,1,1,6,8,2,996,1,7,Aguascalientes,1,1,"1,346",1.00,0.24,28.74
"9,744,047",1,2,UMF 1 Aguascalientes,27,10,15,10,14,10,24,72,1,2,2,30,3,1,1,2,1,1,2,1,1,2,1,1,1,1,,3,2,1,1,2,2,2,2,1,2,2,2,2,2,2,,,,,1,,,,,2,2,2,1,2,4,1,996,1,3,Aguascalientes,1,1,"1,346",1.00,0.24,24.90
"9,744,046",1,2,UMF 1 Aguascalientes,27,10,15,9,52,10,0,38,1,2,2,3,2,1,1,2,1,1,2,1,1,3,1,1,1,1,,3,2,1,1,2,2,1,2,1,2,2,2,2,2,2,,,2,,2,,,,,2,2,2,4,9,1,2,996,1,7,Aguascalientes,1,1,"1,346",1.00,0.24,27.12
"9,744,045",1,2,UMF 1 Aguascalientes,27,10,15,9,31,9,36,27,2,2,2,8,2,1,1,2,1,1,3,1,1,1,1,1,1,1,,3,2,1,1,2,2,2,2,1,2,2,2,2,2,2,,,,,2,,,,,4,5,2,4,3,8,2,996,1,5,Aguascalientes,1,1,"1,346",1.00,0.24,28.74
"9,744,044",1,2,UMF 1 Aguascalientes,27,10,15,9,2,9,12,69,1,2,2,1,5,1,1,2,1,2,,,2,,,1,1,1,,3,2,2,1,1,2,2,2,1,2,2,1,2,,1,2,,,,2,,,2,,99,6,,2,,,2,996,2,1,Aguascalientes,1,1,"1,346",1.00,0.24,25.43
"9,744,043",1,2,UMF 1 Aguascalientes,27,10,15,8,41,8,49,24,1,2,2,23,3,,1,2,1,1,1,1,2,,,1,1,1,,3,2,1,1,1,2,2,2,1,2,2,1,2,2,2,2,,,,2,,,4,,2,4,2,1,4,998,2,996,2,7,Aguascalientes,1,1,"1,346",1.00,0.24,28.12
"9,744,042",1,2,UMF 1 Aguascalientes,27,10,15,8,12,8,20,51,1,2,2,49,1,1,1,2,1,1,3,1,1,3,1,1,1,1,,3,2,1,1,2,2,2,2,1,2,2,2,2,1,1,,,,,1,,,,,2,4,2,5,2,9,2,996,1,7,Aguascalientes,1,1,"1,346",1.00,0.24,24.18
"12,105,029",1,3,UMF 10 Aguascalientes,26,10,15,19,4,19,11,35,1,4,2,38,1,2,2,2,1,1,3,1,2,,,1,2,1,,3,1,2,2,1,1,2,2,2,2,2,2,1,,,1,1,,,,,,,2,2,2,1,9,4,7,1,26,1,5,Aguascalientes,1,1,"1,682",1.00,0.30,26.61
"12,105,027",1,3,UMF 10 Aguascalientes,26,10,15,18,16,18,22,22,1,2,2,6,4,1,1,2,1,2,,,2,,,1,1,1,,3,2,1,1,2,2,2,2,1,2,2,2,2,2,2,,,,,2,,,,,2,4,2,1,6,4,1,1,2,5,Aguascalientes,1,1,"1,682",1.00,0.30,27.59
"12,105,026",1,3,UMF 10 Aguascalientes,26,10,15,17,32,17,40,37,1,2,4,43,3,1,1,2,1,1,1,2,2,,,2,,,,3,2,1,1,2,2,2,1,2,2,2,2,1,2,1,,,,2,,,,,2,2,4,2,5,2,4,3,7,1,7,Aguascalientes,1,1,"1,682",1.00,0.30,26.61
"12,105,025",1,3,UMF 10 Aguascalientes,26,10,15,16,55,17,3,58,1,2,2,1,1,2,2,2,1,1,1,1,2,,,1,1,2,1,3,2,1,1,2,2,2,2,1,2,2,2,2,1,1,,,,,2,,,,,2,2,2,2,4,9,1,3,2,2,Aguascalientes,1,1,"1,682",1.00,0.30,28.34
"12,105,024",1,3,UMF 10 Aguascalientes,26,10,15,16,49,16,54,38,1,2,2,38,1,2,2,2,1,1,2,1,2,,,2,,,,3,1,2,2,1,2,2,2,2,2,2,2,2,,,2,,,,,,,,,2,2,1,7,2,9,1,1,1,5,Aguascalientes,1,1,"1,682",1.00,0.30,26.61
"12,105,023",1,3,UMF 10 Aguascalientes,26,10,15,15,20,15,27,24,1,2,2,19,5,1,1,1,2,2,,,2,,,1,1,1,,3,2,1,1,1,2,2,2,1,2,2,2,1,2,1,2,,,,2,,,,2,1,2,1,4,7,11,1,13,2,5,Aguascalientes,1,1,"1,682",1.00,0.30,27.59
"12,105,021",1,3,UMF 10 Aguascalientes,26,10,15,14,51,14,58,22,1,2,2,38,3,2,2,2,2,1,1,1,2,,,1,2,2,1,3,2,2,2,1,2,2,2,2,2,2,2,1,,,1,,,,,,,,1,2,4,2,3,4,7,3,26,2,7,Aguascalientes,1,1,"1,682",1.00,0.30,27.59
"12,105,020",1,3,UMF 10 Aguascalientes,26,10,15,14,29,14,34,53,1,2,2,2,3,1,1,2,1,1,1,1,1,4,1,1,1,1,,3,2,1,1,2,2,2,2,1,2,2,2,2,2,2,,,,,2,,,,,2,6,,3,7,,1,996,1,3,Aguascalientes,1,1,"1,682",1.00,0.30,23.73
"12,105,018",1,3,UMF 10 Aguascalientes,26,10,15,13,6,13,11,34,1,2,2,4,4,2,2,2,1,1,4,1,1,1,1,1,2,1,,3,2,1,1,2,2,2,2,1,2,2,2,2,2,2,,,,,2,,,,,2,2,1,4,,,1,996,1,5,Aguascalientes,1,1,"1,682",1.00,0.30,28.20
"12,105,017",1,3,UMF 10 Aguascalientes,26,10,15,12,34,12,40,49,1,2,2,23,2,,1,2,1,2,,,2,,,1,1,1,,3,2,1,1,1,2,2,2,1,2,2,2,2,2,2,2,,,,2,,,,,2,2,2,5,,,1,26,1,1,Aguascalientes,1,1,"1,682",1.00,0.30,23.73
"12,105,015",1,3,UMF 10 Aguascalientes,26,10,15,11,44,11,50,58,1,2,2,1,2,1,1,2,1,2,,,2,,,2,,,,3,2,1,1,2,2,1,2,1,2,2,2,2,2,2,,,1,,2,,,,,2,4,2,3,4,9,1,25,2,5,Aguascalientes,1,1,"1,682",1.00,0.30,28.34