folio,deleg,id_unid,unidmed,fecha_d,fecha_m,fecha_a,hr_ini_h,hr_ini_m,hr_fin_h,hr_fin_m,edad,tipopac,sat1,sat3,filtroch,probsal,totorpase,tiem_esp2,tmedreg2,prevasis_e,preosad,tratocomf,preven3,filtrosaux1,temsad1,temsad1a,filtrosaux2,temsad2,temsad2a,filtrofarm2,tfarsurt,totmed,motnosurt,resurt1,filtrourg,probsal_urg,mot_urg,turgtriag,tram_urg,calteurg,califurg,filtrocir,fechaop,suspop3,calciru,filtrohos,tobscama,razontesp,infprealta,calhosp,btratou,calfatna_a,calfatna_b,calfatna_c,calfatna_e,calfatna_f,calfatna_g,calfatna_h,calfatna_i,calfatna_j,calfatna_k,calfatna_l,calfatna_m,calfatna_n,calfatnb_a,calfatnb_b,calfatnb_c,calfatnb_e,calfatnb_f,calfatnb_g,calfatnb_h,calfatnb_i,calfatnb_j,calfatnb_k,calfatnb_l,calfatnb_m,calfatnb_n,calfinmb_f,limp1,limp2,recomej_a,recomej_b,recomej_c,recomuni,sugeren,sexo,local,escolar,Delegaci�n,Nivel,promedio_diario2014,estrato,MOSCondia,FE_FinalNR
"9,744,106",1,11,HGZ 1 Aaguascalientes,30,10,15,8,13,8,18,50,2,1,1,2,,,,,,,,1,1,1,1,2,,,2,,,,3,2,,,,,,,2,,,,2,,,,,1,2,2,2,2,2,1,2,2,2,2,2,2,2,,,,,,1,,,,,,,,2,4,2,5,9,2,1,996,1,2,7,Aguascalientes,2,839,1.00,1.00,7.63
"9,744,107",1,11,HGZ 1 Aaguascalientes,30,10,15,8,29,8,37,45,1,2,2,2,,,,,,,,1,1,7,1,2,,,2,,,,3,2,,,,,,,2,,,,2,,,,,1,2,2,1,1,2,1,2,2,2,2,2,2,2,,,1,2,,2,,,,,,,,2,6,,998,,,1,996,1,2,6,Aguascalientes,2,839,1.00,1.00,7.63
"9,744,108",1,11,HGZ 1 Aaguascalientes,30,10,15,8,50,8,55,24,2,2,2,2,,,,,,,,2,1,1,1,2,,,2,,,,3,2,,,,,,,2,,,,2,,,,,1,2,2,1,2,2,1,2,2,2,2,2,2,2,,,2,,,2,,,,,,,,2,4,2,5,2,1,1,996,1,2,5,Aguascalientes,2,839,1.00,1.00,7.63
"9,744,109",1,11,HGZ 1 Aaguascalientes,30,10,15,9,14,9,23,63,1,2,1,2,,,,,,,,1,1,3,1,2,,,2,,,,2,2,,,,,,,2,,,,2,,,,,2,2,2,1,1,2,1,2,2,2,2,2,2,2,,,2,2,,2,,,,,,,,2,6,,9,3,,2,996,2,2,3,Aguascalientes,2,839,1.00,1.00,7.63
"9,744,110",1,11,HGZ 1 Aaguascalientes,30,10,15,9,29,9,39,38,1,3,2,2,,,,,,,,1,1,3,1,1,2,1,2,,,,1,1,59,5,3,2,4,2,2,,,,1,4,1,1,2,2,1,2,1,2,2,2,1,2,2,2,1,2,2,2,,2,,,,2,,,,2,,,2,6,,9,4,1,2,996,2,2,8,Aguascalientes,2,839,1.00,1.00,7.63
"9,744,112",1,11,HGZ 1 Aaguascalientes,30,10,15,9,49,9,57,85,1,4,4,2,,,,,,,,2,1,3,1,1,3,2,2,,,,3,1,54,998,6,2,4,4,2,,,,2,,,,,2,2,2,1,1,2,1,1,2,2,2,2,2,2,,,2,2,,2,2,,,,,,,2,2,2,4,5,6,3,996,1,2,2,Aguascalientes,2,839,1.00,1.00,7.63
"9,744,114",1,11,HGZ 1 Aaguascalientes,30,10,15,10,13,10,23,40,1,2,1,1,10,3,5,2,1,1,2,1,1,4,1,2,,,1,1,1,,3,1,2,3,6,2,4,2,2,,,,2,,,,,2,1,2,1,2,2,2,2,2,2,2,2,2,1,2,,1,,,,,,,,,,1,2,2,2,4,2,6,1,996,2,2,5,Aguascalientes,2,839,1.00,1.00,7.63
"9,744,115",1,11,HGZ 1 Aaguascalientes,30,10,15,10,46,10,55,51,1,2,1,1,15,5,5,5,1,1,2,2,2,,,2,,,2,,,,3,2,,,,,,,2,,,,2,,,,,1,1,2,1,1,2,1,2,2,2,2,2,2,2,2,,1,2,,2,,,,,,,,2,2,1,12,,,2,996,1,2,5,Aguascalientes,2,839,1.00,1.00,7.63
"9,744,117",1,11,HGZ 1 Aaguascalientes,30,10,15,12,14,12,23,58,1,2,2,1,10,7,,5,2,2,1,1,1,3,2,1,2,2,2,,,,3,2,,,,,,,2,,,,2,,,,,2,2,2,1,2,2,1,1,2,2,2,2,2,2,,,2,,,1,2,,,,,,,2,4,1,6,2,4,2,996,2,2,8,Aguascalientes,2,839,1.00,1.00,7.63
"9,744,118",1,11,HGZ 1 Aaguascalientes,30,10,15,12,48,12,56,23,1,2,2,1,108,3,2,4,2,1,2,1,1,3,1,1,1,1,2,,,,3,2,,,,,,,1,1,,1,2,,,,,2,1,2,1,1,2,2,1,2,2,2,1,1,2,2,,1,2,,,3,,,,2,2,,2,3,2,9,5,4,1,996,1,2,8,Aguascalientes,2,839,1.00,1.00,7.63
"9,744,119",1,11,HGZ 1 Aaguascalientes,30,10,15,13,32,13,37,21,1,1,1,2,,,,,,,,1,1,1,1,2,,,2,,,,3,2,,,,,,,2,,,,2,,,,,1,1,2,2,1,2,1,2,2,2,2,2,2,2,2,,,2,,2,,,,,,,,1,1,1,9,10,11,1,996,1,2,5,Aguascalientes,2,839,1.00,1.00,7.63
"9,744,120",1,11,HGZ 1 Aaguascalientes,30,10,15,14,55,15,2,52,1,2,2,1,4,4,4,1,1,1,2,1,1,1,1,1,1,1,1,1,1,,3,2,,,,,,,2,,,,2,,,,,2,2,2,1,2,1,2,2,1,1,2,2,2,2,,,1,,2,,,2,2,,,,,2,2,2,5,,,2,996,2,2,5,Aguascalientes,2,839,1.00,1.00,7.63
"9,744,121",1,11,HGZ 1 Aaguascalientes,30,10,15,15,16,15,25,32,2,2,2,1,64,1,1,2,1,1,2,1,1,3,1,1,3,1,1,1,1,,3,2,,,,,,,2,,,,2,,,,,2,1,2,1,2,2,2,2,2,2,2,2,2,1,2,,2,,,,,,,,,,2,2,4,1,1,4,,1,996,1,2,3,Aguascalientes,2,839,1.00,1.00,7.63
"9,744,122",1,11,HGZ 1 Aaguascalientes,30,10,15,15,31,15,37,47,1,2,2,2,,,,,,,,2,1,1,1,2,,,2,,,,3,2,,,,,,,2,,,,2,,,,,1,2,2,1,2,2,1,1,2,2,2,2,2,2,,,2,,,2,1,,,,,,,2,2,2,1,9,5,2,996,1,2,3,Aguascalientes,2,839,1.00,1.00,7.63
"9,744,123",1,11,HGZ 1 Aaguascalientes,30,10,15,16,2,16,10,43,1,1,1,1,64,6,7,2,1,1,2,2,2,,,2,,,2,,,,3,2,,,,,,,2,,,,2,,,,,1,1,2,1,2,2,1,1,2,2,2,2,2,2,1,,2,,,2,2,,,,,,,2,2,2,5,4,,2,996,2,2,3,Aguascalientes,2,839,1.00,1.00,7.63
"9,744,124",1,11,HGZ 1 Aaguascalientes,30,10,15,16,29,16,37,44,2,2,2,1,9,5,1,2,1,1,2,2,2,,,2,,,1,1,2,1,3,2,,,,,,,2,,,,2,,,,,2,1,2,1,2,1,2,2,2,2,2,2,2,1,2,,2,,2,,,,,,,,2,2,2,2,2,6,9,2,3,1,2,5,Aguascalientes,2,839,1.00,1.00,7.63
"9,744,125",1,11,HGZ 1 Aaguascalientes,30,10,15,17,7,17,14,79,1,2,2,1,29,4,4,5,1,1,2,1,1,3,1,1,3,1,2,,,,3,2,,,,,,,2,,,,2,,,,,1,1,2,1,2,2,2,2,2,2,2,2,2,2,2,,2,,,,,,,,,,,4,5,2,4,5,3,2,996,2,2,1,Aguascalientes,2,839,1.00,1.00,7.63
"9,744,126",1,11,HGZ 1 Aaguascalientes,30,10,15,17,35,17,41,37,2,2,2,1,50,2,2,2,1,1,2,2,2,,,2,,,2,,,,3,2,,,,,,,2,,,,2,,,,,2,1,2,1,2,2,1,2,2,2,2,2,2,2,2,,2,,,2,,,,,,,,2,4,2,5,,,2,996,2,1,3,Aguascalientes,2,839,1.00,1.00,7.63
"9,744,127",1,11,HGZ 1 Aaguascalientes,30,10,15,17,55,18,0,33,1,2,2,1,6,2,1,6,1,1,2,1,2,,,1,3,1,2,,,,3,2,,,,,,,2,,,,2,,,,,2,1,2,1,2,2,1,2,2,2,2,2,2,2,2,,1,,,2,,,,,,,,2,4,2,5,4,,2,996,1,2,5,Aguascalientes,2,839,1.00,1.00,7.63
"9,744,128",1,11,HGZ 1 Aaguascalientes,30,10,15,18,22,18,31,54,1,1,1,1,4,4,3,1,1,1,2,1,1,4,1,1,2,1,2,,,,3,1,10,2,6,2,4,2,2,,,,1,1,,1,2,1,1,2,1,2,2,2,2,2,1,2,2,2,2,1,,1,,,,,,1,,,,,1,1,1,3,7,8,1,996,2,2,3,Aguascalientes,2,839,1.00,1.00,7.63
"9,744,129",1,11,HGZ 1 Aaguascalientes,30,10,15,18,42,18,50,56,1,5,4,1,4,1,7,6,2,1,1,1,1,3,1,1,1,1,2,,,,3,1,998,2,5,2,3,2,2,,,,2,,,,,2,2,2,1,1,2,2,2,2,2,2,2,2,2,,,2,2,,,,,,,,,,2,2,1,4,6,,2,999,1,2,9,Aguascalientes,2,839,1.00,1.00,7.63
"9,744,130",1,11,HGZ 1 Aaguascalientes,30,10,15,19,7,19,14,43,1,2,2,1,32,6,6,2,2,1,2,2,2,,,2,,,1,1,1,,3,2,,,,,,,2,,,,2,,,,,2,1,2,1,2,2,2,2,2,2,2,2,2,1,2,,1,,,,,,,,,,2,3,4,2,6,1,4,1,996,2,2,3,Aguascalientes,2,839,1.00,1.00,7.63
"9,963,093",1,11,HGZ 1 Aaguascalientes,30,10,15,8,17,8,26,27,1,2,2,1,1,5,4,3,1,1,2,1,1,4,1,2,,,2,,,,1,1,8,5,6,2,5,2,2,,,,2,,,,,2,1,2,1,1,2,1,2,2,2,2,2,2,2,3,,2,3,,3,,,,,,,,4,4,2,1,11,5,2,1,1,2,5,Aguascalientes,2,839,1.00,1.00,7.63
"9,963,095",1,11,HGZ 1 Aaguascalientes,30,10,15,8,35,8,46,36,1,3,3,1,48,5,5,2,1,1,2,2,1,3,1,2,,,2,,,,3,2,,,,,,,2,,,,2,,,,,3,2,2,1,2,2,1,2,2,2,2,2,2,2,,,2,,,2,,,,,,,,4,5,2,4,5,1,2,7,1,2,4,Aguascalientes,2,839,1.00,1.00,7.63
"9,963,096",1,11,HGZ 1 Aaguascalientes,30,10,15,8,55,9,3,49,1,1,1,1,4,6,5,1,1,1,2,2,1,2,1,1,2,1,2,,,,3,2,,,,,,,2,,,,2,,,,,1,1,2,1,1,2,2,2,2,2,2,2,1,2,2,,1,2,,,,,,,,5,,5,4,2,5,4,10,2,996,1,2,5,Aguascalientes,2,839,1.00,1.00,7.63
"9,963,097",1,11,HGZ 1 Aaguascalientes,30,10,15,9,17,9,25,25,1,3,3,2,,,,,,,,2,1,2,1,2,,,1,2,1,,3,1,2,5,2,1,2,2,2,,,,2,,,,,2,1,2,1,2,2,1,2,2,2,2,2,2,1,2,,2,,,3,,,,,,,2,2,4,2,3,1,5,2,1,2,2,5,Aguascalientes,2,839,1.00,1.00,7.63
"9,963,098",1,11,HGZ 1 Aaguascalientes,30,10,15,9,33,9,39,55,1,2,4,1,4,3,2,3,1,1,2,1,1,3,1,2,,,1,2,1,,3,2,,,,,,,2,,,,2,,,,,4,1,2,1,2,2,1,2,2,2,2,2,2,1,3,,2,,,2,,,,,,,2,3,4,2,3,6,1,4,1,2,2,5,Aguascalientes,2,839,1.00,1.00,7.63
"9,963,099",1,11,HGZ 1 Aaguascalientes,30,10,15,9,46,9,52,49,1,2,2,2,,,,,,,,1,1,2,1,2,,,2,,,,3,2,,,,,,,2,,,,2,,,,,1,1,2,2,2,2,1,2,2,2,2,2,2,2,1,,,,,1,,,,,,,,2,6,,1,5,7,2,1,1,2,5,Aguascalientes,2,839,1.00,1.00,7.63
"9,963,100",1,11,HGZ 1 Aaguascalientes,30,10,15,10,17,10,24,43,1,1,2,1,108,1,1,3,2,1,2,1,1,2,1,2,,,2,,,,3,2,,,,,,,2,,,,2,,,,,2,1,1,1,1,2,1,2,2,2,2,1,1,2,2,2,2,2,,2,,,,,2,2,,2,2,2,1,6,,2,996,1,1,5,Aguascalientes,2,839,1.00,1.00,7.63
"9,963,101",1,11,HGZ 1 Aaguascalientes,30,10,15,10,54,11,1,21,1,2,2,1,4,2,5,4,1,1,2,2,2,,,1,4,1,2,,,,3,2,,,,,,,2,,,,2,,,,,2,1,1,1,2,2,2,2,2,2,2,2,2,2,2,2,2,,,,,,,,,,,5,5,1,5,4,,2,10,2,2,7,Aguascalientes,2,839,1.00,1.00,7.63
"9,963,102",1,11,HGZ 1 Aaguascalientes,30,10,15,11,37,11,43,82,1,2,2,1,998,6,5,5,1,1,2,1,1,4,1,2,,,2,,,,3,2,,,,,,,2,,,,2,,,,,2,1,1,1,1,2,2,2,2,2,2,2,2,2,2,2,2,2,,,,,,,,,,2,6,,8,1,,1,7,2,2,2,Aguascalientes,2,839,1.00,1.00,7.63
"9,963,103",1,11,HGZ 1 Aaguascalientes,30,10,15,12,18,12,26,35,1,3,2,1,4,3,2,2,1,1,2,2,1,2,1,1,2,1,1,1,1,,3,1,4,998,1,3,3,2,2,,,,1,2,,2,3,2,1,1,1,1,2,2,2,1,2,2,2,2,1,2,2,1,2,,,,2,,,,,2,2,4,2,1,,,1,999,2,2,5,Aguascalientes,2,839,1.00,1.00,7.63
"9,963,104",1,11,HGZ 1 Aaguascalientes,30,10,15,12,59,13,5,56,1,4,4,1,20,6,7,6,2,2,1,2,2,,,1,6,1,2,,,,3,2,,,,,,,2,,,,2,,,,,4,1,2,1,2,2,2,2,2,2,2,2,2,2,2,,5,,,,,,,,,,,3,5,2,1,7,998,4,996,1,2,3,Aguascalientes,2,839,1.00,1.00,7.63
"9,963,105",1,11,HGZ 1 Aaguascalientes,30,10,15,13,39,13,49,19,1,2,2,1,46,1,5,1,1,1,2,2,1,1,1,1,1,1,2,,,,3,1,52,3,5,1,5,4,1,1,,2,1,1,,1,1,1,1,2,1,2,2,2,2,2,2,2,2,2,2,2,,2,,,,,,,,,,,4,4,2,5,1,,1,25,2,2,4,Aguascalientes,2,839,1.00,1.00,7.63
"9,963,106",1,11,HGZ 1 Aaguascalientes,30,10,15,15,5,15,11,68,1,2,2,1,1,4,3,2,1,1,2,2,1,3,1,2,,,1,1,1,,3,2,,,,,,,2,,,,2,,,,,2,1,2,1,1,2,1,2,2,2,2,2,2,1,2,,2,2,,2,,,,,,,2,2,6,,4,1,,2,996,1,2,5,Aguascalientes,2,839,1.00,1.00,7.63
"9,963,108",1,11,HGZ 1 Aaguascalientes,30,10,15,15,29,15,34,41,1,2,2,1,4,8,,1,1,1,2,2,2,,,1,1,1,2,,,,3,1,4,4,1,3,2,2,1,1,,2,1,1,,1,2,2,1,2,1,2,2,2,1,2,2,2,2,2,2,4,,2,,,,2,,,,,,,2,4,2,12,,,2,996,2,1,2,Aguascalientes,2,839,1.00,1.00,7.63
"9,963,109",1,11,HGZ 1 Aaguascalientes,30,10,15,15,39,15,48,41,1,2,2,1,42,5,4,1,1,1,2,1,1,3,1,1,3,1,2,,,,3,1,42,1,6,3,5,2,1,1,,2,1,4,1,2,2,1,1,2,1,1,2,1,1,2,2,2,2,2,2,2,,2,2,,2,2,,,,,,,2,6,,1,4,,2,996,1,2,7,Aguascalientes,2,839,1.00,1.00,7.63
"9,963,110",1,11,HGZ 1 Aaguascalientes,30,10,15,16,6,16,13,52,1,2,2,2,,,,,,,,1,2,,,1,1,1,2,,,,3,2,,,,,,,2,,,,2,,,,,2,2,2,2,2,2,2,1,2,2,2,2,2,2,,,,,,,1,,,,,,,3,6,,1,10,,2,1,1,2,3,Aguascalientes,2,839,1.00,1.00,7.63
"9,963,111",1,11,HGZ 1 Aaguascalientes,30,10,15,16,36,16,42,31,1,2,2,2,,,,,,,,1,1,4,1,1,3,1,2,,,,3,2,,,,,,,2,,,,2,,,,,2,2,2,2,2,2,2,1,2,2,2,1,2,2,,,,,,,2,,,,3,,,2,2,1,1,4,2,1,998,1,2,5,Aguascalientes,2,839,1.00,1.00,7.63
"9,963,112",1,11,HGZ 1 Aaguascalientes,30,10,15,17,12,17,19,33,1,2,2,2,,,,,,,,2,2,,,2,,,2,,,,3,1,45,2,2,1,2,2,2,,,,1,99,,2,2,2,1,2,1,1,2,1,2,2,2,2,1,2,2,2,,2,2,,2,,,,,2,,,3,4,2,5,4,,1,996,1,2,5,Aguascalientes,2,839,1.00,1.00,7.63
"9,963,113",1,11,HGZ 1 Aaguascalientes,30,10,15,17,38,17,44,33,1,5,5,1,10,1,1,4,2,1,1,1,1,7,1,1,7,1,1,2,1,,1,2,,,,,,,2,,,,2,,,,,2,1,1,1,1,2,2,2,2,2,2,2,2,1,2,2,1,2,,,,,,,,,2,4,5,2,11,5,998,2,996,2,2,7,Aguascalientes,2,839,1.00,1.00,7.63
"9,963,114",1,11,HGZ 1 Aaguascalientes,30,10,15,18,0,18,10,44,1,3,3,1,39,4,3,6,1,2,1,2,1,2,1,1,2,1,1,1,1,,3,2,,,,,,,1,1,,2,1,1,,1,2,2,1,1,1,1,2,2,2,1,1,2,2,1,1,3,2,1,2,,,,2,2,,,2,1,3,4,2,3,7,9,2,5,1,1,9,Aguascalientes,2,839,1.00,1.00,7.63
"9,963,115",1,11,HGZ 1 Aaguascalientes,30,10,15,18,27,18,32,40,2,1,2,2,,,,,,,,2,1,2,1,1,3,1,2,,,,3,2,,,,,,,2,,,,2,,,,,2,2,2,2,2,2,2,1,2,2,2,2,2,2,,,,,,,2,,,,,,,3,4,2,2,8,5,1,996,1,2,2,Aguascalientes,2,839,1.00,1.00,7.63
"9,963,116",1,11,HGZ 1 Aaguascalientes,30,10,15,18,45,18,51,43,1,2,2,2,,,,,,,,2,2,,,1,1,1,2,,,,3,2,,,,,,,2,,,,2,,,,,1,2,1,2,2,2,2,1,2,2,2,1,2,2,,2,,,,,2,,,,2,,,2,2,99,12,,,1,996,1,2,3,Aguascalientes,2,839,1.00,1.00,7.63
"9,963,117",1,11,HGZ 1 Aaguascalientes,30,10,15,19,14,19,21,45,1,3,2,1,3,2,3,2,1,1,2,1,2,,,1,2,1,2,,,,3,2,,,,,,,2,,,,2,,,,,2,2,1,1,2,2,2,1,2,2,2,2,2,2,,2,1,,,,2,,,,,,,4,3,2,5,4,7,3,5,1,2,9,Aguascalientes,2,839,1.00,1.00,7.63
"10,320,105",1,11,HGZ 1 Aaguascalientes,30,10,15,8,10,8,16,57,1,2,2,2,,,,,,,,2,1,3,1,2,,,2,,,,3,2,,,,,,,2,,,,2,,,,,2,1,2,2,2,2,1,2,2,2,2,2,2,2,2,,,,,2,,,,,,,,2,6,,1,7,,2,996,2,2,2,Aguascalientes,2,839,1.00,1.00,7.63
"10,320,107",1,11,HGZ 1 Aaguascalientes,30,10,15,8,28,8,33,59,1,1,1,2,,,,,,,,1,1,3,1,1,3,1,2,,,,1,2,,,,,,,2,,,,2,,,,,2,2,2,2,2,2,1,2,2,2,2,2,2,2,,,,,,1,,,,,,,,2,2,1,12,,,2,996,1,2,2,Aguascalientes,2,839,1.00,1.00,7.63
"10,320,108",1,11,HGZ 1 Aaguascalientes,30,10,15,8,46,8,52,46,1,1,1,2,,,,,,,,1,1,4,1,1,4,1,2,,,,3,2,,,,,,,2,,,,2,,,,,3,2,1,2,2,2,1,1,2,2,2,2,2,2,,1,,,,3,2,,,,,,,2,2,1,1,,,1,12,1,2,3,Aguascalientes,2,839,1.00,1.00,7.63
"10,320,109",1,11,HGZ 1 Aaguascalientes,30,10,15,9,8,9,17,57,1,1,1,1,20,6,6,3,1,1,2,1,1,1,1,1,1,1,1,1,1,,3,2,,,,,,,2,,,,2,,,,,2,1,2,1,2,2,2,2,2,2,2,2,2,1,2,,2,,,,,,,,,,1,2,6,,6,9,4,1,996,1,2,5,Aguascalientes,2,839,1.00,1.00,7.63
"10,320,110",1,11,HGZ 1 Aaguascalientes,30,10,15,9,27,9,33,42,1,1,1,1,10,1,1,3,2,1,2,2,2,,,2,,,1,1,1,,3,1,10,2,1,1,1,1,2,,,,2,,,,,1,1,1,1,1,2,2,2,2,2,2,2,2,1,1,2,1,2,,,,,,,,,1,2,6,,6,7,8,1,996,2,2,9,Aguascalientes,2,839,1.00,1.00,7.63
"10,320,111",1,11,HGZ 1 Aaguascalientes,30,10,15,9,40,9,45,69,1,1,1,2,,,,,,,,2,1,1,1,2,,,2,,,,3,2,,,,,,,2,,,,2,,,,,2,1,2,2,2,2,1,2,2,2,2,2,2,2,2,,,,,2,,,,,,,,2,6,,12,,,1,12,2,2,3,Aguascalientes,2,839,1.00,1.00,7.63
"10,320,112",1,11,HGZ 1 Aaguascalientes,30,10,15,9,59,10,6,40,1,1,1,1,30,3,4,1,1,1,2,2,1,1,1,2,,,1,1,3,2,3,2,,,,,,,2,,,,1,1,,1,1,1,1,2,1,1,2,2,2,2,1,2,2,2,1,2,,1,1,,,,,1,,,,2,2,2,1,12,,,1,12,1,2,3,Aguascalientes,2,839,1.00,1.00,7.63
"10,320,113",1,11,HGZ 1 Aaguascalientes,30,10,15,10,36,10,43,81,1,1,1,1,103,1,1,1,2,1,2,2,1,1,1,2,,,1,1,1,,3,2,,,,,,,2,,,,2,,,,,1,1,2,1,1,2,2,2,2,2,2,2,2,1,2,,1,1,,,,,,,,,2,1,1,1,12,,,1,996,2,2,3,Aguascalientes,2,839,1.00,1.00,7.63
"10,320,114",1,11,HGZ 1 Aaguascalientes,30,10,15,11,20,11,33,24,2,2,2,1,9,4,5,3,1,1,2,1,2,,,2,,,1,1,1,,3,2,,,,,,,2,,,,2,,,,,2,1,1,1,1,2,2,2,2,2,2,2,1,1,2,2,2,2,,,,,,,,2,2,2,1,2,1,,,1,26,1,2,7,Aguascalientes,2,839,1.00,1.00,7.63
"10,320,115",1,11,HGZ 1 Aaguascalientes,30,10,15,12,6,12,15,37,1,2,2,1,4,2,2,2,2,1,2,1,2,,,1,1,1,2,,,,3,2,,,,,,,2,,,,2,,,,,2,2,2,1,2,2,2,2,2,2,2,2,2,2,,,2,,,,,,,,,,,2,2,1,5,10,,1,26,1,2,5,Aguascalientes,2,839,1.00,1.00,7.63
"10,320,116",1,11,HGZ 1 Aaguascalientes,30,10,15,12,44,12,52,43,1,2,2,1,4,1,1,6,1,1,2,1,1,2,1,1,3,1,1,1,1,,3,1,4,2,6,1,5,5,2,,,,2,,,,,2,2,2,1,1,2,2,2,2,2,2,2,2,1,,,1,5,,,,,,,,,1,2,2,2,1,998,,2,996,1,2,7,Aguascalientes,2,839,1.00,1.00,7.63
"10,320,117",1,11,HGZ 1 Aaguascalientes,30,10,15,13,29,13,38,46,1,1,1,1,53,1,1,5,1,2,2,2,1,2,1,2,,,1,1,1,,1,1,53,4,3,1,2,1,2,,,,1,5,1,2,1,1,2,1,1,2,2,2,2,2,2,2,2,2,1,,2,2,,,,,,,,,,2,1,1,1,12,,,1,996,1,2,2,Aguascalientes,2,839,1.00,1.00,7.63
"10,320,118",1,11,HGZ 1 Aaguascalientes,30,10,15,15,27,15,32,77,1,1,1,2,,,,,,,,1,1,4,1,1,4,1,2,,,,3,2,,,,,,,2,,,,2,,,,,1,2,2,2,2,2,2,1,2,2,2,2,2,2,,,,,,,1,,,,,,,1,6,,12,,,1,12,2,2,3,Aguascalientes,2,839,1.00,1.00,7.63
"10,320,119",1,11,HGZ 1 Aaguascalientes,30,10,15,15,49,15,59,39,1,2,2,2,,,,,,,,2,1,1,1,1,3,1,2,,,,3,1,4,2,3,4,4,2,1,2,3,2,1,1,,2,4,2,2,1,2,2,2,2,1,2,2,2,2,2,2,,2,,,,,2,,,,,,,2,6,,1,7,,1,998,2,2,7,Aguascalientes,2,839,1.00,1.00,7.63
"10,320,120",1,11,HGZ 1 Aaguascalientes,30,10,15,16,24,16,30,58,1,1,1,2,,,,,,,,2,2,,,1,1,1,2,,,,3,2,,,,,,,2,,,,2,,,,,2,2,2,2,2,2,2,1,2,2,2,1,2,2,,,,,,,1,,,,2,,,2,4,2,5,,,1,12,1,2,3,Aguascalientes,2,839,1.00,1.00,7.63
"10,320,121",1,11,HGZ 1 Aaguascalientes,30,10,15,16,57,17,7,33,1,4,4,2,,,,,,,,1,1,3,1,1,3,1,2,,,,1,2,,,,,,,2,,,,2,,,,,2,1,2,2,2,2,2,1,2,2,2,2,2,2,1,,,,,,2,,,,,,,2,2,2,7,1,10,2,7,2,2,7,Aguascalientes,2,839,1.00,1.00,7.63
"10,320,122",1,11,HGZ 1 Aaguascalientes,30,10,15,17,28,17,35,42,1,2,2,1,4,1,1,1,1,1,2,1,1,3,2,1,1,2,2,,,,3,1,4,2,6,1,4,5,2,,,,2,,,,,2,2,2,1,2,2,2,2,2,2,2,2,2,2,,,2,,,,,,,,,,,2,2,1,7,1,,2,25,2,2,5,Aguascalientes,2,839,1.00,1.00,7.63
"10,320,123",1,11,HGZ 1 Aaguascalientes,30,10,15,17,52,18,13,66,1,4,2,1,18,6,1,6,2,2,2,2,1,2,1,2,,,2,,,,2,2,,,,,,,2,,,,2,,,,,2,1,2,1,2,2,2,2,2,2,2,2,2,2,2,,2,,,,,,,,,,,2,6,,1,998,7,1,15,1,2,1,Aguascalientes,2,839,1.00,1.00,7.63
"10,320,124",1,11,HGZ 1 Aaguascalientes,30,10,15,18,14,18,32,20,1,2,2,2,,,,,,,,1,1,1,1,1,3,1,1,2,1,,1,1,4,2,3,1,2,4,1,2,2,2,1,2,,2,4,2,1,2,1,1,2,2,2,2,2,2,2,2,1,2,,2,2,,,,,,,,,2,2,6,,1,1,,2,1,1,2,5,Aguascalientes,2,839,1.00,1.00,7.63
"10,320,125",1,11,HGZ 1 Aaguascalientes,30,10,15,18,40,18,50,31,1,1,1,1,45,6,6,1,2,1,2,1,1,7,1,2,,,1,1,1,,3,2,,,,,,,1,1,,1,1,4,1,1,1,1,1,2,1,1,2,2,2,1,1,2,1,2,1,2,,1,1,,,,2,1,,2,,2,3,2,1,4,,,1,16,1,2,8,Aguascalientes,2,839,1.00,1.00,7.63
"10,320,126",1,11,HGZ 1 Aaguascalientes,30,10,15,19,5,19,10,50,1,1,2,1,15,2,1,2,1,1,2,1,1,1,1,1,2,1,1,1,1,,1,2,,,,,,,2,,,,2,,,,,2,1,2,1,1,1,2,2,2,2,2,2,2,1,2,,1,2,2,,,,,,,,2,2,2,1,1,,,1,26,1,2,7,Aguascalientes,2,839,1.00,1.00,7.63
"11,343,117",1,11,HGZ 1 Aaguascalientes,30,10,15,8,19,8,24,36,1,2,2,2,,,,,,,,1,1,4,1,2,,,2,,,,3,2,,,,,,,2,,,,2,,,,,2,2,2,2,1,2,1,2,2,2,2,2,2,2,,,,2,,2,,,,,,,,2,6,,1,3,,2,996,2,2,5,Aguascalientes,2,839,1.00,1.00,7.63
"11,343,118",1,11,HGZ 1 Aaguascalientes,30,10,15,8,37,8,44,22,2,2,2,1,10,2,1,2,1,1,2,1,2,,,2,,,2,,,,3,2,,,,,,,2,,,,1,99,,1,2,2,1,2,1,1,2,2,2,2,2,2,2,2,2,2,,2,2,,,,,,,,,,4,4,2,5,,,2,996,1,2,5,Aguascalientes,2,839,1.00,1.00,7.63
"11,343,119",1,11,HGZ 1 Aaguascalientes,30,10,15,9,1,9,7,40,1,2,2,2,,,,,,,,1,1,3,1,2,,,2,,,,3,2,,,,,,,2,,,,2,,,,,2,2,2,2,1,2,1,2,2,2,2,2,2,2,,,,2,,2,,,,,,,,2,2,2,5,9,,2,996,1,2,3,Aguascalientes,2,839,1.00,1.00,7.63
"11,343,121",1,11,HGZ 1 Aaguascalientes,30,10,15,9,23,9,31,72,1,2,2,2,,,,,,,,1,1,4,1,2,,,2,,,,1,2,,,,,,,2,,,,2,,,,,2,2,2,2,1,2,1,2,2,2,2,2,2,2,,,,2,,2,,,,,,,,2,6,,12,,,2,12,2,1,3,Aguascalientes,2,839,1.00,1.00,7.63
"11,343,122",1,11,HGZ 1 Aaguascalientes,30,10,15,9,35,9,40,24,1,2,2,2,,,,,,,,2,1,1,1,2,,,1,1,1,,3,2,,,,,,,2,,,,2,,,,,2,2,2,1,2,2,1,2,2,2,2,2,2,1,,,2,,,2,,,,,,,2,2,6,,9,4,,2,996,1,2,5,Aguascalientes,2,839,1.00,1.00,7.63
"11,343,123",1,11,HGZ 1 Aaguascalientes,30,10,15,9,48,9,57,68,1,2,2,1,8,5,4,3,1,1,2,2,2,,,2,,,1,1,1,,3,2,,,,,,,2,,,,2,,,,,2,1,2,1,1,2,2,2,2,2,2,2,2,1,3,,2,2,,,,,,,,,2,4,4,2,5,1,2,3,1,2,2,2,Aguascalientes,2,839,1.00,1.00,7.63
"11,343,124",1,11,HGZ 1 Aaguascalientes,30,10,15,10,23,10,29,51,1,4,4,2,,,,,,,,1,2,,,1,3,1,2,,,,3,2,,,,,,,2,,,,2,,,,,2,2,2,2,1,2,2,1,2,2,2,2,2,2,,,,2,,,2,,,,,,,4,5,2,5,1,,2,996,1,2,3,Aguascalientes,2,839,1.00,1.00,7.63
"11,343,125",1,11,HGZ 1 Aaguascalientes,30,10,15,11,6,11,13,28,2,2,2,1,6,6,5,5,1,1,2,1,1,2,1,1,2,1,1,1,1,,3,2,,,,,,,2,,,,2,,,,,2,1,1,1,1,2,2,2,2,2,2,2,2,1,2,2,2,2,,,,,,,,,2,2,2,1,12,,,2,13,1,2,5,Aguascalientes,2,839,1.00,1.00,7.63
"11,343,126",1,11,HGZ 1 Aaguascalientes,30,10,15,11,47,11,53,82,1,2,2,1,1,99,99,3,1,1,2,1,2,,,2,,,1,1,1,,3,1,4,2,5,2,4,2,2,,,,2,,,,,2,1,1,1,1,2,2,2,2,2,2,2,2,1,2,2,2,2,,,,,,,,,2,2,2,2,12,,,2,996,1,2,1,Aguascalientes,2,839,1.00,1.00,7.63
"11,343,127",1,11,HGZ 1 Aaguascalientes,30,10,15,12,22,12,28,30,2,1,1,1,4,4,3,3,1,1,2,2,2,,,1,3,1,1,1,1,,3,1,4,5,3,2,2,2,2,,,,2,,,,,1,1,2,1,1,1,2,2,2,2,2,2,2,1,2,,2,2,2,,,,,,,,2,2,6,,2,6,,2,996,1,2,6,Aguascalientes,2,839,1.00,1.00,7.63
"11,343,128",1,11,HGZ 1 Aaguascalientes,30,10,15,13,8,13,13,33,2,2,2,1,33,3,2,2,1,1,2,2,1,2,1,2,,,1,1,1,,3,2,,,,,,,2,,,,2,,,,,2,1,1,1,1,2,2,2,2,2,2,2,2,1,2,2,2,2,,,,,,,,,2,2,4,1,9,4,,2,996,2,2,9,Aguascalientes,2,839,1.00,1.00,7.63
"11,343,130",1,11,HGZ 1 Aaguascalientes,30,10,15,13,43,13,50,24,2,2,2,1,9,2,2,4,1,1,2,2,2,,,2,,,1,1,1,,3,2,,,,,,,2,,,,2,,,,,2,1,2,1,1,2,2,2,2,2,2,2,2,1,2,,2,2,,,,,,,,,2,2,6,,4,,,2,996,2,2,7,Aguascalientes,2,839,1.00,1.00,7.63
"11,343,131",1,11,HGZ 1 Aaguascalientes,30,10,15,15,12,15,19,52,1,2,2,1,14,6,7,3,1,1,2,1,1,3,1,2,,,2,,,,3,2,,,,,,,2,,,,2,,,,,2,1,1,1,2,2,1,2,2,2,2,2,2,2,2,2,2,,,2,,,,,,,,3,3,2,6,3,,2,996,1,2,5,Aguascalientes,2,839,1.00,1.00,7.63
"11,343,132",1,11,HGZ 1 Aaguascalientes,30,10,15,15,26,15,31,21,1,2,2,2,,,,,,,,2,1,1,1,2,,,2,,,,3,2,,,,,,,2,,,,2,,,,,2,1,2,1,1,2,1,2,2,2,2,2,2,1,2,,2,2,,2,,,,,,,2,2,3,2,12,,,2,996,1,2,5,Aguascalientes,2,839,1.00,1.00,7.63
"11,343,133",1,11,HGZ 1 Aaguascalientes,30,10,15,15,47,15,52,62,1,2,2,1,1,4,3,1,1,1,2,1,2,,,2,,,1,1,1,,3,2,,,,,,,2,,,,2,,,,,2,1,2,1,1,2,2,2,2,2,2,2,2,1,2,,2,2,,,,,,,,,2,2,2,2,12,,,2,996,1,2,3,Aguascalientes,2,839,1.00,1.00,7.63
"11,343,134",1,11,HGZ 1 Aaguascalientes,30,10,15,16,10,16,15,61,1,2,2,1,16,4,4,4,1,1,2,2,2,,,2,,,1,1,1,,3,2,,,,,,,2,,,,2,,,,,1,2,2,1,1,2,2,2,2,2,2,2,2,1,,,2,2,,,,,,,,,2,2,2,2,12,,,2,996,1,2,2,Aguascalientes,2,839,1.00,1.00,7.63
"11,343,135",1,11,HGZ 1 Aaguascalientes,30,10,15,16,43,16,49,79,1,4,2,2,,,,,,,,2,2,,,1,3,1,2,,,,3,2,,,,,,,2,,,,2,,,,,2,1,2,2,2,2,2,1,2,2,2,2,2,2,2,,,,,,2,,,,,,,2,6,,4,,,3,996,1,2,9,Aguascalientes,2,839,1.00,1.00,7.63
"11,343,136",1,11,HGZ 1 Aaguascalientes,30,10,15,17,16,17,23,71,1,2,2,1,28,5,7,1,2,1,2,2,2,,,2,,,1,1,1,,3,2,,,,,,,2,,,,2,,,,,2,1,1,1,2,2,2,2,2,2,2,2,2,1,2,2,2,,,,,,,,,,2,2,2,2,4,6,,2,996,2,2,3,Aguascalientes,2,839,1.00,1.00,7.63
"11,343,137",1,11,HGZ 1 Aaguascalientes,30,10,15,17,44,17,50,22,1,2,2,2,,,,,,,,2,1,3,1,1,2,1,2,,,,3,2,,,,,,,2,,,,2,,,,,2,1,2,1,2,2,2,1,2,2,2,2,2,2,2,,1,,,,1,,,,,,,1,2,1,10,3,1,1,996,2,2,6,Aguascalientes,2,839,1.00,1.00,7.63
"11,343,138",1,11,HGZ 1 Aaguascalientes,30,10,15,18,9,18,16,72,1,2,2,1,4,2,2,3,1,1,2,2,1,2,1,2,,,2,,,,3,2,,,,,,,2,,,,2,,,,,2,1,2,1,2,2,2,2,2,2,2,2,2,2,2,,2,,,,,,,,,,,2,2,99,1,4,,3,12,1,2,3,Aguascalientes,2,839,1.00,1.00,7.63
"11,343,139",1,11,HGZ 1 Aaguascalientes,30,10,15,18,31,18,37,29,2,2,2,1,8,2,2,6,1,1,2,2,1,1,1,2,,,1,1,1,,3,1,8,4,5,2,5,2,2,,,,2,,,,,2,1,1,1,1,2,2,2,2,2,2,2,2,1,2,2,2,2,,,,,,,,,2,2,2,2,12,,,2,996,1,2,7,Aguascalientes,2,839,1.00,1.00,7.63
"11,343,140",1,11,HGZ 1 Aaguascalientes,30,10,15,18,54,19,3,27,1,3,3,1,9,4,3,2,1,1,2,1,2,,,2,,,1,1,1,,3,2,,,,,,,2,,,,2,,,,,2,2,2,1,1,2,2,1,2,2,2,2,2,1,,,2,2,,,2,,,,,,2,2,2,2,1,4,8,2,12,1,2,9,Aguascalientes,2,839,1.00,1.00,7.63
"12,105,110",1,11,HGZ 1 Aaguascalientes,30,10,15,8,9,8,15,59,1,2,2,2,,,,,,,,1,1,3,1,2,,,2,,,,3,2,,,,,,,2,,,,2,,,,,1,2,2,2,1,2,1,2,2,2,2,2,2,2,,,,1,,2,,,,,,,,2,5,2,5,3,4,1,5,1,2,2,Aguascalientes,2,839,1.00,1.00,7.63
"12,105,111",1,11,HGZ 1 Aaguascalientes,30,10,15,8,23,8,28,24,1,1,1,2,,,,,,,,2,1,2,1,2,,,2,,,,3,2,,,,,,,2,,,,2,,,,,2,1,2,1,1,2,1,2,2,2,2,2,2,2,1,,1,1,,1,,,,,,,,1,1,1,12,,,1,996,2,2,5,Aguascalientes,2,839,1.00,1.00,7.63
"12,105,112",1,11,HGZ 1 Aaguascalientes,30,10,15,8,41,8,46,58,1,2,2,2,,,,,,,,1,1,2,1,2,,,1,4,2,1,1,2,,,,,,,2,,,,2,,,,,2,2,2,2,1,2,1,2,2,2,2,2,2,2,,,,2,,2,,,,,,,,3,4,2,1,2,3,2,1,1,2,5,Aguascalientes,2,839,1.00,1.00,7.63
"12,105,114",1,11,HGZ 1 Aaguascalientes,30,10,15,9,7,9,14,20,1,2,2,1,46,6,6,2,1,1,2,1,2,,,2,,,1,2,1,,3,2,,,,,,,2,,,,2,,,,,2,1,2,1,2,2,2,2,2,2,1,2,2,1,2,,2,,,,,,,2,,,2,2,2,1,4,9,8,1,996,1,2,5,Aguascalientes,2,839,1.00,1.00,7.63
"12,105,116",1,11,HGZ 1 Aaguascalientes,30,10,15,9,30,9,36,66,1,4,4,2,,,,,,,,1,1,4,1,2,,,2,,,,3,2,,,,,,,2,,,,2,,,,,4,1,2,1,2,2,1,2,2,2,2,2,2,2,4,,4,,,2,,,,,,,,2,2,2,1,4,6,3,7,1,2,5,Aguascalientes,2,839,1.00,1.00,7.63
"12,105,117",1,11,HGZ 1 Aaguascalientes,30,10,15,9,38,9,46,60,1,1,1,1,15,5,5,1,1,1,2,2,2,,,1,1,1,2,,,,3,2,,,,,,,2,,,,1,1,,1,2,2,1,2,1,1,2,1,1,2,2,2,2,2,2,2,,1,1,,1,1,,,,,,,2,2,2,4,1,3,1,50,1,2,2,Aguascalientes,2,839,1.00,1.00,7.63
"12,105,118",1,11,HGZ 1 Aaguascalientes,30,10,15,9,52,9,57,61,1,2,2,2,,,,,,,,2,1,1,1,2,,,2,,,,3,2,,,,,,,2,,,,2,,,,,1,1,2,2,1,2,1,2,2,2,2,2,2,2,2,,,1,,2,,,,,,,,2,2,2,4,6,,1,996,1,1,3,Aguascalientes,2,839,1.00,1.00,7.63
"12,105,119",1,11,HGZ 1 Aaguascalientes,30,10,15,10,32,10,37,56,1,1,1,1,32,5,4,4,2,1,2,2,1,4,1,2,,,2,,,,3,2,,,,,,,2,,,,2,,,,,1,1,2,1,1,2,2,2,2,2,2,2,2,2,1,,1,1,,,,,,,,,,2,2,1,12,,,1,996,2,2,2,Aguascalientes,2,839,1.00,1.00,7.63
"12,105,120",1,11,HGZ 1 Aaguascalientes,30,10,15,11,8,11,16,25,1,2,2,2,,,,,,,,2,1,3,1,2,,,2,,,,3,2,,,,,,,2,,,,2,,,,,2,2,1,2,1,2,1,2,2,2,2,2,2,2,,2,,1,,1,,,,,,,,2,4,1,10,1,2,2,998,1,1,5,Aguascalientes,2,839,1.00,1.00,7.63
"12,105,121",1,11,HGZ 1 Aaguascalientes,30,10,15,12,1,12,9,45,1,2,2,1,3,3,3,4,1,1,2,1,1,2,1,1,3,1,2,,,,3,2,,,,,,,2,,,,2,,,,,2,1,1,1,2,2,2,2,2,2,2,2,1,2,2,2,1,,,,,,,,,1,,2,4,2,4,1,5,1,998,1,2,7,Aguascalientes,2,839,1.00,1.00,7.63
"12,105,122",1,11,HGZ 1 Aaguascalientes,30,10,15,12,30,12,41,34,1,5,2,1,3,1,1,1,1,1,2,2,2,,,2,,,1,1,1,,3,2,,,,,,,2,,,,2,,,,,4,1,2,1,2,2,1,2,2,2,2,2,2,2,1,,4,,,2,,,,,,,,2,2,1,1,7,3,3,998,1,1,3,Aguascalientes,2,839,1.00,1.00,7.63
"12,105,123",1,11,HGZ 1 Aaguascalientes,30,10,15,13,19,13,27,27,1,2,2,1,3,4,1,1,1,1,2,1,1,3,1,1,3,1,1,1,1,,3,2,,,,,,,2,,,,2,,,,,1,1,2,1,2,2,1,2,2,2,2,2,2,2,1,,1,,,2,,,,,,,,2,2,1,4,9,6,1,996,1,2,9,Aguascalientes,2,839,1.00,1.00,7.63
"12,105,124",1,11,HGZ 1 Aaguascalientes,30,10,15,13,55,14,3,61,1,4,4,1,32,6,4,1,2,1,2,1,1,1,1,1,1,1,2,,,,3,2,,,,,,,2,,,,2,,,,,2,1,2,1,1,1,1,1,2,2,2,1,2,2,2,,2,2,4,1,1,,,,1,,,1,1,2,3,4,10,2,13,2,2,9,Aguascalientes,2,839,1.00,1.00,7.63