Folio,Deleg,Id_Unid,Unidmed,Fecha_D,Fecha_M,Fecha_A,Hr_Ini_H,Hr_Ini_M,Hr_Fin_H,Hr_Fin_M,Cve_Sup,Cve_Enc,Sat1,Sat3,Filtroch,Motcons2,Probsal,Probsal_G,Lact1,Tiem_Esp2,Tmedreg2,Prevasis_A,Prevasis_B,Prevasis_C,Prevasis_D,Tratocom_A,Tratocom_B,Tratocom_C,Tratocom_D,Tratocom_E,Tratocom_F,Preosad,Tratocomf,Preven3,Preven4,Preven1,Filtrosaux1,Temsad1,Filtrosaux2,Temsad2,Filtrofarm2,Comfarm,Tfarsurt,Totmed,Btratouf,Satmed,Resurt1,Resurt3,Filtrourg,Mot_Urg,Tespurg,Dudaurg,Califurg,Filtrocir,Calciru,Filtrohos,Calhosp,Btratou,Trato1,Tratom,Trato2m,Trato3m,Tratop,Trato2p,Trato3p,Limp1,Limp2,Limp3,Recomej_A,Recomej_B,Recomej_C,Calif,Recomuni,Sugeren,Tipodhu,Edad,Sexo,Escolar,Ingreso,Promedio_Diario2013,Est_Var,Code_Upm,Nivel,Fe_Finalnr,Fecha,Entidad
2011,1,11,HGZ 1 Aguascalientes,29,9,2014,14,1,14,6,101,48006,1,1,1,3,19,7,,5,1,1,1,2,1,1,2,1,1,1,1,1,2,2,,1,2,,2,,1,1,1,1,2,2,2,,2,,,,,2,,2,,1,10,2,1,1,996,,,2,1,2,1,11,,8,2,996,1,28,1,5,3,862,11000000,1,2,7.89632392076590000000,2014-09-29,1
2013,1,11,HGZ 1 Aguascalientes,29,9,2014,14,52,14,57,101,48006,2,2,1,1,12,2,,4,3,2,2,2,2,1,1,1,1,1,1,1,2,2,,1,2,,2,,1,1,1,1,2,2,2,,2,,,,,2,,2,,2,10,16,1,1,996,,,6,,2,6,1,8,10,1,996,4,23,2,7,5,862,11000000,3,2,7.66553532720791000000,2014-09-29,1
2014,1,11,HGZ 1 Aguascalientes,29,9,2014,14,37,14,49,101,48005,3,2,1,3,44,1,,2,1,2,2,2,1,1,1,1,1,2,1,1,2,2,,2,1,1,2,,1,1,1,2,3,2,2,,1,5,4,2,3,2,,2,,3,7,2,1,1,3,2,2,4,2,2,7,4,,7,2,996,6,70,1,5,3,862,11000000,4,2,7.55427249886017000000,2014-09-29,1
2015,1,11,HGZ 1 Aguascalientes,29,9,2014,14,46,15,35,101,48001,2,2,1,1,25,3,,4,3,1,1,1,1,1,1,1,1,1,1,1,2,1,5,1,1,3,1,3,1,1,1,3,2,3,2,,2,,,,,1,1,1,3,2,8,998,1,1,996,,,4,2,2,1,1,2,8,1,996,1,39,2,7,5,862,11000000,5,2,7.91058686756340000000,2014-09-29,1
2016,1,11,HGZ 1 Aguascalientes,29,9,2014,15,17,15,25,101,48005,1,2,1,3,7,3,,6,5,1,2,2,2,1,2,1,1,2,1,1,1,1,5,1,2,,2,,1,1,1,1,1,1,2,,2,,,,,2,,2,,2,8,2,1,1,996,,,3,2,2,1,4,3,7,2,996,1,52,1,5,2,862,11000000,6,2,7.82690006739005000000,2014-09-29,1
2018,1,11,HGZ 1 Aguascalientes,29,9,2014,15,37,15,57,101,48001,2,2,1,1,4,1,,1,1,1,1,2,1,1,2,1,1,1,1,1,2,1,5,2,1,3,1,3,1,1,1,1,1,2,2,,1,5,1,1,2,2,,1,1,2,3,2,1,1,996,,,2,2,2,2,3,10,9,1,996,5,56,1,3,99,862,11000000,8,2,7.60082078157065000000,2014-09-29,1
2019,1,11,HGZ 1 Aguascalientes,29,9,2014,12,20,12,29,101,48005,2,2,1,3,3,1,,4,2,2,2,2,1,1,1,1,1,2,1,1,2,2,,1,2,,2,,1,1,1,1,2,2,2,,2,,,,,2,,2,,2,9,999,,,996,,,6,,2,4,1,11,8,2,996,1,58,2,3,3,862,11000000,9,2,7.89667713727188000000,2014-09-29,1
20110,1,11,HGZ 1 Aguascalientes,29,9,2014,15,57,16,8,101,48001,2,2,1,3,7,3,,5,4,2,2,2,2,1,2,1,1,1,1,2,2,2,,1,2,,2,,1,1,1,1,2,2,1,3,2,,,,,2,,2,,1,10,3,1,1,996,,,1,1,1,8,2,5,10,1,996,5,51,1,4,3,862,11000000,10,2,7.82690006739005000000,2014-09-29,1
20111,1,11,HGZ 1 Aguascalientes,29,9,2014,12,39,12,45,101,48005,2,2,1,3,3,1,,4,3,1,2,2,2,1,1,1,2,1,1,1,1,1,2,1,1,2,2,,2,,,,,,2,,2,,,,,2,,2,,3,8,2,1,1,996,,,3,2,2,4,11,,8,2,996,1,36,1,7,3,862,11000000,11,2,8.02775213529586000000,2014-09-29,1
20114,1,11,HGZ 1 Aguascalientes,29,9,2014,15,45,15,52,101,48005,1,1,1,3,30,1,,1,1,1,1,1,1,1,1,1,1,1,1,1,2,2,,1,2,,2,,1,1,1,1,2,2,2,,1,5,1,1,2,2,,1,1,2,10,3,1,1,996,,,3,2,2,4,11,,8,1,996,1,29,2,7,3,862,11000000,12,2,7.86278370993740000000,2014-09-29,1
20115,1,11,HGZ 1 Aguascalientes,29,9,2014,14,25,14,33,101,48001,2,2,1,3,33,11,,2,1,1,1,1,1,1,1,1,1,1,1,1,2,1,1,1,1,2,1,1,1,1,1,1,2,3,1,1,2,,,,,1,3,1,1,3,8,16,1,2,996,,,3,1,1,11,,,9,2,996,1,43,1,7,2,862,11000000,13,2,8.02775213529586000000,2014-09-29,1
20116,1,11,HGZ 1 Aguascalientes,29,9,2014,15,23,15,31,101,48003,2,2,1,1,1,5,1,1,1,1,1,1,1,1,1,1,1,1,1,1,2,1,4,1,1,1,2,,2,,,,,,2,,2,,,,,2,,2,,2,9,2,1,1,996,,,6,,2,11,,,8,2,996,5,33,1,7,3,862,11000000,14,2,7.89632392076590000000,2014-09-29,1
20117,1,11,HGZ 1 Aguascalientes,29,9,2014,16,47,16,52,101,48005,2,2,1,3,3,1,,1,5,2,2,2,1,1,1,1,1,1,1,1,2,1,4,1,2,,2,,1,1,1,1,2,2,2,,2,,,,,2,,2,,2,10,3,1,1,996,,,5,2,2,4,998,3,8,1,996,1,46,1,3,2,862,11000000,15,2,7.82690006739005000000,2014-09-29,1
20118,1,11,HGZ 1 Aguascalientes,29,9,2014,15,43,16,1,101,48003,3,1,1,1,44,1,,5,1,1,2,1,1,1,1,1,1,1,1,1,2,1,998,1,2,,1,8,2,,,,,,2,,1,5,4,1,4,2,,2,,2,9,2,1,1,998,2,1,6,,2,1,10,10,8,2,998,1,40,2,9,4,862,11000000,16,2,7.91058686756340000000,2014-09-29,1
20119,1,11,HGZ 1 Aguascalientes,29,9,2014,16,8,16,23,101,48006,2,1,1,1,46,1,,1,1,2,2,2,2,1,1,1,1,1,1,1,2,1,4,2,1,1,2,,1,1,1,1,2,1,2,,1,6,3,2,3,2,,1,1,1,10,2,1,1,3,2,2,5,2,2,998,6,9,8,1,1,1,22,2,7,3,862,11000000,17,2,7.66553532720791000000,2014-09-29,1
20121,1,11,HGZ 1 Aguascalientes,29,9,2014,16,36,16,48,101,48006,2,1,1,3,23,1,,7,2,1,2,2,1,1,1,1,1,1,1,1,1,1,6,2,1,3,2,,1,1,1,1,1,1,2,,1,999,3,1,2,2,,2,,2,8,2,1,1,998,2,2,6,,2,998,10,3,5,2,996,5,19,2,6,3,862,11000000,19,2,7.66553532720791000000,2014-09-29,1
20122,1,11,HGZ 1 Aguascalientes,29,9,2014,16,51,17,0,101,48006,2,2,1,1,12,2,,2,1,1,1,1,1,1,1,1,1,1,1,1,2,2,,1,1,3,1,3,1,1,1,1,3,2,2,,2,,,,,2,,2,,3,8,2,1,1,3,2,2,6,,6,1,3,8,8,2,996,6,65,2,3,1,862,11000000,20,2,7.67852410643261000000,2014-09-29,1
20124,1,11,HGZ 1 Aguascalientes,29,9,2014,14,24,14,40,101,48001,2,3,1,1,39,6,,3,4,1,1,1,2,1,1,1,1,1,1,1,2,1,5,1,1,3,1,1,1,1,1,1,2,2,2,,1,998,1,1,2,1,2,1,2,2,9,2,1,1,3,2,2,3,1,2,2,1,4,7,2,996,5,21,1,5,2,862,11000000,22,2,7.58012251232410000000,2014-09-29,1
20125,1,11,HGZ 1 Aguascalientes,29,9,2014,8,22,8,34,101,48004,2,99,1,1,7,3,,3,1,2,2,2,2,1,1,1,1,1,1,1,2,1,998,1,1,2,2,,2,,,,,,2,,2,,,,,2,,2,,1,9,1,1,2,996,,,4,2,2,6,1,2,7,1,1,1,59,1,7,3,862,11000000,23,2,7.60082078157065000000,2014-09-29,1
20126,1,11,HGZ 1 Aguascalientes,29,9,2014,9,12,9,21,101,48005,2,2,1,1,2,5,2,3,2,1,2,2,1,1,1,1,1,1,1,1,1,2,,1,2,,1,1,1,1,1,1,2,2,2,,2,,,,,2,,2,,2,9,2,1,1,996,,,4,2,4,1,4,3,7,2,996,5,18,1,5,3,862,11000000,24,2,7.58012251232410000000,2014-09-29,1
20127,1,11,HGZ 1 Aguascalientes,29,9,2014,14,40,14,49,101,48001,1,1,1,1,32,16,,1,1,2,2,2,2,1,1,1,1,1,1,1,2,1,5,2,2,,1,1,1,1,1,1,2,1,2,,1,5,3,1,2,2,,2,,1,10,998,1,1,996,,,6,,2,11,,,10,1,996,1,24,2,7,5,862,11000000,25,2,7.66553532720791000000,2014-09-29,1
20129,1,11,HGZ 1 Aguascalientes,29,9,2014,14,25,14,40,101,48003,3,3,1,1,48,1,,6,4,2,2,2,2,1,2,1,1,1,1,1,2,1,5,2,1,3,2,,1,1,1,2,2,3,1,3,2,,,,,2,,2,,2,8,2,1,1,3,2,1,4,2,2,998,1,,7,2,5,1,43,1,7,3,862,11000000,26,2,8.02775213529586000000,2014-09-29,1
20131,1,11,HGZ 1 Aguascalientes,29,9,2014,9,26,9,37,101,48005,2,2,1,3,4,1,,3,2,1,2,1,1,1,1,1,1,1,2,1,2,2,,1,1,2,2,,1,1,1,1,2,2,2,,2,,,,,2,,2,,2,8,2,1,2,996,,,2,2,2,11,,,8,2,996,5,73,1,2,3,862,11000000,27,2,7.55427249886017000000,2014-09-29,1
20133,1,11,HGZ 1 Aguascalientes,29,9,2014,9,10,9,19,101,48002,2,2,1,3,17,1,,6,1,1,1,1,1,1,2,1,1,1,1,1,2,1,5,1,1,6,2,,2,,,,,,2,,2,,,,,2,,2,,2,9,1,1,1,996,,,4,2,2,8,7,4,8,2,996,5,32,1,2,4,862,11000000,28,2,7.89632392076590000000,2014-09-29,1
20134,1,11,HGZ 1 Aguascalientes,29,9,2014,14,46,14,55,101,48003,2,2,1,3,40,10,,3,5,1,1,2,1,1,1,1,1,1,2,1,2,2,,1,2,,2,,1,1,1,1,2,2,2,,2,,,,,1,1,1,2,2,9,996,,,996,,,2,1,2,8,9,,9,1,6,1,39,1,9,5,862,11000000,29,2,8.02775213529586000000,2014-09-29,1
20136,1,11,HGZ 1 Aguascalientes,29,9,2014,9,41,9,49,101,48005,2,2,1,3,32,16,,5,2,2,2,2,2,1,1,1,1,1,1,1,2,1,4,1,2,,2,,1,1,1,2,2,3,2,,2,,,,,2,,2,,2,9,2,1,1,996,,,6,,2,1,11,,8,2,996,2,58,1,7,5,862,11000000,31,2,7.60082078157065000000,2014-09-29,1
20138,1,11,HGZ 1 Aguascalientes,29,9,2014,9,29,9,43,101,48002,2,2,1,1,32,16,,6,1,1,1,1,1,1,2,1,1,2,1,1,2,1,5,1,1,7,2,,1,1,1,2,2,3,2,,2,,,,,2,,2,,2,9,2,1,1,9,2,2,3,2,2,1,6,4,8,2,1,5,42,1,5,2,862,11000000,33,2,8.02775213529586000000,2014-09-29,1
20139,1,11,HGZ 1 Aguascalientes,29,9,2014,15,7,15,13,101,48003,2,2,1,2,32,16,,6,1,2,2,2,2,1,1,1,1,2,1,1,2,1,1,1,2,,2,,1,1,1,1,2,2,2,,2,,,,,2,,2,,2,9,2,1,1,996,,,4,1,2,8,3,,8,1,996,1,54,1,9,4,862,11000000,34,2,7.82690006739005000000,2014-09-29,1
20140,1,11,HGZ 1 Aguascalientes,29,9,2014,9,21,9,28,101,48004,2,2,1,1,48,1,,3,1,1,1,1,2,1,1,1,1,1,1,1,2,1,4,1,1,3,2,,1,1,1,1,2,2,2,,2,,,,,2,,2,,2,1,2,1,1,996,,,6,,3,1,6,,9,2,996,5,33,1,5,99,862,11000000,35,2,7.89632392076590000000,2014-09-29,1
20141,1,11,HGZ 1 Aguascalientes,29,9,2014,14,41,14,47,101,48005,2,2,1,3,4,1,,3,2,1,2,2,1,1,1,1,1,2,1,1,2,2,,1,2,,2,,1,1,1,1,2,2,2,,2,,,,,2,,2,,2,7,2,1,1,996,,,3,2,2,3,4,,8,2,996,1,47,1,7,3,862,11000000,36,2,7.82690006739005000000,2014-09-29,1
20143,1,11,HGZ 1 Aguascalientes,29,9,2014,9,44,9,50,101,48002,2,2,1,3,48,1,,6,2,2,2,2,2,1,1,1,1,1,1,1,2,2,,1,2,,2,,1,2,1,1,2,1,1,3,2,,,,,2,,2,,2,9,3,1,1,996,,,2,2,1,8,10,6,9,2,996,5,19,2,8,5,862,11000000,38,2,7.66553532720791000000,2014-09-29,1
20144,1,11,HGZ 1 Aguascalientes,29,9,2014,15,28,15,39,101,48003,2,2,1,1,33,11,,4,3,2,2,2,2,1,97,1,1,1,1,1,2,1,1,1,2,,2,,1,1,1,1,2,2,2,,2,,,,,2,,2,,2,10,996,,,996,,,6,,3,11,,,8,2,4,5,51,2,5,3,862,11000000,39,2,8.08713197063645000000,2014-09-29,1
20145,1,11,HGZ 1 Aguascalientes,29,9,2014,9,30,9,41,101,48004,3,3,1,3,44,1,,4,2,1,1,1,1,1,2,1,1,1,1,1,1,2,,2,1,3,1,3,1,1,1,1,2,2,2,,2,,,,,2,,2,,2,8,9,1,1,996,,,6,,2,11,,,8,1,996,2,45,2,5,99,862,11000000,40,2,8.08713197063645000000,2014-09-29,1
20146,1,11,HGZ 1 Aguascalientes,29,9,2014,10,9,10,21,101,48005,2,2,1,3,4,1,,3,2,1,2,1,1,1,1,1,1,1,1,2,1,2,,1,2,,2,,1,1,1,1,2,2,2,,2,,,,,2,,2,,2,8,3,1,1,996,,,2,2,2,3,8,7,8,2,996,1,45,2,3,2,862,11000000,41,2,8.08713197063645000000,2014-09-29,1
20148,1,11,HGZ 1 Aguascalientes,29,9,2014,15,47,15,58,101,48003,2,2,1,1,34,998,,7,97,1,1,1,1,1,1,1,1,1,1,1,2,1,2,2,1,1,1,1,1,1,1,2,2,3,2,,1,5,3,1,4,1,4,1,3,1,9,2,1,1,1,2,2,4,2,4,4,4,,7,2,996,5,55,2,7,99,862,11000000,43,2,7.89667713727188000000,2014-09-29,1
20149,1,11,HGZ 1 Aguascalientes,29,9,2014,10,2,10,12,101,48004,2,2,1,4,2,5,1,7,2,2,2,2,2,1,1,1,1,1,1,1,2,1,5,2,1,7,1,8,1,1,1,1,2,1,2,,1,5,1,1,1,2,,1,1,1,10,16,1,1,996,,,2,1,2,9,3,,10,1,996,1,33,1,5,99,862,11000000,44,2,7.89632392076590000000,2014-09-29,1
20150,1,11,HGZ 1 Aguascalientes,29,9,2014,11,40,11,47,101,48005,2,2,1,3,44,1,,2,2,1,1,1,1,1,1,1,1,1,1,1,2,2,,1,2,,2,,1,1,1,1,2,2,2,,1,5,1,1,1,2,,2,,2,10,2,1,1,996,,,6,,2,11,,,10,2,996,1,28,1,5,2,862,11000000,45,2,7.89632392076590000000,2014-09-29,1
20151,1,11,HGZ 1 Aguascalientes,29,9,2014,15,30,16,20,101,48001,1,1,1,1,12,2,,4,2,1,1,1,1,1,1,1,1,1,1,1,2,1,5,1,1,3,1,3,1,1,1,1,2,2,2,,2,,,,,1,2,2,,2,10,2,1,1,996,,,6,,1,11,,,10,1,996,6,74,2,2,2,862,11000000,46,2,7.67852410643261000000,2014-09-29,1
20152,1,11,HGZ 1 Aguascalientes,29,9,2014,16,5,16,14,101,48003,2,2,1,1,49,1,,6,4,2,2,1,1,1,1,1,1,1,1,1,2,1,1,1,2,,2,,1,1,1,1,2,2,2,,2,,,,,2,,2,,1,10,16,1,1,996,,,6,,2,1,9,10,9,2,996,5,85,1,2,99,862,11000000,47,2,7.55427249886017000000,2014-09-29,1
20153,1,11,HGZ 1 Aguascalientes,29,9,2014,14,4,14,10,101,48004,3,4,1,3,4,1,,2,2,2,2,2,2,1,1,2,2,2,2,1,1,2,,2,2,,2,,1,1,3,2,4,4,2,,2,,,,,2,,2,,3,7,1,1,2,2,2,2,5,2,4,4,5,2,8,4,996,1,63,1,5,2,862,11000000,48,2,7.60082078157065000000,2014-09-29,1
20154,1,11,HGZ 1 Aguascalientes,29,9,2014,12,35,12,47,101,48005,2,2,1,3,17,1,,6,4,1,1,2,1,1,2,1,1,1,1,1,2,1,4,2,2,,1,1,1,1,1,1,2,2,2,,2,,,,,2,,2,,2,9,1,1,1,996,,,3,2,2,8,7,9,8,2,1,5,20,2,7,99,862,11000000,49,2,7.66553532720791000000,2014-09-29,1
20157,1,11,HGZ 1 Aguascalientes,29,9,2014,10,17,10,34,101,48004,5,5,1,1,10,3,,3,3,1,1,2,1,1,2,1,1,1,1,1,2,2,,1,1,4,2,,1,1,1,2,3,2,2,,2,,,,,2,,2,,1,10,996,,,2,2,2,5,2,2,4,1,9,5,4,998,6,49,2,5,99,862,11000000,52,2,8.08713197063645000000,2014-09-29,1
20159,1,11,HGZ 1 Aguascalientes,29,9,2014,16,22,16,32,101,48001,3,4,1,1,40,10,,5,4,1,1,2,1,1,2,1,1,1,2,1,2,2,,1,1,4,1,5,1,1,1,1,2,3,2,,2,,,,,2,,2,,2,8,2,1,1,1,2,2,2,2,2,8,3,1,8,1,5,5,49,1,3,99,862,11000000,54,2,7.82690006739005000000,2014-09-29,1
20161,1,11,HGZ 1 Aguascalientes,29,9,2014,16,21,16,35,101,48003,2,2,1,2,32,16,,3,4,2,2,2,2,1,1,1,1,1,1,1,2,2,,1,2,,2,,1,1,1,1,2,2,2,,1,5,4,99,2,2,,2,,2,8,2,1,1,996,,,3,2,2,8,8,,9,2,996,1,35,2,5,3,862,11000000,56,2,7.91058686756340000000,2014-09-29,1
20162,1,11,HGZ 1 Aguascalientes,29,9,2014,10,35,10,45,101,48004,4,4,1,3,30,1,,99,3,2,2,2,2,2,2,2,2,2,2,2,1,2,,2,2,,2,,1,1,1,2,1,1,2,,1,1,4,2,3,2,,2,,3,1,9,1,2,998,1,2,5,2,2,2,1,,6,1,998,6,46,2,5,2,862,11000000,57,2,8.08713197063645000000,2014-09-29,1
20163,1,11,HGZ 1 Aguascalientes,29,9,2014,12,49,12,56,101,48005,2,2,1,3,20,4,,3,4,1,1,1,1,1,1,1,1,1,1,1,2,1,3,1,1,2,2,,1,1,1,1,1,2,2,,2,,,,,2,,2,,2,8,2,1,1,996,,,6,,2,5,8,,8,2,996,1,41,1,7,4,862,11000000,58,2,8.02775213529586000000,2014-09-29,1
20164,1,11,HGZ 1 Aguascalientes,29,9,2014,16,35,16,46,101,48001,5,5,1,1,29,1,,6,4,2,2,2,2,2,2,2,2,2,2,2,1,1,5,1,1,1,1,1,1,2,1,1,1,4,1,1,1,5,3,1,4,2,,2,,5,0,9,1,1,2,2,2,5,2,3,998,1,3,2,4,998,1,41,2,9,5,862,11000000,59,2,7.91058686756340000000,2014-09-29,1
20165,1,11,HGZ 1 Aguascalientes,29,9,2014,12,29,12,39,101,48002,2,2,1,3,17,1,,2,1,1,1,1,1,1,1,1,1,1,1,1,2,2,,2,2,,2,,1,1,1,1,2,2,2,,2,,,,,2,,2,,2,8,16,1,1,996,,,6,,2,9,7,4,8,2,996,5,34,1,7,4,862,11000000,60,2,7.89632392076590000000,2014-09-29,1
20168,1,11,HGZ 1 Aguascalientes,29,9,2014,12,59,13,9,101,48005,5,5,1,3,32,16,,6,3,2,2,2,2,1,1,2,2,2,2,1,2,1,4,1,2,,2,,1,2,1,1,2,2,2,,2,,,,,2,,2,,4,0,996,,,2,2,2,3,2,3,6,2,,5,3,996,2,56,1,7,3,862,11000000,63,2,7.60082078157065000000,2014-09-29,1
20171,1,11,HGZ 1 Aguascalientes,29,9,2014,16,36,16,44,101,48003,3,2,1,1,18,4,,3,4,2,2,2,2,1,1,1,1,1,1,1,2,2,,1,2,,2,,1,1,1,1,2,3,2,,2,,,,,2,,2,,3,9,2,1,1,996,,,5,2,2,2,11,,9,1,996,5,39,1,5,3,862,11000000,66,2,8.02775213529586000000,2014-09-29,1
20172,1,11,HGZ 1 Aguascalientes,29,9,2014,11,43,11,52,101,48004,2,2,1,1,9,1,,6,1,2,2,2,1,1,97,1,1,1,1,1,2,1,5,1,1,99,2,,1,1,1,1,2,2,2,,2,,,,,2,,2,,1,9,2,1,1,996,,,2,1,2,11,,,9,2,996,5,24,1,5,99,862,11000000,67,2,7.58012251232410000000,2014-09-29,1
20173,1,11,HGZ 1 Aguascalientes,29,9,2014,13,30,13,36,101,48005,3,2,1,3,4,1,,3,1,1,2,2,1,1,1,1,1,1,1,1,2,1,3,1,2,,2,,2,,,,,,2,,2,,,,,2,,2,,2,8,2,1,1,996,,,4,2,2,4,11,,9,2,996,1,46,2,5,3,862,11000000,68,2,8.08713197063645000000,2014-09-29,1
20175,1,11,HGZ 1 Aguascalientes,29,9,2014,10,28,10,35,101,48002,2,2,1,3,7,3,,6,1,2,2,2,2,1,1,1,1,1,1,1,2,2,,1,2,,2,,1,1,1,2,2,2,2,,2,,,,,2,,2,,2,10,16,1,1,996,,,2,1,2,11,,,10,1,996,5,78,1,3,99,862,11000000,70,2,7.55427249886017000000,2014-09-29,1
20176,1,11,HGZ 1 Aguascalientes,29,9,2014,16,47,16,57,101,48003,4,2,1,3,20,4,,5,3,1,1,2,1,1,2,1,1,1,2,1,2,1,4,1,1,7,1,1,1,2,1,1,2,2,2,,2,,,,,2,,2,,1,10,16,1,1,996,,,6,,2,11,,,8,2,996,5,32,1,9,3,862,11000000,71,2,7.89632392076590000000,2014-09-29,1
20177,1,11,HGZ 1 Aguascalientes,29,9,2014,11,57,12,4,101,48004,2,2,1,3,9,1,,6,4,1,1,2,1,1,1,1,1,1,1,1,2,2,,2,2,,2,,1,1,2,1,2,1,2,,2,,,,,2,,2,,1,9,2,1,1,996,,,6,,1,1,9,,9,1,996,5,68,1,3,99,862,11000000,72,2,7.55427249886017000000,2014-09-29,1
20180,1,11,HGZ 1 Aguascalientes,29,9,2014,10,46,10,54,101,48002,2,2,1,5,23,1,,3,3,1,1,1,1,1,1,1,1,1,1,1,2,1,5,1,1,1,1,6,1,1,1,1,2,2,2,,2,,,,,2,,2,,2,10,2,1,1,9,2,1,6,,2,11,,,10,1,996,1,34,2,3,4,862,11000000,75,2,7.86278370993740000000,2014-09-29,1
20181,1,11,HGZ 1 Aguascalientes,29,9,2014,18,4,18,10,101,48003,3,2,1,1,4,1,,3,4,1,2,1,1,1,2,1,1,1,1,1,2,2,,1,2,,2,,1,1,1,1,2,2,2,,2,,,,,2,,2,,2,8,3,1,1,996,,,4,2,2,4,8,,7,2,996,5,43,1,7,3,862,11000000,76,2,8.02775213529586000000,2014-09-29,1
20182,1,11,HGZ 1 Aguascalientes,29,9,2014,12,8,12,15,101,48004,1,1,1,1,7,3,,3,2,1,1,1,1,1,1,1,1,1,1,1,2,1,5,2,2,,2,,1,1,1,1,1,2,2,,2,,,,,2,,2,,1,9,1,2,2,2,2,2,1,2,2,11,,,9,1,996,1,69,2,2,2,862,11000000,77,2,7.67852410643261000000,2014-09-29,1
20183,1,11,HGZ 1 Aguascalientes,29,9,2014,13,24,13,31,101,48005,2,2,1,1,48,1,,4,3,2,2,2,2,1,1,1,1,2,2,1,2,1,5,1,2,,2,,1,1,2,1,4,2,2,,2,,,,,2,,2,,2,8,2,1,2,9,2,2,3,1,2,10,1,9,8,2,996,5,27,1,5,3,862,11000000,78,2,7.89632392076590000000,2014-09-29,1
20184,1,11,HGZ 1 Aguascalientes,29,9,2014,12,19,12,27,101,48001,2,3,1,3,20,4,,2,2,1,1,1,1,1,1,1,1,1,1,1,1,1,1,1,1,4,2,,2,,,,,,2,,2,,,,,2,,2,,2,8,2,1,1,996,,,2,2,2,4,1,3,8,2,996,1,28,1,7,2,862,11000000,79,2,7.89632392076590000000,2014-09-29,1
20185,1,11,HGZ 1 Aguascalientes,29,9,2014,12,30,12,37,101,48002,2,2,1,1,8,1,,6,1,1,1,1,1,1,1,1,1,1,1,1,2,1,5,2,1,1,1,1,1,1,1,1,2,2,2,,2,,,,,2,,2,,2,8,2,1,1,996,,,6,,3,8,2,4,8,2,996,2,61,1,7,5,862,11000000,80,2,7.60082078157065000000,2014-09-29,1
20186,1,11,HGZ 1 Aguascalientes,29,9,2014,12,59,13,8,101,48003,1,2,1,1,27,1,,2,3,1,2,2,1,1,1,1,1,1,1,1,2,1,4,1,2,,2,,1,1,1,1,2,2,2,,2,,,,,2,,2,,2,9,16,1,1,996,,,6,,2,11,,,9,1,996,2,51,2,7,3,862,11000000,81,2,8.08713197063645000000,2014-09-29,1
20187,1,11,HGZ 1 Aguascalientes,29,9,2014,12,16,12,23,101,48004,2,2,1,1,34,998,,6,1,1,1,2,1,1,1,1,1,1,1,1,2,2,,1,2,,1,6,1,1,1,1,1,1,2,,2,,,,,2,,2,,1,10,1,1,1,996,,,6,,2,11,,,9,1,996,5,60,1,2,1,862,11000000,82,2,7.60082078157065000000,2014-09-29,1
20188,1,11,HGZ 1 Aguascalientes,29,9,2014,14,26,14,34,101,48005,2,2,1,1,29,1,,1,5,2,2,2,2,1,1,1,1,1,1,1,2,1,3,1,1,3,2,,1,1,1,1,2,2,2,,2,,,,,2,,2,,2,9,2,1,1,996,,,6,,2,10,7,,8,1,996,1,25,1,7,3,862,11000000,83,2,7.58012251232410000000,2014-09-29,1
20191,1,11,HGZ 1 Aguascalientes,29,9,2014,18,21,18,36,101,48003,2,2,1,1,4,1,,4,1,1,2,2,1,1,2,2,2,97,2,2,2,1,4,1,1,3,2,,1,2,1,2,2,2,2,,2,,,,,2,,2,,2,5,1,1,1,2,1,2,4,1,2,1,1,,6,1,6,2,58,2,9,5,862,11000000,85,2,7.89667713727188000000,2014-09-29,1
20192,1,11,HGZ 1 Aguascalientes,29,9,2014,12,26,12,36,101,48004,5,5,1,1,7,3,,4,5,2,2,2,2,1,2,2,1,2,2,1,1,2,,2,1,2,2,,1,1,2,2,3,5,2,,2,,,,,2,,2,,2,6,2,1,1,996,,,6,,2,2,5,,6,2,996,6,71,2,3,99,862,11000000,86,2,7.67852410643261000000,2014-09-29,1
20193,1,11,HGZ 1 Aguascalientes,29,9,2014,15,27,15,34,101,48005,2,2,1,3,4,1,,3,1,1,2,2,1,1,2,1,1,1,1,1,1,1,3,1,2,,2,,1,1,1,1,2,2,2,,2,,,,,2,,2,,2,8,2,1,1,996,,,2,1,2,4,11,,8,2,996,1,31,2,5,2,862,11000000,87,2,7.86278370993740000000,2014-09-29,1
20197,1,11,HGZ 1 Aguascalientes,29,9,2014,12,50,13,5,101,48004,2,2,1,1,30,1,,4,4,1,1,1,1,1,1,1,1,1,1,1,2,2,,1,1,3,1,2,1,1,1,1,2,2,2,,2,,,,,1,2,2,,2,8,16,1,1,996,,,4,1,2,4,3,,8,2,996,5,36,1,3,2,862,11000000,89,2,8.02775213529586000000,2014-09-29,1
20198,1,11,HGZ 1 Aguascalientes,29,9,2014,14,50,14,57,101,48005,3,3,1,3,44,1,,3,4,1,1,2,2,2,1,1,1,2,1,2,1,1,2,1,1,3,2,,1,1,2,2,4,3,2,,1,5,2,1,2,2,,2,,2,7,2,1,1,9,2,1,4,2,2,8,9,,8,2,996,5,23,1,8,3,862,11000000,90,2,7.58012251232410000000,2014-09-29,1
20199,1,11,HGZ 1 Aguascalientes,29,9,2014,19,8,19,33,101,48001,2,2,1,1,20,4,,2,1,2,2,2,2,1,1,1,1,1,1,2,1,1,5,1,2,,1,3,2,,,,,,2,,2,,,,,2,,2,,2,10,2,1,1,996,,,4,2,3,9,4,3,8,4,998,1,38,1,5,2,862,11000000,91,2,8.02775213529586000000,2014-09-29,1
201100,1,11,HGZ 1 Aguascalientes,29,9,2014,13,2,13,9,101,48002,2,2,1,3,50,1,,1,4,2,2,2,2,1,1,1,1,1,1,1,2,2,,1,2,,2,,1,1,1,1,2,2,1,1,2,,,,,2,,2,,2,10,3,1,1,996,,,6,,2,3,1,6,9,1,996,5,26,1,7,3,862,11000000,92,2,7.89632392076590000000,2014-09-29,1
201101,1,11,HGZ 1 Aguascalientes,29,9,2014,19,15,19,28,101,48003,1,1,1,3,34,998,,1,1,2,2,2,2,1,1,1,1,1,1,1,2,1,998,1,2,,2,,2,,,,,,2,,2,,,,,2,,2,,1,10,2,1,1,996,,,6,,1,9,1,,10,1,996,5,37,1,9,5,862,11000000,93,2,8.02775213529586000000,2014-09-29,1
201102,1,11,HGZ 1 Aguascalientes,29,9,2014,13,8,13,18,101,48004,2,2,1,3,48,1,,4,3,2,2,2,2,1,2,1,1,1,1,1,2,1,4,1,2,,1,1,1,1,1,1,2,2,2,,2,,,,,2,,2,,2,8,16,1,1,996,,,2,2,5,8,3,5,7,2,996,1,53,1,7,99,862,11000000,94,2,7.82690006739005000000,2014-09-29,1
201103,1,11,HGZ 1 Aguascalientes,29,9,2014,15,9,15,16,101,48005,2,2,1,3,3,1,,5,1,1,1,1,1,1,1,1,1,1,1,2,2,1,2,1,1,5,1,1,1,1,1,1,2,4,2,,2,,,,,2,,2,,1,8,999,,,996,,,4,2,99,10,9,1,8,2,996,2,50,2,5,2,862,11000000,95,2,8.08713197063645000000,2014-09-29,1
201104,1,11,HGZ 1 Aguascalientes,29,9,2014,19,37,19,58,101,48001,2,2,1,1,31,14,,1,5,1,1,2,1,1,1,1,1,1,1,1,2,1,4,1,1,1,1,1,2,,,,,,2,,1,5,2,1,1,1,1,1,1,2,10,3,1,1,996,,,6,,2,3,3,8,9,1,996,1,52,1,3,99,862,11000000,96,2,7.82690006739005000000,2014-09-29,1
201105,1,11,HGZ 1 Aguascalientes,29,9,2014,13,12,13,19,101,48002,5,5,1,3,52,51,,6,5,2,2,2,2,2,1,2,2,2,2,2,1,2,,1,2,,2,,1,2,1,2,3,4,2,,2,,,,,2,,2,,5,0,3,1,1,1,2,2,6,,3,10,1,6,1,4,5,1,28,1,9,5,862,11000000,97,2,7.89632392076590000000,2014-09-29,1
201106,1,11,HGZ 1 Aguascalientes,29,9,2014,19,32,19,37,101,48003,1,1,1,2,31,14,,4,1,1,1,1,1,1,1,1,1,1,1,1,2,1,1,1,1,2,1,1,2,,,,,,2,,2,,,,,1,1,1,1,2,10,16,1,1,996,,,2,1,1,11,,,10,1,998,1,47,1,9,5,862,11000000,98,2,7.82690006739005000000,2014-09-29,1
201107,1,11,HGZ 1 Aguascalientes,29,9,2014,14,13,14,22,101,48004,2,4,1,3,4,1,,3,2,2,2,2,2,1,2,1,2,2,2,2,1,2,,1,2,,2,,1,1,1,1,2,4,2,,2,,,,,2,,2,,2,8,1,2,2,1,1,1,4,2,4,9,10,8,8,3,996,2,61,2,2,2,862,11000000,99,2,7.89667713727188000000,2014-09-29,1
201108,1,11,HGZ 1 Aguascalientes,29,9,2014,15,23,15,31,101,48005,2,2,1,3,4,1,,2,2,1,1,1,1,1,1,1,1,1,1,1,2,1,2,1,2,,2,,1,1,1,1,2,2,2,,2,,,,,2,,2,,2,10,2,1,1,998,1,2,3,2,2,1,3,,7,2,996,5,40,1,5,3,862,11000000,100,2,8.02775213529586000000,2014-09-29,1
201112,1,11,HGZ 1 Aguascalientes,29,9,2014,13,21,13,30,101,48004,1,1,1,2,14,2,,6,3,1,1,2,1,1,1,1,1,1,1,1,2,2,,1,2,,2,,1,1,1,1,1,1,2,,2,,,,,2,,2,,1,9,2,1,1,996,,,3,1,2,8,3,,9,1,7,5,30,1,7,99,862,11000000,103,2,7.89632392076590000000,2014-09-29,1
201113,1,11,HGZ 1 Aguascalientes,29,9,2014,15,34,15,39,101,48005,4,2,1,3,12,2,,5,5,2,2,2,2,1,2,1,1,2,1,1,2,2,,1,2,,2,,1,1,1,1,2,2,2,,2,,,,,2,,2,,2,10,2,1,1,996,,,2,2,2,9,3,,8,2,996,5,39,1,5,3,862,11000000,104,2,8.02775213529586000000,2014-09-29,1
201114,1,11,HGZ 1 Aguascalientes,29,9,2014,13,32,13,38,101,48002,2,2,2,,,,,,,,,,,,,,,,,,,2,,2,1,3,2,,1,1,1,2,2,1,2,,1,5,2,1,2,2,,1,2,2,10,998,1,1,996,,,2,1,2,11,,,10,1,996,1,41,2,5,4,862,11000000,105,2,7.91058686756340000000,2014-09-29,1
201115,1,11,HGZ 1 Aguascalientes,29,9,2014,14,2,14,13,101,48004,2,2,1,1,25,3,,6,2,2,2,2,2,1,1,1,1,1,1,1,2,2,,1,1,5,2,,1,1,1,1,2,2,2,,2,,,,,2,,2,,2,8,1,2,2,3,2,2,1,99,2,11,,,9,4,996,1,42,2,7,3,862,11000000,106,2,7.91058686756340000000,2014-09-29,1
201116,1,11,HGZ 1 Aguascalientes,29,9,2014,14,36,14,42,101,48002,3,3,1,3,29,1,,3,4,1,2,2,1,1,1,1,1,1,1,1,2,2,,2,2,,2,,1,1,1,1,2,2,2,,2,,,,,2,,2,,2,7,3,1,1,996,,,3,2,2,4,3,9,8,2,996,2,65,2,5,4,862,11000000,107,2,7.67852410643261000000,2014-09-29,1
201117,1,11,HGZ 1 Aguascalientes,29,9,2014,14,15,14,24,101,48004,1,1,1,1,29,1,,1,1,1,1,1,1,1,2,2,1,1,1,2,2,2,,1,2,,2,,1,1,1,1,2,2,2,,2,,,,,2,,2,,2,10,2,1,1,996,,,4,2,2,8,3,,10,1,996,1,46,1,6,3,862,11000000,108,2,7.82690006739005000000,2014-09-29,1
201121,1,11,HGZ 1 Aguascalientes,29,9,2014,14,7,14,13,101,48004,2,2,1,3,27,1,,3,2,1,1,2,1,1,1,1,1,1,2,2,2,1,1,1,1,3,2,,1,1,2,1,4,2,2,,2,,,,,2,,2,,2,10,1,1,1,1,2,2,2,2,4,9,4,,9,2,996,2,56,1,3,3,862,11000000,112,2,7.60082078157065000000,2014-09-29,1
201123,1,11,HGZ 1 Aguascalientes,29,9,2014,14,47,14,54,101,48004,2,2,1,3,12,2,,99,1,2,2,2,2,1,1,1,1,1,1,1,2,2,,1,2,,2,,1,1,1,1,1,2,2,,2,,,,,2,,2,,1,10,16,1,2,996,,,6,,2,11,,,9,1,996,1,56,2,4,99,862,11000000,113,2,7.89667713727188000000,2014-09-29,1
201124,1,11,HGZ 1 Aguascalientes,29,9,2014,14,35,14,41,101,48002,2,2,1,3,18,4,,1,1,1,1,1,1,1,1,1,1,1,1,1,2,1,5,1,1,1,1,1,1,1,1,1,2,2,2,,2,,,,,2,,2,,2,10,16,1,1,996,,,5,2,1,4,3,6,10,1,996,5,50,1,5,5,862,11000000,114,2,7.82690006739005000000,2014-09-29,1
201125,1,11,HGZ 1 Aguascalientes,29,9,2014,14,59,15,8,101,48004,4,5,1,3,18,4,,6,5,2,2,2,2,1,1,1,1,1,1,1,1,2,,2,2,,2,,1,1,1,1,4,4,2,,2,,,,,2,,2,,2,6,996,,,996,,,5,2,5,10,1,2,7,4,996,2,62,1,3,99,862,11000000,115,2,7.60082078157065000000,2014-09-29,1
201127,1,11,HGZ 1 Aguascalientes,29,9,2014,15,15,15,22,101,48004,1,1,1,3,12,2,,5,5,2,2,2,2,1,1,1,1,1,1,1,2,1,6,1,1,4,2,,1,1,2,1,4,2,2,,2,,,,,1,1,1,4,2,10,2,1,2,996,,,5,2,2,7,11,,10,1,996,5,34,1,3,2,862,11000000,117,2,7.89632392076590000000,2014-09-29,1
201997,1,11,HGZ 1 Aguascalientes,29,9,2014,15,21,15,28,101,48002,2,2,1,1,14,2,,6,1,1,1,1,1,1,2,1,1,1,1,1,2,2,,2,2,,2,,1,1,1,2,2,2,2,,2,,,,,2,,2,,2,9,16,1,1,996,,,6,,1,8,,,9,1,996,5,52,1,5,5,862,11000000,223,2,7.82690006739005000000,2014-09-29,1
201998,1,11,HGZ 1 Aguascalientes,29,9,2014,14,34,14,42,101,48003,2,2,1,3,27,1,,2,1,1,1,1,1,1,1,1,1,1,1,1,2,2,,1,2,,2,,2,,,,,,2,,2,,,,,2,,2,,2,9,2,1,1,996,,,4,2,2,11,,,9,2,996,1,36,1,7,3,862,11000000,224,2,8.02775213529586000000,2014-09-29,1
2011001,1,11,HGZ 1 Aguascalientes,29,9,2014,14,47,15,22,101,48004,2,2,1,1,2,5,2,1,1,1,1,2,1,1,1,1,2,1,1,1,2,2,,1,1,1,1,7,2,,,,,,2,,1,5,1,1,2,2,,2,,2,9,2,1,1,996,,,6,,2,3,8,,8,1,996,1,34,1,9,4,862,11000000,225,2,7.89632392076590000000,2014-09-29,1