Folio,Deleg,Unidmed,Id_Unid,Fecha_D,Fecha_M,Fecha_A,Hr_Ini_H,Hr_Ini_M,Hr_Fin_H,Hr_Fin_M,Delegad_Edo,Delegad_Mun,Edad,Sexo,Edocivi,Escolar,Ingreso,Ocupa,Tel�Fono,Sat1,Retro,Prospe,Confi1_A,Confi1_B,Confi1_C,Confi1_D,Confi1_E,Confi1_F,Confi1_G,Unidad1,Motunid_A,Motunid_B,Motunid_C,Motunid_D,Motunid_E,Motcons2,Motcons2_Umae,Motcons2_T,Tiem_Esp,Filtroch,Consulta,Preosad,Tmsalud,Mhclinc,Expclaa_A,Expclaa_B,Expclaa_C,Expclaa_D,Expclab_A,Expclab_B,Expclab_C,Expclab_D,Mopin,Explora,Cexplora,Mexapriv,Prevenf_A,Prevenf_B,Prevenf_C,Prevenf_D,Prevmed,Filtrourg,Tespurg,Calteurg,Mottesp,Servurg,Tobscama,Pregurg,Expurg,Clarurg,Infofamur,Califurg,Filtrocir,Progciru,Topera,Fechaop,Suspop1,Suspop3,Suspop4,Motoper,Motoper1,Infofam,Oportiff,Calciru,Filtrohos,Nochesh,Frecrevm,Asisenf,Infamho,Opinfhos,Horarioh,Acchosp_A,Acchosp_B,Acchosp_C,Acchosp_D,Acchosp_E,Acchosp_F,Acchosp_G,Calhosp,Filtrosaux,Temsad,Saduni,Privalrx,Faltamat,Satlarx,Btratou,Calfatna_A,Calfatna_B,Calfatna_C,Calfatna_D,Calfatna_E,Calfatna_F,Calfatna_G,Calfatna_H,Calfatna_I,Calfatna_J,Calfatna_K,Calfatna_L,Calfatna_M,Calfatna_N,Calfatnb_A,Calfatnb_B,Calfatnb_C,Calfatnb_D,Calfatnb_E,Calfatnb_F,Calfatnb_G,Calfatnb_H,Calfatnb_I,Calfatnb_J,Calfatnb_K,Calfatnb_L,Calfatnb_M,Calfatnb_N,Infimss,Finfimss,Continf,Cartel,Calfinma_A,Calfinma_B,Calfinma_C,Calfinma_D,Calfinma_E,Calfinmb_A1,Calfinmb_B1,Calfinmb_B2,Calfinmb_B3,Calfinmb_C1,Calfinmb_C2,Calfinmb_D1,Calfinmb_E1,Calfinmb_F,Calfinmb_G,Calfinmb_H,Calfinmb_I,Calfinmb_J,Ordylim1,Ordylim2,Ordylim3,Recomuni,Norecom,Corrup,Atn1fam,Caqod,Sat2,Filtrofarm,Tfarsurt,Totmed,Acnomed,Versurt,Versurt2,Traimss,Farm1,Farm2,Farm3,Farm3_X,Farm4,Fe_Finalnr,Fecha,Entidad
5822,7,Hospital de Especialidades No. 71 Torre�n,3001,27,6,11,14,30,14,51,5,14,57,2,1,4,2,3,1,1,1,1,1,5,5,1,1,5,5,1,3,,,,,5,,,1,1,1,2,1,1,1,2,2,2,2,,,,1,1,1,1,1,1,1,1,1,2,,,,,,,,,,,2,,,,,,,,,,,,1,1,5,1,2,2,2,2,2,2,2,1,1,1,1,1,1,2,1,2,1,1,1,1,1,1,1,1,1,1,1,1,1,1,2,1,1,1,1,1,1,1,1,1,1,1,1,1,,1,2,,,1,2,1,1,1,1,,1,1,5,1,1,2,2,2,1,1,1,2,,,,1,,2,2,1,2,1,2,1,,1,1,5,1,1,,,,1.30288922557120000000,2011-06-27,5
5830,7,Hospital de Especialidades No. 71 Torre�n,3001,27,6,11,17,35,17,54,5,14,42,1,2,9,3,5,1,2,1,1,4,1,2,1,2,5,2,1,5,,,,,1,,,2,2,,,,,,,,,,,,,,,,,,,,,,2,,,,,,,,,,,2,,,,,,,,,,,,2,,,,,,,,,,,,,,,1,4,1,2,2,1,1,2,2,1,1,2,2,2,1,2,2,2,1,2,2,,,1,2,,,,2,,,,2,,,2,,,2,2,2,2,2,1,,,,,,,,2,1,1,1,2,2,,,,1,,2,2,99,1,2,,,,,,3,2,,,,,1.60019828205267000000,2011-06-27,5
5831,7,Hospital de Especialidades No. 71 Torre�n,3001,27,6,11,17,9,17,29,5,14,46,1,2,3,2,5,2,1,1,1,1,2,4,1,1,5,5,1,1,,,,,3,,,2,1,1,1,1,1,2,1,1,1,,1,2,1,1,1,1,1,1,1,1,1,1,2,,,,,,,,,,,2,,,,,,,,,,,,2,,,,,,,,,,,,,,,2,,,,,,1,1,2,2,2,2,2,2,2,2,2,2,2,2,2,1,,,,,,,,,,,,,,2,,,2,2,1,2,2,2,,3,3,4,,,,,2,2,2,2,2,,,,1,,2,2,99,1,2,,,,,,5,2,,,,,1.33549523385139000000,2011-06-27,5
5836,7,Hospital de Especialidades No. 71 Torre�n,3001,27,6,11,11,30,11,50,5,14,32,1,1,7,3,4,1,4,2,2,5,2,5,2,2,2,2,1,1,,,,,1,,,1,1,1,4,,1,2,2,1,1,,,1,1,2,2,,,2,2,2,2,2,2,,,,,,,,,,,2,,,,,,,,,,,,2,,,,,,,,,,,,,,,2,,,,,,2,2,2,1,1,1,2,2,2,2,2,2,2,2,1,,,2,3,3,,,,,,,,,2,2,,,1,1,1,1,2,2,4,4,4,4,4,4,,,4,4,2,99,99,,,,2,2,2,1,97,3,1,1,1,,1,1,5,2,,,,,1.56092196549789000000,2011-06-27,5
5837,7,Hospital de Especialidades No. 71 Torre�n,3001,27,6,11,10,30,10,48,5,14,36,1,2,8,3,5,2,2,2,2,4,4,5,2,2,5,5,2,1,,,,,4,,,1,1,2,1,1,1,1,2,2,1,1,,,1,1,1,2,1,1,1,2,2,1,2,,,,,,,,,,,2,,,,,,,,,,,,2,,,,,,,,,,,,,,,2,,,,,,1,1,2,1,2,1,2,2,2,2,2,2,1,2,2,2,,1,,2,,,,,,,2,,,2,,,2,1,1,1,2,2,2,4,4,5,2,3,,,3,2,2,2,2,2,2,2,99,,2,1,2,2,2,,,,,,5,1,1,,,,1.60019828205267000000,2011-06-27,5
5838,7,Hospital de Especialidades No. 71 Torre�n,3001,27,6,11,10,52,11,19,5,14,47,1,2,1,1,5,2,1,1,1,4,2,2,1,1,1,1,2,1,,,,,1,,,2,1,2,1,1,1,1,2,1,1,1,,1,1,1,1,1,1,1,1,1,1,1,1,3,3,,1,1,1,1,1,1,2,2,,,,,,,,,,,,1,1,3,2,1,1,2,2,2,2,2,1,2,2,1,1,2,1,2,2,2,1,1,2,1,2,1,2,2,2,2,2,2,2,2,2,1,,1,,1,,,,,,,,,,2,,,2,1,1,1,2,2,1,3,2,5,1,1,,,3,2,2,2,2,1,1,1,1,,2,2,1,1,1,99,99,99,2,,5,1,1,,,,1.33549523385139000000,2011-06-27,5
5839,7,Hospital de Especialidades No. 71 Torre�n,3001,27,6,11,9,32,10,1,5,14,55,1,1,6,3,2,1,2,97,1,3,4,3,2,1,4,4,2,1,,,,,3,,,1,1,2,4,,1,2,2,2,2,,,,,4,1,1,1,1,1,2,2,2,2,,,,,,,,,,,2,,,,,,,,,,,,2,,,,,,,,,,,,,,,1,2,1,2,2,2,1,2,1,2,2,2,2,1,2,2,2,2,1,2,2,,2,,,,,2,,,,,2,,,2,,,2,2,2,2,1,2,,,,,,,3,,5,2,2,99,99,2,2,2,1,,2,2,2,3,2,,,,,,5,1,2,95,95,,1.27771336570616000000,2011-06-27,5
5841,7,Hospital de Especialidades No. 71 Torre�n,3001,27,6,11,17,42,18,0,5,14,62,1,2,4,3,5,1,1,2,1,2,2,2,2,2,2,2,2,1,,,,,1,,,3,1,2,1,1,1,1,1,1,1,1,1,1,1,1,2,,,2,2,2,2,1,2,,,,,,,,,,,2,,,,,,,,,,,,2,,,,,,,,,,,,,,,2,,,,,,1,2,1,1,2,2,2,2,2,2,2,2,2,2,1,,1,1,,,,,,,,,,,1,2,,,2,1,2,2,2,2,1,,,,,,,,1,1,1,1,1,1,2,2,1,,2,2,3,1,1,1,1,,1,1,5,1,1,,,,1.27771336570616000000,2011-06-27,5
5842,7,Hospital de Especialidades No. 71 Torre�n,3001,27,6,11,9,0,9,22,5,14,45,2,2,5,3,1,2,5,2,99,1,3,5,2,5,5,5,2,5,,,,,6,71,,1,2,,,,,,,,,,,,,,,,,,,,,,2,,,,,,,,,,,2,,,,,,,,,,,,2,,,,,,,,,,,,,,,1,1,1,2,2,1,1,2,2,2,2,2,2,2,1,2,1,2,1,1,2,,,,,,,,2,,2,,2,2,,2,,,2,2,2,1,2,1,,,,,1,1,,1,1,1,1,99,99,97,,,1,,2,2,2,2,2,,,,,,1,1,1,,,,1.36180961840766000000,2011-06-27,5
5843,7,Hospital de Especialidades No. 71 Torre�n,3001,27,6,11,9,41,9,55,5,14,22,1,2,5,2,5,2,1,1,99,1,1,4,2,1,4,4,2,1,,,,,6,6,,2,1,2,1,1,1,1,2,1,1,1,,1,1,1,1,2,1,1,1,1,1,1,2,,,,,,,,,,,2,,,,,,,,,,,,2,,,,,,,,,,,,,,,2,,,,,,1,1,1,1,2,1,2,2,2,2,2,2,1,2,2,2,2,2,,2,,,,,,,2,,,2,,,1,1,2,1,2,2,2,,,,2,2,,,1,1,1,1,1,2,2,2,1,,2,2,1,2,2,,,,,,3,2,,,,,1.77758942924958000000,2011-06-27,5
5844,7,Hospital de Especialidades No. 71 Torre�n,3001,27,6,11,9,58,10,12,5,14,66,1,2,2,2,5,1,1,1,99,1,3,5,1,1,5,5,2,1,,,,,4,,,3,2,,,,,,,,,,,,,,,,,,,,,,2,,,,,,,,,,,2,,,,,,,,,,,,2,,,,,,,,,,,,,,,1,4,1,1,2,1,1,2,2,2,2,1,2,1,2,2,2,2,1,2,2,,,,,1,,1,,,,,1,,,2,,,2,2,2,1,1,2,,,,,2,2,1,,1,1,1,2,2,2,2,2,1,,2,2,1,1,2,,,,,,1,2,,,,,1.31660567854717000000,2011-06-27,5
5845,7,Hospital de Especialidades No. 71 Torre�n,3001,27,6,11,10,34,11,3,5,14,66,2,3,6,1,9,2,3,2,1,1,5,5,3,3,5,5,2,1,2,4,5,,6,6,,1,1,2,1,1,1,1,1,2,2,1,1,,,1,2,,,2,2,1,2,1,1,4,5,4,999,,1,1,4,2,4,1,1,1,1,,,5,1,9,1,1,1,1,4,3,1,1,1,2,2,2,97,2,97,2,2,1,1,3,2,2,2,2,1,1,2,1,2,2,2,2,2,2,1,2,1,2,2,2,,2,,,,,,,2,,2,,,2,,,2,1,2,1,2,2,3,,,,3,2,,,4,2,2,2,2,2,2,2,1,,2,1,2,1,2,,,,,,1,1,1,,,,1.34254786632596000000,2011-06-27,5
5846,7,Hospital de Especialidades No. 71 Torre�n,3001,27,6,11,11,5,11,19,5,14,36,1,2,7,3,5,2,1,97,1,2,2,5,2,2,5,2,2,5,,,,,6,999,,2,2,,,,,,,,,,,,,,,,,,,,,,2,,,,,,,,,,,2,,,,,,,,,,,,2,,,,,,,,,,,,,,,1,4,1,3,2,2,2,1,2,2,2,2,2,2,2,2,2,2,1,2,2,3,,,,,,,,,,,2,,,2,,,1,2,1,1,2,2,,5,3,5,3,2,,,3,2,2,99,99,2,1,2,1,,2,2,2,2,2,,,,,,3,2,,,,,1.60019828205267000000,2011-06-27,5
5847,7,Hospital de Especialidades No. 71 Torre�n,3001,27,6,11,11,20,11,37,5,14,23,2,1,5,3,8,1,1,1,1,1,1,99,1,1,3,3,2,5,,,,,4,,,3,2,,,,,,,,,,,,,,,,,,,,,,2,,,,,,,,,,,2,,,,,,,,,,,,2,,,,,,,,,,,,,,,1,4,1,2,2,2,1,2,2,2,2,2,2,1,2,2,2,2,2,2,2,,,,,,,2,,,,,,,,2,,,2,2,1,2,1,2,,4,2,4,,,2,,2,2,2,99,99,2,1,1,1,,2,2,1,1,2,,,,,,3,1,1,,,,1.81261476714580000000,2011-06-27,5
5848,7,Hospital de Especialidades No. 71 Torre�n,3001,27,6,11,11,40,12,4,5,14,77,1,4,3,2,5,1,1,2,1,3,99,99,1,1,3,3,2,1,3,4,5,,3,,,2,1,2,1,1,1,1,1,1,1,1,1,1,1,1,1,1,1,2,2,2,2,1,1,3,4,2,1,1,1,1,1,1,1,1,1,1,1,,,1,2,10,1,1,1,99,,,,,,,,,,,,,,,1,3,1,1,2,1,1,1,2,2,1,2,2,2,2,2,2,2,2,1,1,1,,,1,,,,,,,,,1,1,2,,,99,1,2,1,2,2,1,,,,1,1,,,2,2,2,2,2,3,2,2,1,,2,2,1,1,1,1,1,,1,1,3,2,,,,,1.31660567854717000000,2011-06-27,5
5849,7,Hospital de Especialidades No. 71 Torre�n,3001,27,6,11,12,8,12,29,5,14,52,2,2,2,3,4,2,1,2,99,2,2,5,2,1,4,5,2,1,5,,,,1,,,2,1,1,1,1,1,1,1,2,1,2,2,,2,1,2,,,2,2,2,2,1,1,4,5,3,8,,1,1,1,1,2,2,,,,,,,,,,,,2,,,,,,,,,,,,,,,1,4,2,2,2,1,1,1,2,1,2,2,2,2,2,2,2,2,2,2,2,2,,1,,,,,,,,,,,,2,,,2,1,2,1,1,2,1,,,,2,2,2,,2,2,2,2,2,1,1,2,1,,2,2,1,2,2,,,,,,1,1,1,,,,1.36180961840766000000,2011-06-27,5
5850,7,Hospital de Especialidades No. 71 Torre�n,3001,27,6,11,12,31,12,49,5,14,67,1,4,2,2,5,2,1,1,1,99,99,99,1,1,4,4,2,1,,,,,3,,,3,1,2,1,1,1,1,2,1,1,1,,1,1,1,1,1,1,2,2,2,2,1,2,,,,,,,,,,,2,,,,,,,,,,,,2,,,,,,,,,,,,,,,2,,,,,,1,1,2,1,2,2,2,2,2,2,2,2,2,2,2,1,,1,,,,,,,,,,,,99,,,1,1,1,1,2,2,1,2,2,4,2,2,,,2,2,2,2,2,1,1,2,1,,2,2,1,2,2,,,,,,3,2,,,,,1.31660567854717000000,2011-06-27,5
5851,7,Hospital de Especialidades No. 71 Torre�n,3001,27,6,11,12,51,13,10,5,14,32,1,2,3,1,5,2,1,1,1,5,5,5,1,1,3,5,2,1,4,5,,,3,,,1,1,2,1,1,1,1,2,2,2,3,,,,3,2,,,1,1,2,2,2,2,,,,,,,,,,,2,,,,,,,,,,,,2,,,,,,,,,,,,,,,1,1,1,1,2,1,1,1,2,1,2,2,2,2,2,2,2,2,2,2,2,1,,1,,,,,,,,,,,,2,,,1,1,1,1,2,2,1,2,2,4,1,1,,,1,2,1,99,99,1,1,2,1,,2,2,1,1,2,,,,,,3,1,1,,,,1.56092196549789000000,2011-06-27,5
5853,7,Hospital de Especialidades No. 71 Torre�n,3001,27,6,11,15,8,15,30,5,14,45,1,2,5,3,5,2,1,97,1,5,3,5,2,2,5,5,2,1,,,,,1,,,1,2,,,,,,,,,,,,,,,,,,,,,,2,,,,,,,,,,,1,2,2,1,,,30,8,13,2,2,2,2,,,,,,,,,,,,,,,1,3,2,3,1,2,1,1,2,2,2,2,2,2,2,2,2,2,1,1,2,2,,,,,,,,,,,2,2,,2,,,1,2,1,1,2,2,,5,2,5,2,2,,,99,3,2,2,2,1,1,2,1,,2,2,2,2,2,,,,,,3,1,1,,,,1.33549523385139000000,2011-06-27,5
5855,7,Hospital de Especialidades No. 71 Torre�n,3001,27,6,11,16,38,17,0,5,14,46,2,2,2,3,4,2,2,2,1,2,2,5,2,99,5,99,1,5,,,,,1,,,1,2,,,,,,,,,,,,,,,,,,,,,,2,,,,,,,,,,,2,,,,,,,,,,,,2,,,,,,,,,,,,,,,1,1,1,2,2,1,1,1,2,2,2,2,2,2,2,2,2,2,2,2,2,1,,,,,,,,,,,,,,2,,,2,2,1,2,2,2,,2,2,4,,,,,2,2,2,2,99,,,,1,,2,2,2,1,2,,,,,,1,1,1,,,,1.36180961840766000000,2011-06-27,5
5856,7,Hospital de Especialidades No. 71 Torre�n,3001,27,6,11,17,2,17,20,5,14,61,1,4,1,1,5,2,3,1,1,99,2,99,2,1,5,99,1,1,,,,,3,,,2,1,2,1,1,1,1,2,2,1,2,,,2,1,1,1,1,2,2,2,2,1,2,,,,,,,,,,,2,,,,,,,,,,,,2,,,,,,,,,,,,,,,2,,,,,,1,1,2,1,2,1,2,2,2,2,2,1,1,2,1,2,,2,,2,,,,,,2,2,,2,2,,,2,1,1,1,2,2,2,4,2,4,2,2,,,2,2,2,99,99,,,,1,,2,2,1,2,1,1,1,,1,1,3,2,,,,,1.27771336570616000000,2011-06-27,5
5857,7,Hospital de Especialidades No. 71 Torre�n,3001,27,6,11,17,52,18,14,5,14,66,1,2,3,99,5,1,1,97,99,99,99,99,1,1,99,99,2,1,5,,,,3,,,3,1,2,1,1,1,1,2,2,2,1,,,,1,1,1,1,1,1,1,2,1,2,,,,,,,,,,,2,,,,,,,,,,,,2,,,,,,,,,,,,,,,1,4,1,2,2,2,1,1,2,1,2,1,2,2,2,2,2,2,2,2,2,2,,1,,2,,,,,,,,,,2,,,1,1,2,1,2,2,2,,,,2,2,,,2,2,2,2,99,97,,,1,,2,2,1,1,2,,,,,,4,2,,,,,1.31660567854717000000,2011-06-27,5
5859,7,Hospital de Especialidades No. 71 Torre�n,3001,27,6,11,19,8,19,28,5,14,40,1,2,7,99,2,2,1,2,1,2,2,4,1,1,2,4,2,1,5,,,,6,17,,3,1,2,1,2,1,1,2,1,1,2,,1,3,4,2,,,1,2,2,2,1,2,,,,,,,,,,,2,,,,,,,,,,,,2,,,,,,,,,,,,,,,1,3,1,2,1,2,1,1,2,1,2,1,2,2,2,2,2,2,1,2,2,5,,2,,2,,,,,,,2,,,2,,,2,1,2,1,2,2,2,,,,2,2,,,2,2,2,99,99,97,,,1,,2,2,2,2,1,1,1,,1,1,3,1,1,,,,1.60019828205267000000,2011-06-27,5
5860,7,Hospital de Especialidades No. 71 Torre�n,3001,27,6,11,9,27,9,45,5,14,42,1,2,3,2,5,1,2,1,1,1,2,2,1,1,3,2,2,5,,,,,1,,,3,1,2,1,1,1,1,1,1,2,1,1,1,,1,1,1,2,1,1,2,2,1,2,,,,,,,,,,,2,,,,,,,,,,,,2,,,,,,,,,,,,,,,1,4,1,1,2,1,1,1,1,1,2,2,1,2,2,2,2,2,1,2,1,1,1,1,,,1,,,,,,1,,1,2,,,1,2,2,1,2,1,,,,,1,2,,1,2,1,1,1,1,3,2,1,1,,2,1,1,1,2,,,,,,5,1,1,,,,1.60019828205267000000,2011-06-27,5
5861,7,Hospital de Especialidades No. 71 Torre�n,3001,27,6,11,8,49,9,13,5,14,62,1,2,1,1,2,1,1,3,3,1,1,2,1,1,3,3,2,1,2,,,,1,,,2,2,,,,,,,,,,,,,,,,,,,,,,2,,,,,,,,,,,2,,,,,,,,,,,,2,,,,,,,,,,,,,,,1,3,1,2,2,2,1,2,2,1,2,2,2,1,2,1,2,2,1,2,1,,,1,,,,2,,2,,,2,,2,2,,,2,1,1,1,1,2,4,4,4,3,2,2,2,,3,2,2,2,2,3,2,2,1,,2,2,2,2,2,,,,,,5,2,,,,,1.27771336570616000000,2011-06-27,5
5862,7,Hospital de Especialidades No. 71 Torre�n,3001,27,6,11,9,50,10,7,5,14,79,1,4,2,2,9,1,5,3,3,2,1,3,4,1,2,4,2,1,5,,,,1,,,3,1,2,4,,1,2,2,1,2,,,3,,4,2,,,2,2,2,2,2,2,,,,,,,,,,,2,,,,,,,,,,,,2,,,,,,,,,,,,,,,1,1,2,4,1,3,1,1,1,2,2,1,1,2,2,2,2,1,2,2,2,1,1,,,1,1,,,,,1,,,,2,,,2,1,1,1,2,2,2,3,3,4,1,1,,,2,1,1,1,1,1,2,99,99,,2,2,2,4,2,,,,,,5,2,,,,,1.31660567854717000000,2011-06-27,5
5863,7,Hospital de Especialidades No. 71 Torre�n,3001,27,6,11,10,25,10,58,5,14,43,2,2,7,2,9,2,3,3,3,1,1,3,3,1,1,3,2,1,2,,,,1,,,1,1,2,1,1,1,1,1,1,1,1,1,1,1,1,1,2,1,2,2,2,2,1,2,,,,,,,,,,,2,,,,,,,,,,,,1,3,4,2,2,3,3,2,1,1,2,1,1,1,2,1,3,1,2,2,2,1,1,2,1,2,2,2,2,2,2,2,2,2,2,2,1,,1,,,,,,,,,,,,2,,,1,1,2,1,2,2,1,,,,1,1,,,1,3,2,2,4,3,2,2,1,,2,1,2,4,1,1,2,3,2,,5,2,,,,,1.63172833314748000000,2011-06-27,5
5864,7,Hospital de Especialidades No. 71 Torre�n,3001,27,6,11,10,55,11,15,5,14,62,1,4,5,2,5,1,2,1,2,5,3,3,2,1,5,5,2,1,5,,,,1,,,1,2,,,,,,,,,,,,,,,,,,,,,,2,,,,,,,,,,,2,,,,,,,,,,,,2,,,,,,,,,,,,,,,1,1,1,1,2,2,1,2,2,2,2,2,2,2,1,2,2,2,2,2,2,,,,,,,,1,,,,,,,2,,,2,2,1,1,2,1,,1,1,3,1,1,,1,1,1,1,1,1,2,1,1,1,,2,2,1,1,2,,,,,,5,2,,,,,1.27771336570616000000,2011-06-27,5
5865,7,Hospital de Especialidades No. 71 Torre�n,3001,27,6,11,11,50,12,10,5,14,53,2,1,3,2,9,2,2,1,1,1,1,2,1,1,1,2,2,1,,,,,5,,,3,2,,,,,,,,,,,,,,,,,,,,,,1,1,2,,1,4,1,1,2,1,1,2,,,,,,,,,,,,1,5,3,1,1,1,1,2,2,2,2,2,2,2,2,1,1,1,1,1,1,1,2,2,2,2,2,2,2,2,2,2,2,2,2,2,,,,,,,,,,,,,,,2,,,2,2,1,1,2,2,,2,2,4,1,1,,,1,1,1,1,1,2,1,2,1,,2,1,1,2,2,,,,,,5,1,1,,,,1.36180961840766000000,2011-06-27,5
5866,7,Hospital de Especialidades No. 71 Torre�n,3001,27,6,11,12,30,12,45,5,14,45,2,2,8,3,2,1,1,1,1,1,5,5,3,1,5,5,2,1,,,,,1,,,1,1,2,1,1,1,1,1,1,2,1,1,1,,1,1,2,1,2,2,2,2,1,2,,,,,,,,,,,2,,,,,,,,,,,,2,,,,,,,,,,,,,,,1,3,1,1,1,2,1,2,1,1,2,2,2,1,1,2,1,2,2,1,1,,2,2,,,,2,2,,2,,,2,2,2,,,2,1,1,1,1,1,1,3,3,99,1,1,1,1,2,1,1,2,1,1,1,1,1,,2,1,1,2,1,5,1,,1,1,5,1,1,,,,1.36180961840766000000,2011-06-27,5
5867,7,Hospital de Especialidades No. 71 Torre�n,3001,27,6,11,12,58,13,13,5,14,48,2,2,5,1,4,2,2,1,1,1,1,3,1,1,3,3,2,1,5,,,,5,,,3,1,2,1,1,1,1,1,1,1,2,2,2,2,2,1,2,1,2,2,2,2,1,2,,,,,,,,,,,2,,,,,,,,,,,,2,,,,,,,,,,,,,,,1,3,1,1,2,1,1,2,1,2,2,1,2,1,1,2,2,2,1,2,2,,1,,,1,,1,1,,,,1,,,2,,,1,2,1,1,1,1,,5,5,5,1,1,1,1,1,1,1,3,3,3,2,2,1,,2,2,2,1,2,,,,,,5,1,1,,,,1.36180961840766000000,2011-06-27,5
5868,7,Hospital de Especialidades No. 71 Torre�n,3001,27,6,11,13,17,13,31,5,14,64,2,2,2,2,9,1,2,3,2,2,4,4,2,1,4,4,1,1,5,,,,3,,,3,1,1,4,,2,1,1,1,1,3,3,3,3,2,2,,,2,2,2,2,2,2,,,,,,,,,,,2,,,,,,,,,,,,2,,,,,,,,,,,,,,,2,,,,,,2,2,1,2,1,2,2,2,2,2,2,2,2,2,2,,1,,1,,,,,,,,,,,2,,,2,1,1,1,1,1,3,5,5,5,3,3,1,1,1,4,4,1,1,,,,2,1,2,1,3,3,2,,,,,,5,1,1,,,,1.30288922557120000000,2011-06-27,5
5869,7,Hospital de Especialidades No. 71 Torre�n,3001,27,6,11,13,48,14,2,5,14,67,1,2,7,3,5,1,1,2,2,1,3,3,1,1,1,4,2,1,,,,,4,,,3,2,,,,,,,,,,,,,,,,,,,,,,2,,,,,,,,,,,2,,,,,,,,,,,,2,,,,,,,,,,,,,,,1,3,1,1,2,1,1,1,2,2,2,1,2,1,2,2,2,2,2,2,1,1,,,,1,,1,,,,,,,1,2,,,1,2,1,1,2,2,,2,3,5,1,1,,,1,1,1,3,3,3,1,2,1,,2,1,1,1,1,1,1,,1,1,5,1,1,,,,1.31660567854717000000,2011-06-27,5
5870,7,Hospital de Especialidades No. 71 Torre�n,3001,27,6,11,14,7,14,28,5,14,70,1,2,5,3,5,1,1,1,1,1,1,2,2,2,2,1,1,1,5,,,,3,,,1,2,,,,,,,,,,,,,,,,,,,,,,2,,,,,,,,,,,2,,,,,,,,,,,,2,,,,,,,,,,,,,,,1,2,1,2,2,2,1,1,1,2,2,2,2,2,1,2,1,2,2,1,2,1,2,,,,,,2,,2,,,2,,2,,,2,1,1,1,2,1,2,2,2,2,1,1,,1,1,2,2,2,2,,,,1,,2,2,3,2,2,,,,,,5,1,1,,,,1.31660567854717000000,2011-06-27,5
5871,7,Hospital de Especialidades No. 71 Torre�n,3001,27,6,11,14,35,14,50,5,14,62,2,2,6,4,4,1,2,1,1,1,1,3,1,1,3,3,2,1,,,,,1,,,2,1,2,1,1,2,1,1,1,1,1,1,1,1,1,1,1,1,1,1,1,2,1,2,,,,,,,,,,,2,,,,,,,,,,,,2,,,,,,,,,,,,,,,1,3,1,1,2,1,1,1,2,1,2,2,2,2,2,2,2,2,2,1,1,1,,1,,,,,,,,,,1,1,2,,,1,1,2,1,1,2,1,,,,1,1,1,,1,3,1,3,1,99,99,99,1,,2,2,1,5,1,99,99,3,2,,3,1,2,96,96,,1.30288922557120000000,2011-06-27,5
5872,7,Hospital de Especialidades No. 71 Torre�n,3001,27,6,11,15,1,15,18,5,14,66,2,2,5,2,4,2,3,99,99,1,1,3,3,1,1,3,1,1,,,,,1,,,2,1,1,1,1,2,2,2,2,1,,,,1,1,2,,,2,2,2,2,1,2,,,,,,,,,,,2,,,,,,,,,,,,2,,,,,,,,,,,,,,,2,,,,,,1,1,1,1,2,2,1,2,2,2,2,1,2,1,2,1,1,1,,,1,,,,,1,,1,,2,,,2,1,2,1,2,2,1,,,,1,1,,,2,99,3,1,3,,,,2,2,2,2,99,3,2,,,,,,5,2,,,,,1.34254786632596000000,2011-06-27,5
5873,7,Hospital de Especialidades No. 71 Torre�n,3001,27,6,11,15,20,15,35,5,14,52,1,2,4,2,4,1,1,1,1,3,2,4,1,1,5,4,2,1,,,,,1,,,1,1,2,1,1,1,1,1,1,1,1,1,1,1,1,1,2,1,1,1,1,1,1,2,,,,,,,,,,,2,,,,,,,,,,,,2,,,,,,,,,,,,,,,1,3,1,1,2,1,1,1,1,1,2,1,2,2,2,2,2,2,1,2,1,1,1,1,,99,,,,,,,1,,1,2,,,2,1,2,1,1,2,1,,,,1,1,1,,1,1,1,3,1,1,1,2,1,,2,2,1,1,1,1,1,,1,1,5,2,,,,,1.33549523385139000000,2011-06-27,5
5875,7,Hospital de Especialidades No. 71 Torre�n,3001,27,6,11,16,52,17,15,5,14,53,1,2,7,4,5,1,1,1,1,1,1,3,1,1,3,3,2,1,,,,,1,,,1,1,2,1,1,1,1,1,1,2,1,1,1,,1,1,1,1,1,1,1,1,1,2,,,,,,,,,,,2,,,,,,,,,,,,2,,,,,,,,,,,,,,,1,2,1,1,2,2,1,1,2,1,2,1,2,2,2,2,2,1,2,2,1,2,,2,,2,,,,,,1,,,1,2,,,1,1,1,1,2,2,1,1,1,1,1,1,,,1,1,1,1,1,1,1,1,1,,2,1,1,1,1,1,1,,1,1,1,1,1,,,,1.33549523385139000000,2011-06-27,5
5915,7,Hospital de Especialidades No. 71 Torre�n,3001,27,6,11,17,54,18,10,5,14,66,2,1,7,4,9,1,1,2,3,5,4,5,1,99,99,99,2,5,,,,,1,,,1,2,,,,,,,,,,,,,,,,,,,,,,2,,,,,,,,,,,2,,,,,,,,,,,,2,,,,,,,,,,,,,,,1,4,1,1,2,1,1,2,2,2,2,2,2,1,2,2,2,2,2,2,2,,,,,,,2,,,,,,,,2,,,99,99,2,1,1,2,,,,,2,2,1,,2,1,1,2,2,2,2,2,1,,2,2,1,2,2,,,,,,1,1,1,,,,1.34254786632596000000,2011-06-27,5
5917,7,Hospital de Especialidades No. 71 Torre�n,3001,27,6,11,8,42,9,3,5,14,44,1,3,9,1,1,1,2,2,1,99,99,2,1,99,99,4,2,5,,,,,1,,,1,2,,,,,,,,,,,,,,,,,,,,,,2,,,,,,,,,,,2,,,,,,,,,,,,2,,,,,,,,,,,,,,,1,1,1,2,2,1,1,2,2,2,2,2,2,1,2,2,2,2,2,2,2,,,,,,,2,,,,,,,,2,,,2,2,2,1,1,2,,,,,2,2,2,,3,3,3,99,1,2,2,2,1,,2,2,1,1,2,,,,,,3,1,1,,,,1.60019828205267000000,2011-06-27,5
5918,7,Hospital de Especialidades No. 71 Torre�n,3001,27,6,11,9,8,9,28,5,14,69,1,5,3,1,1,1,1,1,1,4,4,4,1,1,4,4,2,5,,,,,3,,,3,2,,,,,,,,,,,,,,,,,,,,,,2,,,,,,,,,,,2,,,,,,,,,,,,2,,,,,,,,,,,,,,,1,4,1,1,2,1,1,2,2,2,2,2,2,1,2,2,2,2,2,2,2,,,,,,,1,,,,,,,,2,,,1,2,2,1,1,1,,,,,1,1,1,1,1,1,1,1,1,97,,,1,,2,2,1,1,2,,,,,,3,1,1,,,,1.31660567854717000000,2011-06-27,5
5919,7,Hospital de Especialidades No. 71 Torre�n,3001,27,6,11,10,18,10,39,5,14,31,1,2,3,2,5,2,1,1,1,4,1,99,1,1,4,5,2,3,,,,,1,,,2,2,,,,,,,,,,,,,,,,,,,,,,2,,,,,,,,,,,2,,,,,,,,,,,,1,3,5,1,3,3,1,2,2,97,2,2,2,2,2,2,,,,,,1,1,2,1,2,2,2,2,2,2,2,2,2,2,1,2,,2,,,,,,,,,,,2,2,,,1,1,2,2,1,2,2,,,,,,1,,2,2,2,2,99,1,1,1,1,,2,2,2,1,2,,,,,,3,1,1,,,,1.56092196549789000000,2011-06-27,5
5920,7,Hospital de Especialidades No. 71 Torre�n,3001,27,6,11,10,41,11,15,5,14,58,2,2,3,1,8,2,1,1,1,2,99,99,1,1,5,99,2,1,,,,,6,30,,3,1,2,1,1,1,1,2,2,2,1,,,,1,2,,,2,2,1,2,1,2,,,,,,,,,,,2,,,,,,,,,,,,2,,,,,,,,,,,,,,,2,,,,,,1,1,2,1,2,2,2,2,2,2,2,2,2,2,2,1,,1,,,,,,,,,,,,99,,,99,1,2,1,2,2,1,,,,1,1,,,2,2,1,1,1,97,,,1,,2,2,1,1,2,,,,,,1,2,,,,,1.30288922557120000000,2011-06-27,5
5921,7,Hospital de Especialidades No. 71 Torre�n,3001,27,6,11,11,18,11,38,5,14,67,1,2,3,2,5,1,1,97,1,4,4,5,1,1,4,4,2,1,3,4,5,,3,,,2,1,2,1,1,1,2,2,2,2,,,,,1,1,1,1,1,1,1,2,1,1,2,4,2,3,,1,1,2,1,2,2,,,,,,,,,,,,2,,,,,,,,,,,,,,,1,1,1,1,2,2,1,1,2,1,2,1,2,2,2,2,2,2,2,1,2,2,,1,,1,,,,,,,,2,,2,,,1,1,2,1,2,2,1,,,,1,1,,,2,1,1,1,1,2,1,2,1,,2,2,1,1,2,,,,,,3,1,1,,,,1.31660567854717000000,2011-06-27,5
5922,7,Hospital de Especialidades No. 71 Torre�n,3001,27,6,11,12,0,12,25,5,14,43,1,2,3,2,5,2,2,2,99,1,5,5,5,1,5,5,2,1,3,4,5,,1,,,1,1,1,1,1,1,1,2,2,2,2,,,,1,2,,,1,1,1,2,1,1,1,3,,3,,1,1,1,1,2,2,,,,,,,,,,,,1,1,2,1,2,1,99,2,2,97,2,2,2,2,2,1,3,2,2,2,2,1,1,2,1,2,1,2,2,2,2,2,2,2,2,2,2,,1,,1,,,,,,,,,,2,,,1,1,2,1,2,2,1,,,,1,1,,,1,1,1,1,1,1,1,99,1,,2,99,1,3,2,,,,,,3,2,,,,,1.60019828205267000000,2011-06-27,5
5923,7,Hospital de Especialidades No. 71 Torre�n,3001,27,6,11,12,33,12,50,5,14,42,1,2,99,99,999,99,99,99,99,2,2,5,1,1,3,5,2,1,,,,,1,,,1,1,2,1,1,1,1,2,2,2,1,,,,1,1,1,1,1,1,1,2,1,2,,,,,,,,,,,2,,,,,,,,,,,,2,,,,,,,,,,,,,,,2,,,,,,1,1,2,1,2,1,2,2,2,2,2,2,2,1,2,3,,1,,3,,,,,,,,2,,2,,,1,1,1,1,2,2,1,1,1,4,2,2,,,1,1,1,1,1,1,1,2,1,,2,2,1,1,2,,,,,,3,1,1,,,,1.60019828205267000000,2011-06-27,5
5924,7,Hospital de Especialidades No. 71 Torre�n,3001,27,6,11,13,30,13,53,5,14,54,1,4,2,1,9,1,1,1,2,5,5,5,2,1,5,4,2,5,,,,,3,,,3,2,,,,,,,,,,,,,,,,,,,,,,2,,,,,,,,,,,2,,,,,,,,,,,,2,,,,,,,,,,,,,,,1,4,1,1,2,1,1,2,2,2,2,2,2,1,2,2,2,2,2,2,2,,,,,,,2,,,,,,,,2,,,1,2,2,2,1,2,,,,,,,2,,2,1,1,1,1,2,2,2,1,,2,2,1,2,2,,,,,,3,1,1,,,,1.33549523385139000000,2011-06-27,5
5928,7,Hospital de Especialidades No. 71 Torre�n,3001,27,6,11,10,5,10,24,5,14,62,1,2,6,1,9,1,2,2,1,2,5,5,1,1,5,5,2,1,,,,,1,,,1,1,2,1,1,1,1,2,2,2,1,,,,1,1,2,1,1,1,1,1,1,2,,,,,,,,,,,2,,,,,,,,,,,,2,,,,,,,,,,,,,,,2,,,,,,99,2,2,2,2,2,2,2,2,2,2,2,2,2,2,,,,,,,,,,,,,,,99,,,2,1,2,1,2,2,2,,,,2,2,,,2,4,2,4,3,3,2,1,1,,2,1,2,2,1,1,1,,1,1,5,1,1,,,,1.27771336570616000000,2011-06-27,5
5945,7,Hospital de Especialidades No. 71 Torre�n,3001,27,6,11,17,40,18,0,5,14,31,1,2,99,1,5,2,1,1,1,1,5,5,1,1,5,5,2,1,,,,,1,,,1,1,2,1,1,1,2,2,1,1,,,2,2,1,1,2,2,1,1,2,2,1,2,,,,,,,,,,,2,,,,,,,,,,,,2,,,,,,,,,,,,,,,1,4,1,1,2,1,1,1,2,1,2,1,2,1,2,2,2,1,1,2,2,2,,2,,99,,2,,,,2,2,,,2,,,1,2,2,1,2,2,,,,,2,2,,,2,2,2,99,2,2,2,1,1,,2,2,1,1,99,,,,,,5,2,,,,,1.56092196549789000000,2011-06-27,5
5947,7,Hospital de Especialidades No. 71 Torre�n,3001,27,6,11,9,8,9,25,5,14,47,2,2,4,1,4,1,2,2,1,2,1,99,1,1,4,4,2,1,,,,,3,,,1,1,2,1,1,1,1,1,1,1,2,2,2,2,1,1,2,1,1,1,1,2,1,2,,,,,,,,,,,2,,,,,,,,,,,,2,,,,,,,,,,,,,,,1,1,1,2,2,2,1,1,2,1,2,1,2,2,2,2,2,2,2,2,2,2,,2,,2,,,,,,,,,,2,,,2,1,1,1,2,2,2,2,2,2,2,2,,,2,2,2,2,2,1,1,1,1,,2,1,1,2,2,,,,,,5,2,,,,,1.36180961840766000000,2011-06-27,5
5949,7,Hospital de Especialidades No. 71 Torre�n,3001,27,6,11,9,55,10,18,5,14,31,1,2,6,1,4,2,2,1,1,1,1,4,1,1,4,5,2,1,,,,,3,,,2,1,2,1,1,1,1,1,1,1,2,2,2,2,1,1,99,1,2,2,2,2,1,1,3,4,5,1,1,1,1,1,1,3,2,,,,,,,,,,,,2,,,,,,,,,,,,,,,2,,,,,,1,1,2,1,2,2,2,2,2,2,2,2,1,2,2,4,,2,,,,,,,,,2,,,2,,,2,1,1,1,2,2,2,4,2,4,2,4,,,2,2,2,2,2,1,1,1,1,,2,2,1,2,2,,,,,,5,1,2,2,1,2,1.56092196549789000000,2011-06-27,5
5952,7,Hospital de Especialidades No. 71 Torre�n,3001,27,6,11,11,9,11,20,5,14,30,2,2,5,1,4,2,2,1,1,5,4,4,1,1,5,5,1,1,,,,,3,,,1,1,1,1,1,99,1,1,1,1,2,2,2,2,1,1,99,1,2,2,2,2,1,1,3,4,2,1,1,1,1,99,1,3,1,1,1,2,5,,1,7,999,2,2,2,1,3,3,1,2,2,2,2,1,2,2,1,2,2,2,2,,,,,,1,1,2,1,2,1,1,1,1,1,1,1,1,1,1,2,,2,,2,2,2,2,2,2,2,3,2,2,2,,,2,1,1,1,2,2,2,3,2,5,3,3,,,3,2,2,99,99,,,,1,,2,1,1,99,1,1,1,,1,1,3,2,,,,,1.59167812233118000000,2011-06-27,5
5954,7,Hospital de Especialidades No. 71 Torre�n,3001,27,6,11,11,55,12,3,5,14,40,1,2,5,3,5,2,2,2,2,1,2,2,1,99,99,99,2,1,,,,,1,,,2,1,1,1,1,1,1,2,1,1,1,,1,1,2,1,2,1,1,1,1,2,1,2,,,,,,,,,,,2,,,,,,,,,,,,2,,,,,,,,,,,,,,,2,,,,,,1,1,2,1,2,1,2,2,2,2,2,2,2,2,2,2,,2,,2,,,,,,,,,,2,,,1,1,2,1,2,2,2,,,,2,2,,,2,2,2,2,2,3,2,2,1,,2,2,2,2,2,,,,,,5,1,1,,,,1.60019828205267000000,2011-06-27,5
5955,7,Hospital de Especialidades No. 71 Torre�n,3001,27,6,11,12,20,12,38,5,14,50,2,2,6,1,9,2,2,1,1,5,2,2,1,1,5,5,2,1,,,,,3,,,1,2,,,,,,,,,,,,,,,,,,,,,,2,,,,,,,,,,,2,,,,,,,,,,,,2,,,,,,,,,,,,,,,1,1,1,2,2,2,1,1,1,2,2,2,2,1,2,2,2,2,2,2,2,2,2,,,,,2,,,,,,,,2,,,2,2,2,2,1,2,,,,,,,2,,99,2,2,2,2,1,1,99,1,,2,1,1,2,2,,,,,,2,2,,,,,1.36180961840766000000,2011-06-27,5
5960,7,Hospital de Especialidades No. 71 Torre�n,3001,27,6,11,12,14,12,42,5,14,51,1,2,2,1,4,1,4,3,1,1,2,5,2,1,1,2,2,1,,,,,1,,,1,1,2,1,1,1,1,2,1,1,2,,2,2,1,1,1,2,2,2,2,2,1,1,3,1,,4,,2,2,,1,2,2,,,,,,,,,,,,2,,,,,,,,,,,,,,,2,,,,,,2,1,2,1,2,1,2,2,2,2,2,2,2,2,2,4,,2,,2,,,,,,,,,,2,,,2,1,1,1,2,2,2,2,2,4,2,2,,,2,3,3,2,3,1,1,1,1,,2,1,3,2,1,1,1,,1,1,5,1,2,1,1,1,1.33549523385139000000,2011-06-27,5
5965,7,Hospital de Especialidades No. 71 Torre�n,3001,27,6,11,17,40,18,0,5,14,28,2,2,6,1,4,2,2,2,1,4,5,5,1,2,5,5,1,1,,,,,1,,,1,1,1,1,1,1,1,1,1,2,4,2,3,,4,1,2,2,1,2,2,2,2,1,4,5,5,1,1,2,2,,1,3,2,,,,,,,,,,,,1,1,3,1,2,2,3,2,2,2,2,2,2,2,2,2,,,,,,1,1,2,1,2,2,2,2,2,2,2,2,2,1,2,2,,2,,,,,,,,,,2,,2,,,2,1,1,1,2,2,1,2,2,2,1,2,,,2,3,2,99,2,,,,1,,2,1,1,2,2,,,,,,5,1,1,,,,1.59167812233118000000,2011-06-27,5
5967,7,Hospital de Especialidades No. 71 Torre�n,3001,27,6,11,8,50,9,12,5,14,61,1,1,6,99,1,1,3,99,1,1,3,3,2,1,1,4,1,5,,,,,1,,,1,1,2,1,2,1,2,2,1,2,,,1,,1,2,,,1,1,2,2,2,2,,,,,,,,,,,2,,,,,,,,,,,,2,,,,,,,,,,,,,,,1,2,1,2,2,2,1,2,1,1,2,2,2,2,2,2,2,2,2,2,1,,1,1,,,,,,,,,,,1,2,,,1,1,1,1,2,2,2,4,4,4,2,99,,,2,1,1,1,1,,,,1,,2,2,99,2,1,3,1,,2,,5,1,1,,,,1.27771336570616000000,2011-06-27,5
5969,7,Hospital de Especialidades No. 71 Torre�n,3001,27,6,11,10,38,10,42,5,14,65,2,2,2,2,9,2,1,1,2,1,1,3,1,1,5,5,1,1,,,,,1,,,3,1,2,1,1,1,1,1,1,1,2,2,1,2,1,1,2,1,1,2,1,2,1,2,,,,,,,,,,,2,,,,,,,,,,,,2,,,,,,,,,,,,,,,1,4,1,1,2,1,1,2,1,1,2,2,2,2,2,2,2,2,2,2,1,,1,1,,,,,,,,,,,3,2,,,2,1,1,1,2,2,1,1,1,4,1,1,,,1,1,1,1,1,,,,1,,2,2,1,1,2,,,,,,5,1,2,3,2,4,1.34254786632596000000,2011-06-27,5
5971,7,Hospital de Especialidades No. 71 Torre�n,3001,27,6,11,12,31,12,46,5,14,19,2,2,6,3,1,2,2,1,99,1,1,4,1,1,5,4,2,1,,,,,1,,,1,1,2,1,1,1,1,1,1,1,1,2,2,2,1,1,2,1,1,1,2,2,1,2,,,,,,,,,,,2,,,,,,,,,,,,2,,,,,,,,,,,,,,,1,1,1,1,2,1,1,1,2,1,2,1,2,2,2,2,2,2,2,1,2,1,,1,,1,,,,,,,,1,,2,,,2,1,1,1,2,2,1,5,5,5,1,1,,,1,1,1,1,3,2,2,2,1,,2,1,1,2,2,,,,,,5,1,1,,,,1.81261476714580000000,2011-06-27,5