Folio,Id_Unid,Deleg,Unidmed,Fecha_D,Fecha_M,Fecha_A,Hr_Ini_H,Hr_Ini_M,Hr_Fin_H,Hr_Fin_M,Edad,Sexo,Edocivi,Escolar,Ocupa,Tel�Fono,Sat1,Retro,Prospe,Confi1_A,Confi1_B,Confi1_C,Confi1_D,Confi1_E,Confi1_F,Confi1_G,Mot_Cons2,Preosad,Tmsalud,Mhclinc,Expclaa_A,Expclaa_B,Expclaa_C,Expclaa_D,Expclab_A,Expclab_B,Expclab_C,Expclab_D,Mopin,Explora,Cexplora,Mexapriv,Prevenf_A,Prevenf_B,Prevenf_C,Prevenf_D,Prevmed,Temsad,Saduni,Privalrx,Faltamat,Satlarx,Btratou,Calfatna_A,Calfatna_C,Calfatna_D,Calfatna_E,Calfatna_F,Calfatna_G,Calfatna_H,Calfatna_J,Calfatna_K,Calfatna_L,Calfatna_M,Calfatna_N,Calfatnb_A,Calfatnb_C,Calfatnb_D,Calfatnb_E,Calfatnb_F,Calfatnb_G,Calfatnb_H,Calfatnb_J,Calfatnb_K,Calfatnb_L,Calfatnb_M,Calfatnb_N,Infimss,Finfimss,Continf,Cartel,Atn1fam,Calfinma_A,Calfinma_B,Calfinma_C,Calfinma_D,Calfinma_E,Calfinmb_A1,Calfinmb_B1,Calfinmb_B2,Calfinmb_B3,Calfinmb_C1,Calfinmb_C2,Calfinmb_D1,Calfinmb_E1,Calfinmb_F,Calfinmb_G,Calfinmb_H,Calfinmb_I,Calfinmb_J,Ordylim1,Ordylim2,Ordylim3,Recomuni,Norecom,Corrup,Caqod,Sat2,Filtrofarm,Tfarsurt,Totmed,Acnomed,Versurt,Versurt2,Traimss,Farm1,Farm2,Farm3,Farm4,Id_Unidad,Unidad,Cve_Delegaci�N,Nivel,Fe_Finalnr,Fecha,Entidad
719,1,1,UMF 8 Aguascalientes,20,6,11,,19,,19,59,1,2,5,5,2,2,1,2,3,3,5,3,3,5,5,4,1,1,1,1,1,1,1,2,2,2,2,1,1,2,1,1,1,1,2,1,3,1,2,2,2,1,1,1,2,2,2,2,2,2,2,2,2,1,2,2,,,,,,,,,,2,1,5,3,2,2,1,2,1,2,2,2,,,,2,3,,,2,2,2,2,2,99,99,99,1,,2,1,2,1,2,1,,1,1,5,2,,,,1,UMF 8 Aguascalientes,1,1,8.28345247960424000000,2011-06-20,1
720,1,1,UMF 8 Aguascalientes,20,6,11,,13,,13,70,1,2,3,5,1,1,2,1,2,2,5,2,2,3,3,3,1,1,2,2,2,1,2,,,2,,2,1,3,1,1,2,1,2,1,4,1,2,2,2,1,1,1,2,2,2,2,2,2,2,2,2,1,2,1,,,,,,,,,,2,1,8,998,2,2,1,2,1,2,2,2,,,,2,3,,,2,3,2,3,3,2,99,99,1,,2,2,2,1,1,1,,1,1,1,1,1,,,1,UMF 8 Aguascalientes,1,1,8.07302460102420000000,2011-06-20,1
721,1,1,UMF 8 Aguascalientes,20,6,11,,9,,10,67,2,2,2,4,2,1,1,1,1,1,3,2,1,1,2,1,1,1,3,1,2,1,2,2,,2,,2,1,2,1,1,1,1,1,1,,,,,,1,1,1,2,2,1,1,2,2,2,2,2,2,2,2,,,2,2,,,,,,,2,,,2,2,1,1,1,1,2,1,1,1,1,1,1,1,,2,2,2,1,2,1,1,1,1,,2,1,1,1,1,1,,1,1,5,1,1,,,1,UMF 8 Aguascalientes,1,1,9.56769164489821000000,2011-06-20,1
722,1,1,UMF 8 Aguascalientes,20,6,11,,10,,10,93,1,4,5,5,1,4,3,3,2,2,2,2,2,4,4,1,2,3,2,1,2,1,2,2,,2,,2,1,2,1,1,1,1,1,1,1,1,2,2,2,2,1,1,2,2,2,2,2,2,2,2,2,1,4,2,,,,,,,,,,1,2,,,2,2,1,1,1,2,2,2,1,2,2,2,2,,,2,2,2,2,99,2,2,2,1,,2,3,2,1,1,1,,1,1,5,1,1,,,1,UMF 8 Aguascalientes,1,1,8.07302460102420000000,2011-06-20,1
723,1,1,UMF 8 Aguascalientes,20,6,11,,15,,15,39,1,1,3,5,2,2,2,2,1,3,5,2,1,5,5,3,1,1,2,2,2,2,2,,,,,2,1,2,1,1,2,2,2,2,,,,,,1,1,1,2,2,2,2,2,2,2,2,2,1,2,2,,,,,,,,,,2,2,,,2,2,1,2,2,2,2,2,,,,,,,,2,2,2,2,2,2,1,2,1,,2,2,2,1,1,1,,1,1,5,1,1,,,1,UMF 8 Aguascalientes,1,1,9.35095517816194000000,2011-06-20,1
724,1,1,UMF 8 Aguascalientes,20,6,11,,13,,13,73,1,1,2,5,1,1,1,99,2,1,2,3,5,2,2,3,2,1,2,1,2,1,1,1,,2,1,1,1,2,1,2,2,2,2,1,,,,,,1,2,1,2,1,2,2,2,2,2,2,2,1,,1,,1,,,,,,,,2,2,,,2,2,1,2,1,2,2,2,,,,2,2,,,2,3,2,2,99,97,,,1,,2,3,2,1,1,1,,1,1,5,1,1,,,1,UMF 8 Aguascalientes,1,1,8.07302460102420000000,2011-06-20,1
725,1,1,UMF 8 Aguascalientes,20,6,11,,8,,9,28,2,2,5,4,2,2,1,2,2,2,2,2,2,4,4,1,1,1,1,2,2,1,2,,,2,,2,2,,,1,1,2,1,1,,,,,,1,1,1,2,2,2,2,2,2,2,2,2,1,2,2,,,,,,,,,,2,2,,,2,2,1,2,1,2,2,2,,,,2,2,,,2,2,2,2,99,,,,1,,2,3,2,1,1,1,,1,1,5,2,,,,1,UMF 8 Aguascalientes,1,1,10.55476596390550000000,2011-06-20,1
726,1,1,UMF 8 Aguascalientes,20,6,11,,12,,12,47,2,3,3,1,2,2,1,2,2,2,5,2,5,5,5,1,2,1,3,1,1,1,1,2,2,2,2,1,2,,,1,1,1,2,1,4,1,2,2,4,1,1,1,2,2,2,1,2,2,2,2,2,1,1,1,,,,1,,,,,,1,1,7,1,2,2,1,1,1,2,2,2,3,2,5,1,2,,,2,2,2,3,2,1,1,1,1,,2,1,2,1,1,1,,1,1,1,1,1,,,1,UMF 8 Aguascalientes,1,1,10.35330937431510000000,2011-06-20,1
727,1,1,UMF 8 Aguascalientes,20,6,11,,14,,14,22,1,2,6,5,2,2,2,1,2,2,4,2,99,2,4,998,2,3,1,1,1,1,2,1,2,2,,1,1,1,1,1,1,2,2,1,4,1,2,2,2,1,1,1,2,1,2,2,2,2,2,2,2,1,2,2,,2,,,,,,,,1,1,5,9,2,2,1,2,1,2,2,2,,,,2,2,,,2,4,3,2,3,99,1,2,1,,2,1,2,1,1,1,,1,1,5,1,1,,,1,UMF 8 Aguascalientes,1,1,8.45485297950078000000,2011-06-20,1
728,1,1,UMF 8 Aguascalientes,20,6,11,,9,,9,54,1,2,4,5,2,1,1,99,2,2,4,2,1,4,4,3,2,1,2,1,1,1,1,2,1,2,2,2,1,1,1,1,1,1,2,1,,,,,,1,2,1,2,1,2,2,2,2,2,2,2,1,,2,,1,,,,,,,,1,2,,,1,2,1,2,1,1,2,2,,,,2,2,3,,3,3,99,99,99,97,,,1,,2,97,2,1,1,1,,1,1,5,2,,,,1,UMF 8 Aguascalientes,1,1,8.73591294358119000000,2011-06-20,1
729,1,1,UMF 8 Aguascalientes,20,6,11,,15,,15,56,1,2,2,10,1,3,2,3,99,3,5,3,3,5,5,4,1,1,1,2,2,1,2,,,2,,4,2,,,2,2,1,2,1,,,,,,1,2,1,1,1,2,2,2,2,2,2,2,1,,2,3,4,,,,,,,,2,2,,,99,2,1,2,1,2,2,2,,,,1,1,,,2,4,2,2,99,2,2,2,2,1,2,3,3,1,3,1,,1,1,1,2,,,,1,UMF 8 Aguascalientes,1,1,8.28345247960424000000,2011-06-20,1
730,1,1,UMF 8 Aguascalientes,20,6,11,,14,,14,38,1,2,6,5,2,2,2,2,4,2,5,2,2,5,5,3,1,1,1,1,1,1,1,2,2,2,2,1,1,2,1,1,1,2,2,2,,,,,,1,2,1,2,2,2,1,2,2,2,2,2,1,,2,,,,2,,,,,,2,2,,,1,2,1,2,1,1,2,2,,,,2,2,2,,2,3,2,2,5,3,2,99,1,,2,1,2,1,1,1,,1,1,5,1,1,,,1,UMF 8 Aguascalientes,1,1,9.35095517816194000000,2011-06-20,1
731,1,1,UMF 8 Aguascalientes,20,6,11,,13,,13,61,1,2,3,5,1,2,2,2,99,2,5,2,2,2,99,4,1,1,1,2,2,2,2,,,,,1,1,2,1,1,1,2,2,1,,,,,,1,1,1,2,2,2,2,2,2,2,2,2,1,2,1,,,,,,,,,,2,1,7,8,2,1,1,2,1,2,2,2,,,,2,2,,,2,2,2,2,4,2,1,1,1,,2,1,2,1,1,1,,1,1,1,1,1,,,1,UMF 8 Aguascalientes,1,1,8.28345247960424000000,2011-06-20,1
732,1,1,UMF 8 Aguascalientes,20,6,11,,12,,12,58,1,2,9,7,1,3,2,3,5,5,5,3,1,5,5,3,1,1,1,2,2,1,2,,,2,,4,1,4,1,1,2,2,2,2,,,,,,1,1,1,2,2,2,2,2,2,2,2,2,1,2,2,,,,,,,,,,2,1,2,8,2,2,1,2,1,2,2,3,,,,3,4,,,2,2,2,3,3,2,2,2,1,,2,1,3,1,1,1,,1,1,5,1,1,,,1,UMF 8 Aguascalientes,1,1,8.28345247960424000000,2011-06-20,1
733,1,1,UMF 8 Aguascalientes,20,6,11,,12,,12,73,2,2,3,9,1,1,3,2,1,1,3,1,99,5,3,4,1,1,3,1,1,1,2,2,2,2,,1,1,2,1,2,2,1,1,1,,,,,,1,1,1,2,2,2,2,2,2,2,2,2,1,2,2,,,,,,,,,,2,1,2,998,2,99,1,1,1,2,2,3,2,2,2,2,2,,,3,4,2,2,2,1,1,99,2,4,2,1,2,1,1,1,,1,1,5,2,,,,1,UMF 8 Aguascalientes,1,1,9.56769164489821000000,2011-06-20,1
734,1,1,UMF 8 Aguascalientes,20,6,11,,10,,10,53,1,2,3,3,2,3,1,99,2,2,2,3,3,2,3,4,1,1,1,1,2,1,1,4,,2,2,2,2,,,1,2,1,2,1,,,,,,1,1,1,2,2,2,2,2,2,2,2,2,1,2,2,,,,,,,,,,2,2,,,2,2,1,2,2,1,2,2,,,,,,2,,2,99,4,2,99,2,2,2,1,,2,2,2,1,1,1,,1,1,5,2,,,,1,UMF 8 Aguascalientes,1,1,8.73591294358119000000,2011-06-20,1
735,1,1,UMF 8 Aguascalientes,20,6,11,,9,,9,52,1,2,1,5,1,2,1,99,1,1,5,1,1,4,5,4,1,1,1,1,2,1,1,1,,2,2,1,1,2,1,1,1,1,2,1,,,,,,1,1,1,2,2,2,2,2,2,2,2,2,1,2,2,,,,,,,,,,2,1,8,999,1,99,1,2,1,2,2,2,,,,2,2,,,2,2,2,2,99,2,1,2,1,,2,1,2,1,1,1,,1,1,5,2,,,,1,UMF 8 Aguascalientes,1,1,8.73591294358119000000,2011-06-20,1
736,1,1,UMF 8 Aguascalientes,20,6,11,,18,,18,37,2,2,6,2,1,3,2,2,2,2,5,2,1,2,5,3,2,3,2,1,2,2,2,4,,,,3,1,3,1,1,1,2,2,2,,,,,,1,1,1,1,2,2,2,2,2,2,2,2,2,3,4,3,,,,,,,,,,2,,,2,2,1,2,1,2,2,2,,,,3,2,,,2,2,2,2,2,2,1,2,1,,2,3,3,1,1,1,,1,1,5,2,,,,1,UMF 8 Aguascalientes,1,1,11.08222260570930000000,2011-06-20,1
737,1,1,UMF 8 Aguascalientes,20,6,11,,19,,19,65,1,1,3,5,1,1,2,1,1,1,3,1,1,2,3,3,2,1,1,1,2,1,1,1,,2,1,1,1,2,99,1,2,1,1,1,,,,,,1,1,1,2,2,2,2,2,2,2,2,2,1,1,1,,,,,,,,,,1,1,4,998,2,2,1,2,1,2,2,1,,,,4,4,,,4,2,3,2,5,3,2,1,1,,2,1,1,1,1,1,,1,1,5,1,1,,,1,UMF 8 Aguascalientes,1,1,8.07302460102420000000,2011-06-20,1
738,1,1,UMF 8 Aguascalientes,20,6,11,,9,,9,34,1,2,2,5,2,3,1,2,1,2,2,3,2,5,5,3,1,2,2,2,2,2,2,,,,,4,2,,,1,1,2,2,2,,,,,,1,1,1,2,2,2,2,2,2,2,2,1,1,4,4,,,,,,,,,5,2,2,,,2,2,1,1,2,2,2,4,4,4,4,,,,,4,2,2,2,4,2,2,2,1,,2,3,5,1,1,1,,1,1,2,1,1,,,1,UMF 8 Aguascalientes,1,1,8.90589793726241000000,2011-06-20,1
739,1,1,UMF 8 Aguascalientes,20,6,11,,8,,8,59,2,2,5,5,1,1,1,1,1,1,2,1,1,4,4,1,1,1,2,1,1,1,1,1,1,2,2,1,1,2,1,1,1,2,2,1,,,,,,1,1,1,2,2,2,1,2,2,2,2,2,1,1,2,,,,2,,,,,,1,2,,,1,1,1,2,1,2,2,1,,,,1,1,,,1,1,1,1,1,1,1,2,1,,2,1,2,1,1,1,,1,1,1,1,1,,,1,UMF 8 Aguascalientes,1,1,9.81707885170648000000,2011-06-20,1
740,1,1,UMF 8 Aguascalientes,20,6,11,,10,,10,21,1,2,6,5,2,2,1,1,2,2,4,2,2,4,4,4,1,1,3,97,2,1,2,,,2,,2,1,2,1,1,1,1,2,2,2,1,2,2,2,1,1,1,1,2,2,1,2,2,1,2,2,1,2,2,2,,,1,,,2,,,2,2,,,1,1,1,1,1,1,2,2,2,4,4,2,2,2,,2,2,2,2,2,1,1,2,1,,2,2,4,2,,,,,,5,1,1,,,1,UMF 8 Aguascalientes,1,1,8.45485297950078000000,2011-06-20,1
741,1,1,UMF 8 Aguascalientes,20,6,11,,17,,17,35,1,2,6,5,1,2,2,2,1,3,5,2,2,2,5,1,1,1,1,1,2,1,2,2,,2,,1,1,2,1,1,2,1,2,1,,,,,,1,1,1,2,2,2,2,2,2,2,2,2,1,2,2,,,,,,,,,,2,1,1,1,1,1,1,2,2,2,2,2,,,,,,,,4,4,2,4,5,99,99,99,99,,2,1,2,1,1,1,,1,1,2,1,1,,,1,UMF 8 Aguascalientes,1,1,9.35095517816194000000,2011-06-20,1
742,1,1,UMF 8 Aguascalientes,20,6,11,,19,,19,22,1,1,5,2,1,2,1,2,1,1,1,1,2,2,1,1,1,1,1,1,1,1,1,2,2,2,2,1,1,99,99,1,1,2,2,2,1,1,1,2,2,1,1,1,2,2,2,2,2,2,2,2,2,2,2,1,,,,,,,,,,,2,,,1,1,1,2,1,2,2,2,,,,2,2,,,2,2,2,2,2,1,1,1,1,,2,1,2,2,,,,,,5,1,1,,,1,UMF 8 Aguascalientes,1,1,8.45485297950078000000,2011-06-20,1
743,1,1,UMF 8 Aguascalientes,20,6,11,,16,,16,72,1,4,2,5,1,2,1,99,1,1,99,1,1,1,5,3,1,1,1,1,1,1,1,1,1,2,2,1,2,,,1,2,1,2,1,1,1,2,2,1,1,1,1,2,2,2,2,2,2,2,2,2,2,2,2,,,,,,,,,,,2,,,2,2,1,2,1,2,2,2,,,,2,2,,,2,2,2,2,2,99,99,99,1,,2,1,1,1,1,1,,1,1,1,1,1,,,1,UMF 8 Aguascalientes,1,1,8.07302460102420000000,2011-06-20,1
744,1,1,UMF 8 Aguascalientes,20,6,11,,8,,8,59,2,2,2,5,2,2,1,99,1,1,4,1,1,1,4,3,1,1,1,2,1,1,2,,2,2,,1,2,,,1,2,2,2,2,1,1,2,1,2,1,2,1,2,2,2,2,2,2,2,2,2,1,,1,,,,,,,,,,2,2,,,1,2,1,2,1,1,2,2,,,,2,2,2,,2,2,2,2,2,99,1,99,1,,2,2,1,1,1,1,,1,1,5,2,,,,1,UMF 8 Aguascalientes,1,1,9.81707885170648000000,2011-06-20,1
745,1,1,UMF 8 Aguascalientes,20,6,11,,16,,16,35,1,2,5,4,2,2,97,1,1,4,5,2,3,3,5,2,2,1,2,1,2,2,2,2,,,,1,2,,,1,1,1,1,2,1,1,2,2,2,1,1,1,2,2,2,2,1,2,2,2,2,2,2,2,,,,,2,,,,,,2,,,2,2,1,2,1,2,1,2,,,,2,2,,2,2,4,2,3,4,,,,1,,2,97,2,1,1,1,,1,1,3,2,,,,1,UMF 8 Aguascalientes,1,1,9.35095517816194000000,2011-06-20,1
746,1,1,UMF 8 Aguascalientes,20,6,11,,14,,14,43,1,2,7,5,1,2,1,1,4,3,4,1,3,5,5,3,1,1,1,2,2,1,2,,,2,,2,2,,,1,1,2,2,2,3,2,4,2,3,1,2,1,2,2,2,2,2,2,2,2,2,1,,1,,,,,,,,,,1,2,,,2,1,1,2,1,2,2,3,,,,2,3,,,3,3,2,99,3,1,2,1,1,,2,1,2,2,,,,,,5,1,1,,,1,UMF 8 Aguascalientes,1,1,9.35095517816194000000,2011-06-20,1
747,1,1,UMF 8 Aguascalientes,20,6,11,,14,,15,26,1,2,7,5,1,2,1,1,4,2,4,2,2,5,2,4,2,1,1,1,2,2,2,2,,,,1,1,1,1,1,2,2,2,2,3,1,2,2,2,2,2,1,2,2,2,1,1,2,2,2,2,2,,1,,,,3,2,,,,,,1,7,1,2,2,1,2,1,1,2,2,,,,3,2,2,,3,3,2,3,3,1,1,1,1,,2,1,2,2,,,,,,5,1,1,,,1,UMF 8 Aguascalientes,1,1,8.90589793726241000000,2011-06-20,1
748,1,1,UMF 8 Aguascalientes,20,6,11,,13,,14,80,2,2,3,9,2,1,1,2,2,2,3,1,2,4,4,3,3,,1,2,2,2,2,,,,,1,2,,,1,1,1,1,1,,,,,,1,1,1,2,2,2,2,2,2,2,2,2,1,1,1,,,,,,,,,,1,2,,,2,2,1,2,1,2,2,1,,,,1,1,,,2,2,2,2,2,2,2,2,1,,2,2,1,1,1,1,,1,1,5,1,1,,,1,UMF 8 Aguascalientes,1,1,9.56769164489821000000,2011-06-20,1
749,1,1,UMF 8 Aguascalientes,20,6,11,,11,,11,66,1,1,2,5,2,2,1,2,2,2,2,2,2,2,2,3,1,1,2,2,2,2,2,,,,,2,2,,,1,1,2,2,2,,,,,,1,1,1,2,2,2,2,2,2,2,2,2,1,2,2,,,,,,,,,,2,2,,,2,2,1,2,2,2,2,2,,,,,,,,2,2,2,2,2,2,2,2,2,1,2,1,2,1,1,1,,1,1,5,1,1,,,1,UMF 8 Aguascalientes,1,1,8.07302460102420000000,2011-06-20,1
750,1,1,UMF 8 Aguascalientes,20,6,11,,13,,13,58,2,2,3,9,2,2,1,1,3,4,5,2,3,3,5,4,2,1,2,2,2,2,1,,,,1,2,1,2,1,1,1,1,2,1,3,1,2,2,2,1,1,1,2,2,2,2,2,2,2,2,2,1,2,1,,,,,,,,,,1,1,2,3,2,2,1,2,1,2,2,1,,,,3,3,,,2,2,2,4,2,2,2,2,1,,2,2,2,1,1,1,,1,1,1,1,1,,,1,UMF 8 Aguascalientes,1,1,9.81707885170648000000,2011-06-20,1
751,1,1,UMF 8 Aguascalientes,20,6,11,,12,,12,21,1,2,7,1,2,2,2,2,1,1,5,1,1,3,3,1,1,1,1,1,1,1,2,1,1,1,,1,1,1,1,2,2,2,2,2,1,1,1,2,1,1,1,1,1,2,2,2,1,2,2,2,2,1,3,1,1,,,,1,,,,,2,2,,,2,99,1,1,2,2,1,2,3,3,5,,,,1,2,3,3,4,2,3,2,2,1,,2,2,2,1,1,1,,1,1,5,1,1,,,1,UMF 8 Aguascalientes,1,1,8.45485297950078000000,2011-06-20,1
752,1,1,UMF 8 Aguascalientes,20,6,11,,10,,10,40,2,2,5,1,1,2,1,1,1,1,4,3,1,5,5,2,1,1,3,2,1,1,2,,2,2,,3,2,,,1,1,1,1,1,,,,,,1,1,1,1,2,2,2,2,2,2,2,2,1,2,2,2,,,,,,,,,1,1,8,998,1,2,1,2,1,2,2,1,,,,1,1,,,2,5,2,3,2,1,1,1,1,,2,1,2,1,1,1,,1,1,5,1,1,,,1,UMF 8 Aguascalientes,1,1,11.08222260570930000000,2011-06-20,1
753,1,1,UMF 8 Aguascalientes,20,6,11,,11,,11,66,2,4,1,9,2,2,2,1,2,2,4,1,2,4,3,3,1,1,2,1,1,1,2,2,2,1,,2,1,2,1,1,1,1,1,1,1,1,1,2,1,1,2,1,2,2,2,1,2,2,2,2,2,2,,1,,,,2,,,,,,,2,,,1,2,1,1,1,1,2,2,2,2,3,2,1,1,,2,1,2,2,2,1,1,1,1,,2,1,1,1,1,1,,2,,5,2,,,,1,UMF 8 Aguascalientes,1,1,9.56769164489821000000,2011-06-20,1
754,1,1,UMF 8 Aguascalientes,20,6,11,,18,,19,30,1,1,9,2,1,3,3,3,4,4,5,4,5,4,5,1,4,,3,2,2,2,2,,,,,4,1,4,1,1,2,2,1,2,3,1,2,2,2,1,1,1,2,2,2,2,2,2,2,2,2,2,2,4,,,,,,,,,,,2,,,2,1,1,1,1,2,2,1,4,4,4,4,5,,,2,3,4,2,4,2,2,1,2,2,2,3,2,2,,,,,,5,1,2,2,2,1,UMF 8 Aguascalientes,1,1,8.90589793726241000000,2011-06-20,1
755,1,1,UMF 8 Aguascalientes,20,6,11,,16,,16,55,1,2,3,5,1,2,3,2,2,99,99,2,5,2,99,3,1,1,1,2,2,2,2,,,,,2,2,,,1,2,1,2,2,1,1,2,2,1,1,1,1,2,1,2,2,2,2,2,2,2,1,1,2,,1,,,,,,,,1,2,,,2,2,1,2,1,2,2,2,,,,2,2,,,2,2,2,99,2,99,99,99,1,,2,2,2,1,1,1,,1,1,5,1,1,,,1,UMF 8 Aguascalientes,1,1,8.28345247960424000000,2011-06-20,1
756,1,1,UMF 8 Aguascalientes,20,6,11,,17,,18,72,1,2,5,5,1,2,2,2,2,1,4,2,1,4,4,3,1,1,2,2,2,2,2,,,,,2,1,2,1,1,2,1,2,1,,,,,,1,1,1,2,1,2,2,2,2,2,2,2,1,2,2,,1,,,,,,,,2,1,5,1,2,1,1,2,1,2,2,3,,,,3,3,,,3,3,2,3,3,99,99,99,1,,2,1,2,1,1,1,,1,1,5,1,1,,,1,UMF 8 Aguascalientes,1,1,8.07302460102420000000,2011-06-20,1
757,1,1,UMF 8 Aguascalientes,20,6,11,,12,,12,80,2,2,2,1,1,2,2,1,1,4,4,2,2,5,5,3,2,1,3,2,2,2,2,,,,,2,2,,,1,2,1,1,2,,,,,,1,1,1,2,2,2,2,1,2,2,2,2,1,2,3,,,,,2,,,,,2,2,,,99,2,1,2,2,2,1,3,,,,,,,2,2,2,2,2,2,2,1,2,1,,2,2,2,1,1,1,,1,1,5,1,1,,,1,UMF 8 Aguascalientes,1,1,9.56769164489821000000,2011-06-20,1
2398,1,1,UMF 8 Aguascalientes,20,6,11,,8,,9,21,1,2,8,2,2,2,2,2,2,2,5,2,5,5,5,2,2,1,1,1,2,1,1,2,,2,1,3,1,2,2,1,1,2,2,2,,,,,,1,1,1,2,2,2,2,2,2,2,2,2,1,2,2,,,,,,,,,,2,1,1,132,2,1,1,2,1,2,2,2,,,,2,2,,,2,4,4,2,2,2,1,1,1,,2,1,2,1,1,1,,1,1,5,1,1,,,1,UMF 8 Aguascalientes,1,1,8.45485297950078000000,2011-06-20,1
2399,1,1,UMF 8 Aguascalientes,20,6,11,,10,,10,28,1,1,5,1,2,4,2,1,5,5,5,5,1,5,5,1,2,1,2,2,2,2,2,,,,,3,2,,,1,1,2,2,2,,,,,,1,1,1,2,2,2,2,2,2,2,2,2,1,2,2,,,,,,,,,,2,2,,,2,1,1,1,1,2,2,2,5,4,4,4,4,,,4,2,2,2,2,2,2,2,2,2,2,2,2,1,1,1,,1,1,5,1,1,,,1,UMF 8 Aguascalientes,1,1,8.90589793726241000000,2011-06-20,1
2400,1,1,UMF 8 Aguascalientes,20,6,11,,11,,11,20,1,1,6,6,1,1,1,1,5,4,4,2,1,4,5,4,3,,1,2,2,2,2,,,,,3,2,,,1,1,2,2,2,,,,,,1,1,1,2,2,2,2,2,2,2,2,2,1,2,2,,,,,,,,,,1,2,,,2,1,1,2,1,2,2,3,,,,3,2,,,3,4,4,2,2,,,,1,,2,2,2,1,1,1,,1,1,5,1,1,,,1,UMF 8 Aguascalientes,1,1,8.45485297950078000000,2011-06-20,1
2740,1,1,UMF 8 Aguascalientes,20,6,11,,12,,12,31,1,2,5,5,2,2,1,2,4,3,4,2,2,4,4,4,1,1,3,97,2,2,2,,,,,4,2,,,1,1,2,2,2,,,,,,1,1,1,2,2,2,2,2,2,2,2,2,1,2,2,,,,,,,,,,2,2,,,2,1,1,1,1,2,2,2,1,1,2,1,2,,,2,2,2,2,2,1,1,1,1,,2,1,1,1,1,1,,1,1,99,1,1,,,1,UMF 8 Aguascalientes,1,1,8.90589793726241000000,2011-06-20,1
2741,1,1,UMF 8 Aguascalientes,20,6,11,,12,,13,68,2,2,2,9,2,4,2,2,2,5,5,3,2,5,5,3,2,1,2,1,2,2,2,2,,,,3,2,,,1,1,1,2,2,1,1,2,2,2,2,1,1,2,2,2,2,2,2,2,2,2,2,3,5,,,,,,,,,,,2,,,2,1,1,2,1,2,2,3,,,,3,4,,,3,2,2,2,2,2,2,2,2,1,2,2,4,2,,,,,,5,1,2,2,1,1,UMF 8 Aguascalientes,1,1,9.56769164489821000000,2011-06-20,1
2742,1,1,UMF 8 Aguascalientes,20,6,11,,13,,13,66,2,2,7,9,2,2,1,1,2,2,5,2,2,5,5,4,1,1,2,1,1,1,1,2,2,2,2,2,1,2,1,1,1,1,2,1,1,1,2,2,2,1,1,1,2,2,2,2,2,2,2,2,2,1,1,1,,,,,,,,,,1,2,,,2,1,1,2,1,2,2,2,,,,2,5,,,2,2,2,2,2,2,1,1,1,,2,2,2,1,1,1,,1,1,5,1,1,,,1,UMF 8 Aguascalientes,1,1,9.56769164489821000000,2011-06-20,1
2743,1,1,UMF 8 Aguascalientes,20,6,11,,8,,8,20,2,1,8,6,1,2,1,1,1,1,2,1,1,2,2,1,1,1,1,1,1,1,1,2,2,1,1,1,2,,,1,1,2,2,2,3,1,2,2,2,1,1,1,2,2,2,2,2,2,2,2,2,1,2,1,,,,,,,,,,2,1,5,5,1,1,1,2,1,2,2,1,,,,2,2,,,2,2,2,2,2,1,1,1,1,,2,2,1,1,1,1,,1,1,5,1,1,,,1,UMF 8 Aguascalientes,1,1,10.02021301911430000000,2011-06-20,1
2744,1,1,UMF 8 Aguascalientes,20,6,11,,19,,19,37,1,3,3,1,2,2,2,1,1,1,4,1,1,5,4,3,1,1,1,1,1,1,1,2,1,1,1,2,1,1,1,1,2,2,2,2,3,1,2,2,2,1,1,1,2,2,2,1,2,2,2,2,2,1,2,1,,,,3,,,,,,1,1,2,1,2,1,1,2,1,2,2,2,,,,2,2,,,2,2,2,3,2,1,1,1,1,,2,1,1,1,1,1,,1,1,5,1,2,3,1,1,UMF 8 Aguascalientes,1,1,9.35095517816194000000,2011-06-20,1
2745,1,1,UMF 8 Aguascalientes,20,6,11,,9,,9,58,1,2,1,5,2,1,1,1,4,4,3,3,3,3,4,4,1,1,1,1,1,1,2,2,1,1,,1,1,1,1,1,1,1,1,1,2,1,2,2,2,1,1,1,2,2,2,2,2,2,2,2,2,1,2,2,,,,,,,,,,2,2,,,2,2,1,2,1,2,2,2,,,,2,2,,,2,2,2,99,4,1,1,1,1,,2,1,99,1,1,1,,1,1,5,1,1,,,1,UMF 8 Aguascalientes,1,1,8.28345247960424000000,2011-06-20,1
2746,1,1,UMF 8 Aguascalientes,20,6,11,,16,,17,25,1,2,5,4,1,2,2,1,2,2,4,2,2,4,4,4,1,1,2,97,1,1,1,,2,2,2,2,1,2,1,1,1,2,2,2,,,,,,1,1,1,2,2,2,2,2,2,2,2,2,1,2,2,,,,,,,,,,2,1,5,1,1,2,1,2,1,2,2,2,,,,2,2,,,2,3,2,2,2,1,1,2,1,,2,1,1,1,1,1,,1,1,5,1,1,,,1,UMF 8 Aguascalientes,1,1,8.45485297950078000000,2011-06-20,1
2747,1,1,UMF 8 Aguascalientes,20,6,11,,11,,11,83,2,4,3,9,2,4,2,2,3,3,5,4,3,5,5,4,1,1,1,1,1,1,2,4,2,2,,1,1,1,1,1,1,1,2,1,3,1,2,2,2,2,1,1,2,2,2,2,2,2,2,2,2,1,4,2,,,,,,,,,,3,2,,,1,1,1,2,1,2,2,2,,,,2,2,,,2,2,2,2,2,2,2,2,1,,2,2,2,1,2,2,3,2,,5,1,2,4,4,1,UMF 8 Aguascalientes,1,1,9.56769164489821000000,2011-06-20,1
2748,1,1,UMF 8 Aguascalientes,20,6,11,,15,,15,24,2,2,3,1,1,2,2,2,1,1,2,1,1,3,3,1,1,1,3,2,2,2,2,,,,,2,1,2,2,2,2,1,2,1,,,,,,2,1,1,1,2,2,2,2,2,2,2,1,1,2,3,2,,,,,,,,2,2,2,,,2,1,1,1,1,2,2,2,2,2,4,2,2,,,2,2,2,99,99,,,,1,,2,3,2,1,1,1,,1,1,5,2,,,,1,UMF 8 Aguascalientes,1,1,10.02021301911430000000,2011-06-20,1
2749,1,1,UMF 8 Aguascalientes,20,6,11,,18,,18,18,2,1,5,1,2,2,97,99,1,2,2,1,1,5,2,1,1,1,3,1,1,1,1,2,2,2,2,1,1,1,1,1,1,1,1,1,,,,,,1,1,1,2,2,2,2,2,2,2,2,2,1,2,1,,,,,,,,,,2,1,8,1,2,2,1,2,1,2,2,1,,,,1,1,,,1,1,1,1,1,99,99,99,1,,2,1,1,1,1,1,,1,1,1,2,,,,1,UMF 8 Aguascalientes,1,1,10.02021301911430000000,2011-06-20,1
2750,1,1,UMF 8 Aguascalientes,20,6,11,,17,,17,60,2,2,3,4,2,1,2,2,1,1,99,1,1,2,99,4,1,1,1,1,1,1,1,1,1,1,1,1,1,1,1,1,1,1,1,1,2,1,1,2,1,1,1,1,2,2,2,2,2,2,1,2,2,1,1,1,,,,,,,1,,,1,2,,,2,2,1,1,1,2,2,1,1,1,4,1,2,,,1,1,1,1,1,,,,1,,2,1,1,1,1,1,,1,1,5,2,,,,1,UMF 8 Aguascalientes,1,1,9.81707885170648000000,2011-06-20,1
2751,1,1,UMF 8 Aguascalientes,20,6,11,,16,,16,30,1,2,9,2,2,2,99,1,1,2,4,2,4,4,4,4,1,1,2,97,97,97,97,,,,,1,1,1,1,1,2,1,2,1,4,1,2,2,2,1,1,1,2,2,2,2,2,2,2,2,2,1,2,2,,,,,,,,,,3,2,,,1,2,1,2,1,2,2,2,,,,2,4,,,2,3,2,2,2,1,1,1,1,,2,1,2,1,2,1,,1,1,5,1,2,1,1,1,UMF 8 Aguascalientes,1,1,8.90589793726241000000,2011-06-20,1
2752,1,1,UMF 8 Aguascalientes,20,6,11,,14,,14,31,1,2,3,5,2,2,2,1,3,3,5,3,3,3,5,4,1,1,1,1,1,1,1,2,2,2,2,1,2,,,1,1,2,2,1,,,,,,1,1,1,2,2,1,2,2,2,2,2,2,1,2,1,,,1,,,,,,,2,1,4,998,2,2,1,2,1,2,2,2,,,,1,2,,,1,1,1,1,1,3,2,2,1,,2,2,2,1,1,1,,1,1,5,1,2,3,3,1,UMF 8 Aguascalientes,1,1,8.90589793726241000000,2011-06-20,1
2753,1,1,UMF 8 Aguascalientes,20,6,11,,15,,15,36,2,2,5,2,2,2,1,1,1,5,5,2,1,5,5,1,1,1,1,2,1,2,2,,2,,,1,1,1,1,2,2,1,2,2,1,1,2,2,2,1,1,1,2,2,2,2,2,2,2,2,2,1,4,1,,,,,,,,,,2,2,,,1,2,1,2,1,2,2,2,,,,2,2,,,2,2,2,2,2,1,1,1,1,,2,1,2,1,1,1,,1,1,5,1,1,,,1,UMF 8 Aguascalientes,1,1,11.08222260570930000000,2011-06-20,1
2754,1,1,UMF 8 Aguascalientes,20,6,11,,14,,15,22,1,2,7,4,1,3,2,1,2,2,5,4,4,99,99,1,1,1,2,1,1,1,1,2,2,2,2,2,1,1,1,1,1,2,2,2,,,,,,1,1,1,2,2,2,2,2,2,2,2,2,1,2,2,,,,,,,,,,2,2,,,2,2,1,2,1,2,2,2,,,,2,4,,,2,2,2,2,2,1,1,2,1,,2,1,2,1,1,1,,1,1,5,1,1,,,1,UMF 8 Aguascalientes,1,1,8.45485297950078000000,2011-06-20,1
2755,1,1,UMF 8 Aguascalientes,20,6,11,,14,,14,62,1,2,2,5,2,2,2,1,2,2,4,2,2,4,4,4,1,1,1,1,2,2,2,2,,,,2,2,,,1,1,2,2,2,,,,,,1,1,1,2,2,2,2,2,2,2,2,2,1,1,1,,,,,,,,,,1,2,,,2,2,1,2,1,2,2,1,,,,1,4,,,2,1,1,3,2,,,,1,,2,2,2,1,1,1,,1,1,5,1,1,,,1,UMF 8 Aguascalientes,1,1,8.28345247960424000000,2011-06-20,1
2756,1,1,UMF 8 Aguascalientes,20,6,11,,11,,11,28,1,2,5,5,2,3,2,1,4,4,5,2,5,4,5,3,2,1,2,1,1,1,1,2,2,1,1,2,1,2,1,1,1,2,2,2,,,,,,1,1,1,2,2,2,2,2,2,2,2,2,2,1,2,,,,,,,,,,,2,,,2,1,1,1,1,2,2,2,5,4,5,5,5,,,3,2,2,2,2,2,2,2,2,1,2,3,4,2,,,,,,5,1,1,,,1,UMF 8 Aguascalientes,1,1,8.90589793726241000000,2011-06-20,1
2757,1,1,UMF 8 Aguascalientes,20,6,11,,9,,10,34,1,2,8,5,1,4,2,2,4,4,4,4,99,4,4,1,2,1,3,1,2,1,2,4,,2,,2,1,3,1,1,2,2,2,2,,,,,,1,1,1,2,2,2,2,2,2,2,2,2,1,2,2,,,,,,,,,,2,2,,,2,1,1,1,1,2,2,2,4,4,5,2,2,,,4,2,2,3,3,2,2,2,2,2,2,2,4,1,1,1,,1,1,5,1,1,,,1,UMF 8 Aguascalientes,1,1,8.90589793726241000000,2011-06-20,1
2758,1,1,UMF 8 Aguascalientes,20,6,11,,9,,9,39,1,1,7,4,1,1,1,1,2,2,4,2,2,4,4,3,1,1,2,2,2,2,2,,,,,2,2,,,1,1,2,2,2,,,,,,1,1,1,2,2,2,2,2,2,2,2,2,1,3,3,,,,,,,,,,2,2,,,2,1,1,2,1,2,2,2,,,,2,2,,,2,2,2,2,2,2,2,2,1,,2,2,2,1,1,1,,1,1,5,1,1,,,1,UMF 8 Aguascalientes,1,1,9.35095517816194000000,2011-06-20,1
2759,1,1,UMF 8 Aguascalientes,20,6,11,,19,,19,21,1,2,5,5,1,2,1,1,1,1,1,1,1,1,1,4,1,1,1,1,1,1,1,1,1,1,1,1,1,1,1,1,2,1,1,1,,,,,,1,1,1,2,2,2,1,2,2,2,2,2,1,2,1,,,,2,,,,,,2,2,,,2,1,1,2,1,1,2,1,,,,1,1,1,,1,1,1,1,1,2,2,2,1,,2,1,2,1,1,3,3,,,5,1,3,2,5,1,UMF 8 Aguascalientes,1,1,8.45485297950078000000,2011-06-20,1
2760,1,1,UMF 8 Aguascalientes,20,6,11,,13,,13,50,1,2,1,5,2,2,2,2,3,3,3,3,1,1,1,4,1,1,1,1,2,1,2,3,,3,,1,1,1,1,1,1,1,1,1,,,,,,1,1,1,2,2,2,2,2,1,1,1,1,1,2,2,,,,,,2,2,2,2,1,2,,,1,1,1,2,1,2,2,1,,,,2,2,,,2,2,2,2,2,1,1,1,1,,2,2,2,1,1,1,,1,1,5,1,1,,,1,UMF 8 Aguascalientes,1,1,8.73591294358119000000,2011-06-20,1
2761,1,1,UMF 8 Aguascalientes,20,6,11,,12,,12,18,2,1,5,10,1,1,99,2,1,1,2,1,1,2,2,2,1,1,3,1,1,1,2,1,1,1,,1,1,2,1,1,1,2,2,1,1,1,1,2,1,1,1,1,2,2,2,2,1,2,1,2,2,1,1,1,,,,,1,,1,,,1,2,,,1,1,1,2,1,1,1,2,,,,2,2,1,1,1,1,1,1,1,2,1,1,1,,2,1,2,1,1,1,,1,1,5,1,1,,,1,UMF 8 Aguascalientes,1,1,10.02021301911430000000,2011-06-20,1
2762,1,1,UMF 8 Aguascalientes,20,6,11,,11,,11,20,1,2,5,2,2,3,2,1,4,4,5,3,3,5,5,3,2,1,2,2,2,2,2,,,,,2,1,3,1,1,1,2,2,2,,,,,,2,1,1,1,2,2,2,2,2,1,2,2,1,2,4,3,,,,,,2,,,1,1,5,1,2,2,1,2,1,2,2,2,,,,2,2,,,2,1,2,2,2,2,2,2,1,,2,1,3,1,2,1,,1,1,5,1,1,,,1,UMF 8 Aguascalientes,1,1,8.45485297950078000000,2011-06-20,1
2763,1,1,UMF 8 Aguascalientes,20,6,11,,10,,10,35,1,2,9,5,1,5,3,1,1,5,5,2,2,5,5,1,1,3,2,1,1,1,2,4,2,2,,2,1,4,1,2,2,2,2,1,1,1,1,2,2,1,1,1,2,2,2,2,2,2,2,2,2,1,2,2,,,,,,,,,,2,1,5,1,1,1,1,2,1,2,2,2,,,,1,1,,,1,1,1,1,1,99,2,1,1,,2,1,2,1,1,1,,1,1,5,1,1,,,1,UMF 8 Aguascalientes,1,1,9.35095517816194000000,2011-06-20,1
2764,1,1,UMF 8 Aguascalientes,20,6,11,,10,,10,31,2,2,5,2,2,2,1,1,3,5,5,2,4,5,5,2,2,3,2,1,2,1,1,4,,2,2,2,2,,,1,1,2,2,2,1,2,2,1,2,1,1,1,2,2,1,2,2,2,2,2,2,1,1,2,,,2,,,,,,,2,1,2,6,1,2,1,2,1,2,2,2,,,,2,4,,,2,2,2,99,99,99,99,99,1,,2,1,99,1,1,1,,1,1,1,2,,,,1,UMF 8 Aguascalientes,1,1,10.55476596390550000000,2011-06-20,1
2765,1,1,UMF 8 Aguascalientes,20,6,11,,18,,18,21,1,1,2,7,2,1,1,2,2,2,4,2,1,4,4,4,1,1,2,1,2,1,1,1,,1,1,1,1,2,1,1,1,2,2,2,,,,,,1,1,1,2,2,2,2,2,2,2,2,2,1,2,1,,,,,,,,,,2,1,1,2,2,1,1,1,1,2,2,1,2,2,5,3,2,,,2,2,2,2,2,1,1,2,1,,2,2,2,1,1,2,3,1,2,5,2,,,,1,UMF 8 Aguascalientes,1,1,8.45485297950078000000,2011-06-20,1
2766,1,1,UMF 8 Aguascalientes,20,6,11,,8,,8,46,1,2,2,5,1,2,2,2,2,2,2,2,2,2,2,1,1,1,2,1,1,1,1,2,2,2,2,1,1,1,1,1,1,1,2,1,1,1,1,2,1,1,1,1,2,2,1,1,2,2,2,2,2,1,1,1,,,1,2,,,,,,1,2,,,2,1,1,2,1,1,2,1,,,,1,1,2,,1,1,1,1,99,1,1,1,1,,2,2,1,1,1,1,,1,1,5,1,1,,,1,UMF 8 Aguascalientes,1,1,8.73591294358119000000,2011-06-20,1
2767,1,1,UMF 8 Aguascalientes,20,6,11,,9,,9,35,1,2,9,5,2,1,1,1,2,2,4,1,1,2,4,4,1,1,3,2,1,2,2,,2,,,4,1,2,1,1,1,2,2,1,,,,,,1,1,1,2,1,2,2,1,2,2,2,2,1,2,2,,2,,,2,,,,,2,2,,,1,1,1,2,1,2,1,2,,,,2,1,,3,2,2,2,99,99,99,99,99,1,,2,1,2,1,1,1,,1,1,1,2,,,,1,UMF 8 Aguascalientes,1,1,9.35095517816194000000,2011-06-20,1
4225,1,1,UMF 8 Aguascalientes,20,6,11,,8,,8,28,2,2,4,10,1,5,2,2,2,1,5,2,2,5,5,2,1,1,1,2,2,1,2,,,5,,4,1,4,1,1,1,2,2,2,1,1,2,2,2,1,1,1,2,2,2,2,2,2,2,2,2,1,3,3,,,,,,,,,,2,2,,,2,2,1,2,1,2,2,2,,,,2,2,,,3,2,2,2,2,3,2,2,1,,2,2,2,1,1,1,,1,1,5,1,1,,,1,UMF 8 Aguascalientes,1,1,10.55476596390550000000,2011-06-20,1
4401,1,1,UMF 8 Aguascalientes,20,6,11,,14,,15,48,2,2,7,10,1,3,2,2,1,3,3,2,3,5,4,4,2,1,1,2,2,1,1,,,1,1,2,1,2,1,1,1,1,1,1,,,,,,1,1,1,2,2,2,2,2,2,2,2,2,1,3,1,,,,,,,,,,4,1,5,998,1,1,1,1,1,2,2,3,4,4,5,4,5,,,4,2,2,2,2,2,2,2,2,5,2,3,2,1,2,1,,1,1,5,1,1,,,1,UMF 8 Aguascalientes,1,1,10.35330937431510000000,2011-06-20,1
4402,1,1,UMF 8 Aguascalientes,20,6,11,,17,,17,26,2,2,5,2,2,1,2,2,4,4,4,2,2,2,2,3,2,1,1,2,2,2,2,,,,,2,1,1,1,1,1,2,2,2,1,1,2,2,2,1,1,1,2,2,2,2,2,2,2,2,2,1,1,1,,,,,,,,,,2,1,2,8,2,1,1,2,1,2,2,2,,,,2,2,,,2,4,2,2,4,2,2,2,1,,2,1,2,1,1,1,,1,1,2,1,1,,,1,UMF 8 Aguascalientes,1,1,10.55476596390550000000,2011-06-20,1
4403,1,1,UMF 8 Aguascalientes,20,6,11,,18,,18,33,1,2,5,5,2,2,2,2,2,2,2,1,4,4,4,1,2,1,2,1,2,1,2,2,,2,,2,1,2,1,1,1,1,1,1,,,,,,1,1,1,2,2,2,2,2,2,2,2,2,1,1,1,,,,,,,,,,1,2,,,2,2,1,2,1,2,2,2,,,,2,2,,,2,2,2,2,2,99,99,99,1,,2,2,2,1,1,1,,1,1,5,1,1,,,1,UMF 8 Aguascalientes,1,1,8.90589793726241000000,2011-06-20,1