Folio,Deleg,Unidmed,Id_Unid,Fecha_D,Fecha_M,Fecha_A,Hr_Ini_H,Hr_Ini_M,Hr_Fin_H,Hr_Fin_M,Nivel,Delegad_Edo,Delegad_Mun,Edad,Sexo,Edocivi,Escolar,Ocupa,Ingreso,Traimss,Sat1,Sat3,Unidad1,Motcons2,Tiem_Esp,Retro,Prospe,Filtroch,Consulta,Preosad,Tmsalud,Mhclinc,Expclaa_A,Expclaa_B,Expclaa_C,Expclaa_D,Expclab_A,Expclab_B,Expclab_C,Expclab_D,Mopin,Explora,Cexplora,Mexapriv,Prevenf_A,Prevenf_B,Prevenf_C,Prevenf_D,Prevmed,Filtrourg,Calteurg,Mottesp,Tespurg,Servurg,Tobscama,Pregurg,Expurg,Clarurg,Infofamur,Califurg,Filtrocir,Progciru,Topera,Fechaop,Suspop3,Suspop1,Suspop4,Motoper,Motoper1,Infofam,Oportiff,Calciru,Filtrohos,Nochesh,Frecrevm,Asisenf,Infamho,Opinfhos,Horarioh,Acchosp_A,Acchosp_B,Acchosp_C,Acchosp_D,Acchosp_E,Acchosp_F,Acchosp_G,Calhosp,Filtrosaux,Temsad,Saduni,Satlarx,Btratou,Calfatna_A,Calfatna_B,Calfatna_C,Calfatna_D,Calfatna_E,Calfatna_F,Calfatna_G,Calfatna_H,Calfatna_I,Calfatna_J,Calfatna_K,Calfatna_L,Calfatna_M,Calfatna_N,Calfatnb_A,Calfatnb_B,Calfatnb_C,Calfatnb_D,Calfatnb_E,Calfatnb_F,Calfatnb_G,Calfatnb_H,Calfatnb_I,Calfatnb_J,Calfatnb_K,Calfatnb_L,Calfatnb_M,Calfatnb_N,Infimss,Finfimss,Continf,Cartel,Calfinma_A,Calfinma_B,Calfinma_C,Calfinma_D,Calfinma_E,Calfinmb_A1,Calfinmb_B1,Calfinmb_B2,Calfinmb_B3,Calfinmb_C1,Calfinmb_C2,Calfinmb_D1,Calfinmb_E1,Calfinmb_F,Calfinmb_G,Calfinmb_H,Calfinmb_I,Calfinmb_J,Ordylim1,Ordylim2,Recomuni,Norecom,Corrup,Atn1fam,Caqod,Sat2,Filtrofarm,Tfarsurt,Totmed,Acnomed,Raznosurt,Versurt,Versurt2,Farm1,Farm2,Farm3,Farm4,Confi1_A,Confi1_B,Confi1_C,Confi1_D,Confi1_E,Confi1_F,Confi1_G,Id_Unidad,Cve_Delegaci�N,Delegaci�N,Umae,Promedio_Diario2011,Estrato,Moscondia,Fe_Finalnr,Fecha,Entidad
204,14,Hospital de Especialidades No. 1 Le�n,3011,12,9,12,16,5,16,26,3,1,1,37,2,2,5,10,2,1,1,2,1,1,3,1,1,1,1,1,1,1,1,1,1,1,2,2,2,2,1,1,2,1,1,1,1,2,1,2,,,,,,,,,,,2,,,,,,,,,,,,2,,,,,,,,,,,,,,,1,2,1,2,1,1,1,1,2,2,1,2,2,2,2,1,1,2,2,2,2,2,,,2,,,,,2,2,,,2,,,2,1,1,1,2,2,2,4,4,4,2,2,,,2,2,2,2,2,3,2,1,,2,99,3,2,2,,,,,,,2,,,,1,2,5,2,1,3,5,3011,14,Guanajuato,Hospital de,1050,1,1,3.64583333333333000000,2012-09-12,11
11,17,Hospital de Especialidades Oblatos,3013,29,8,12,15,45,16,8,3,1,1,36,2,2,5,4,1,3,1,1,1,5,1,1,2,1,2,1,1,1,1,1,1,1,1,1,1,1,1,1,1,1,1,1,1,1,1,2,,,,,,,,,,,1,2,5,1,,,,9,10,1,1,1,2,,,,,,,,,,,,,,,1,1,2,2,1,1,2,1,2,1,1,2,2,1,2,2,1,2,2,1,,1,,1,1,,,1,,,1,,,2,,,2,2,1,1,2,2,,3,2,4,4,2,,,2,2,2,2,2,3,2,1,,2,2,1,1,2,,,,,,,2,,,,1,4,5,1,2,5,5,3013,17,Jalisco,Hospital de,919,1,1,4.35545023696682000000,2012-08-29,14
145,14,Hospital de Especialidades No. 1 Le�n,3011,12,9,12,12,55,13,18,3,1,1,39,1,2,7,5,4,3,2,2,2,5,2,1,1,1,2,1,1,1,1,1,1,1,2,2,2,2,1,2,,,2,2,2,2,1,1,2,,1,1,4,1,1,2,1,2,1,1,6,2,5,1,180,3,15,2,2,2,1,2,3,1,2,2,2,2,1,2,1,2,2,2,2,1,4,1,2,1,1,1,1,1,1,2,2,2,2,1,2,1,2,2,2,2,2,2,2,,,,,2,,2,,,2,,,1,1,1,1,2,2,2,2,2,2,2,2,,,2,4,2,2,4,1,1,1,,2,2,1,2,2,,,,,,,2,,,,1,1,4,1,1,5,4,3011,14,Guanajuato,Hospital de,1050,1,1,3.64583333333333000000,2012-09-12,11
73,14,Hospital de Especialidades No. 1 Le�n,3011,12,9,12,10,53,11,6,3,11,11,54,1,2,1,4,2,4,2,2,2,5,2,3,2,1,2,2,1,1,1,1,1,1,2,2,2,2,1,1,2,1,1,1,1,1,1,1,5,2,4,2,,1,1,3,2,5,1,2,4,1,,,,4,8,3,2,3,1,30,4,1,2,2,2,2,2,2,2,2,2,2,3,1,1,1,2,1,1,2,1,2,2,2,2,2,2,2,2,2,2,1,2,,2,,,,,,,,,,,2,2,,,1,1,1,1,2,2,2,2,3,5,2,2,,,2,2,2,2,2,2,1,1,,2,1,2,2,1,1,1,,,1,1,1,1,,,2,2,5,2,1,1,5,3011,14,Guanajuato,Hospital de,1050,1,1,3.64583333333333000000,2012-09-12,11
85,10,Hospital de Especialidades Siglo XXI,3006,29,8,12,11,55,12,10,3,2,13,46,2,1,7,9,5,4,2,4,2,1,3,1,1,1,2,2,3,2,1,1,1,1,1,2,2,2,3,2,,,1,1,1,1,1,2,,,,,,,,,,,2,,,,,,,,,,,,2,,,,,,,,,,,,,,,1,2,1,2,1,2,2,1,2,2,2,1,2,2,2,2,2,2,2,,,1,,,,2,,,,,,,,2,,,1,1,1,1,1,2,2,4,4,5,2,5,2,,2,2,2,99,99,3,2,1,,2,1,2,2,2,,,,,,,1,2,3,4,2,2,4,2,5,5,5,3006,10,D.F. Sur,Hospital de,998,1,1,5.14432989690722000000,2012-08-29,9
62,17,Hospital de Especialidades Oblatos,3013,29,8,12,14,35,15,10,3,3,20,48,1,2,5,1,2,4,4,1,1,2,1,2,2,1,2,1,1,1,1,1,1,1,1,1,1,1,1,1,1,1,1,1,1,1,1,2,,,,,,,,,,,1,2,1,1,,,,12,998,1,1,1,1,7,2,1,1,1,1,2,2,2,2,97,2,2,1,1,1,1,1,1,2,2,1,1,1,2,1,2,2,1,1,1,2,1,,,1,1,1,,1,,,1,2,2,,1,2,,,1,2,1,2,2,2,,2,2,5,,,,,2,2,2,2,2,2,1,1,,2,2,99,3,1,1,1,,,2,,2,,,,1,5,5,4,5,5,5,3013,17,Jalisco,Hospital de,919,1,1,4.35545023696682000000,2012-08-29,14
88,32,Hospital de Especialidades No. 14 Veracruz,3022,12,9,12,8,17,8,34,3,21,30,69,2,2,8,10,3,4,2,2,2,1,2,1,1,1,2,2,2,1,1,1,1,1,2,2,1,2,2,1,2,1,1,1,1,2,1,2,,,,,,,,,,,2,,,,,,,,,,,,2,,,,,,,,,,,,,,,1,3,1,2,1,1,2,1,2,2,2,2,2,2,2,2,2,2,1,2,,2,,,,,,,,,,,2,2,,,2,1,2,1,2,2,2,,,,2,2,,,2,2,2,2,2,97,,1,,2,2,1,2,1,2,1,,,1,1,1,1,,,2,3,2,2,2,3,2,3022,32,Veracruz Norte,Hospital de,784,1,1,2.59602649006623000000,2012-09-12,30
9,7,Hospital de Especialidades No. 71 Torre�n,3001,29,8,12,10,33,10,45,3,5,41,51,2,2,7,1,3,4,1,1,2,5,1,1,1,1,99,99,,99,1,2,2,2,1,,,,1,2,,,2,2,2,2,2,2,,,,,,,,,,,2,,,,,,,,,,,,2,,,,,,,,,,,,,,,2,,,,1,1,2,2,2,2,2,2,2,2,2,2,2,2,2,1,,,,,,,,,,,,,,2,,,1,1,2,2,2,2,1,,,,,,,,1,1,1,1,1,3,2,1,,2,2,1,1,2,,,,,,,2,,,,1,2,1,1,1,3,5,3001,7,Coahuila,Hospital de,398,1,1,2.38323353293413000000,2012-08-29,5
11,7,Hospital de Especialidades No. 71 Torre�n,3001,29,8,12,10,59,11,10,3,5,41,40,1,2,3,5,3,4,2,2,2,5,1,2,1,1,2,1,1,1,1,2,2,2,1,,,,1,2,,,1,1,1,1,2,1,1,,1,1,1,1,2,,2,1,1,2,99,1,,,,999,6,2,2,2,2,,,,,,,,,,,,,,,2,,,,1,1,2,1,2,2,2,2,2,2,2,2,2,2,2,1,,1,,,,,,,,,,,,2,,,2,1,2,1,2,2,1,,,,1,1,,,1,1,1,1,1,3,2,1,,2,2,2,2,2,,,,,,,2,,,,1,2,5,1,1,2,4,3001,7,Coahuila,Hospital de,398,1,1,2.38323353293413000000,2012-08-29,5
110,7,Hospital de Especialidades No. 71 Torre�n,3001,29,8,12,14,45,15,0,3,5,41,60,1,2,3,5,1,99,1,1,1,988,1,1,1,2,,,,,,,,,,,,,,,,,,,,,,2,,,,,,,,,,,1,1,1,1,,,,1,11,1,1,2,1,3,5,2,99,,1,1,1,2,1,1,1,1,1,2,,,,1,1,1,1,2,1,2,2,2,2,2,2,1,2,2,1,1,1,,1,,,,,,,1,,,2,,,2,1,1,1,2,2,1,1,1,1,1,1,,,1,1,1,1,1,1,1,1,,2,2,1,1,1,1,2,2,999,2,,1,1,,,1,1,1,1,1,1,1,3001,7,Coahuila,Hospital de,398,1,1,2.38323353293413000000,2012-08-29,5
121,7,Hospital de Especialidades No. 71 Torre�n,3001,29,8,12,14,30,14,50,3,5,41,62,1,2,1,5,3,3,1,1,1,1,1,1,1,1,2,1,1,1,1,2,1,1,2,,2,2,1,1,1,1,1,1,1,1,1,1,1,,1,2,,1,1,2,1,1,1,2,1,1,,,,13,11,1,1,1,1,2,5,1,2,1,1,2,1,1,2,1,2,2,1,1,3,1,2,1,1,2,1,2,1,1,1,2,2,2,2,2,2,2,1,,1,,1,1,1,,,,,,,,1,1,1,1,1,2,1,2,2,1,,,,1,1,,,2,2,2,2,2,2,1,1,,2,2,1,1,2,,,,,,,1,1,,,1,1,3,1,3,4,4,3001,7,Coahuila,Hospital de,398,1,1,2.38323353293413000000,2012-08-29,5
140,7,Hospital de Especialidades No. 71 Torre�n,3001,29,8,12,12,15,12,38,3,5,49,63,1,2,2,1,4,3,2,1,2,5,2,1,1,1,2,1,1,1,1,1,2,2,1,1,,,1,1,2,1,1,1,1,1,1,2,,,,,,,,,,,2,,,,,,,,,,,,2,,,,,,,,,,,,,,,1,1,1,1,1,1,1,1,2,2,2,2,2,2,2,2,2,2,2,1,1,1,,,,,,,,,,,,2,,,2,1,1,1,1,1,1,2,2,2,1,1,1,1,99,99,99,99,99,1,1,1,,2,99,1,2,2,,,,,,,2,,,,1,1,3,3,4,4,5,3001,7,Coahuila,Hospital de,398,1,1,2.38323353293413000000,2012-08-29,5
20,7,Hospital de Especialidades No. 71 Torre�n,3001,29,8,12,14,15,14,26,3,5,49,39,1,2,9,10,4,4,1,1,2,6,1,1,1,1,2,1,1,1,1,2,2,2,1,,,,1,1,2,1,1,1,1,1,2,2,,,,,,,,,,,1,3,1,1,,,,3,6,1,1,1,1,2,4,1,1,1,1,2,2,2,2,2,2,2,1,1,2,2,1,1,1,2,1,2,2,2,2,2,2,2,2,2,2,2,1,,1,,,,,,,,,,,,2,,,1,1,2,2,2,2,1,,,,,,,,1,1,1,1,3,3,2,1,,2,2,1,1,2,,,,,,,2,,,,1,2,2,1,1,4,5,3001,7,Coahuila,Hospital de,398,1,1,2.38323353293413000000,2012-08-29,5
61,7,Hospital de Especialidades No. 71 Torre�n,3001,29,8,12,12,20,12,32,3,5,50,66,2,2,5,1,2,1,2,1,2,5,1,2,99,2,,,,,,,,,,,,,,,,,,,,,,2,,,,,,,,,,,2,,,,,,,,,,,,2,,,,,,,,,,,,,,,2,,,,1,1,2,1,2,2,2,2,2,2,2,2,2,2,2,1,,1,,,,,,,,,,,,2,,,1,1,2,1,2,2,2,,,,1,2,,,2,2,2,2,2,1,1,1,,2,1,2,2,1,2,1,,,2,,1,1,,,1,1,3,2,5,5,5,3001,7,Coahuila,Hospital de,398,1,1,2.38323353293413000000,2012-08-29,5
207,21,Hospital de Gineco-Obstetricia No. 23 Monterrey,3017,11,9,12,10,49,11,3,3,5,50,31,1,2,9,2,3,4,2,2,2,988,2,2,2,1,2,1,1,1,1,2,1,1,2,,2,2,2,1,2,2,1,1,1,2,1,2,,,,,,,,,,,2,,,,,,,,,,,,2,,,,,,,,,,,,,,,1,3,1,2,1,1,1,1,2,1,2,2,2,2,2,1,2,2,1,4,2,2,,2,,,,,,2,,,2,2,,,2,1,1,1,2,2,2,4,4,3,2,4,,,2,2,2,2,2,3,2,1,,2,1,2,2,1,1,1,,,1,1,1,1,,,1,2,5,2,1,5,5,3017,21,Nuevo Le�n,Hospital de,670,1,1,3.28431372549020000000,2012-09-11,19
303,21,Hospital de Traumatolog�a y Ortopedia No. 21 Monterrey,3016,10,9,12,11,24,11,42,3,5,50,65,1,2,3,5,2,2,2,2,1,5,2,2,2,2,,,,,,,,,,,,,,,,,,,,,,2,,,,,,,,,,,2,,,,,,,,,,,,2,,,,,,,,,,,,,,,1,1,1,2,1,1,2,1,2,2,2,2,2,2,2,2,2,2,2,2,,2,,,,,,,,,,,,1,3,8,2,1,2,2,2,2,2,,,,,,,,2,2,2,2,2,2,2,1,,2,2,3,2,1,1,1,,,1,1,1,1,,,2,2,2,2,3,3,3,3016,21,Nuevo Le�n,Hospital de,676,1,1,2.87659574468085000000,2012-09-10,19
32,34,Hospital de Especialidades No. 1 M�rida,3023,29,8,12,14,52,15,10,3,31,50,59,1,2,7,2,3,1,2,2,2,1,2,1,2,2,,,,,,,,,,,,,,,,,,,,,,2,,,,,,,,,,,2,,,,,,,,,,,,2,,,,,,,,,,,,,,,1,3,1,2,1,1,2,1,2,2,2,1,1,2,2,2,2,2,2,5,,2,,,,2,2,,,,,,,2,,,99,2,1,1,2,2,,1,2,5,1,2,,,3,2,5,2,4,1,1,1,,2,1,1,3,2,,,,,,,2,,,,5,5,5,4,2,5,5,3023,34,Yucat�n,Hospital de,227,1,1,2.22549019607843000000,2012-08-29,31
53,34,Hospital de Especialidades No. 1 M�rida,3023,29,8,12,15,38,16,0,3,31,50,54,2,2,3,2,2,1,2,2,2,1,3,2,99,1,2,2,1,1,2,2,2,2,,,,,2,2,,,1,1,1,1,1,2,,,,,,,,,,,2,,,,,,,,,,,,2,,,,,,,,,,,,,,,1,4,1,2,1,2,1,2,2,2,2,2,1,2,2,2,2,2,2,,2,,,,,,2,,,,,,,2,,,2,2,1,1,2,1,,4,2,2,2,2,,2,2,1,2,2,2,2,1,1,,2,2,2,2,2,,,,,,,2,,,,2,2,5,2,1,2,5,3023,34,Yucat�n,Hospital de,227,1,1,2.22549019607843000000,2012-08-29,31
3,34,Hospital de Especialidades No. 1 M�rida,3023,29,8,12,10,4,10,35,3,31,50,35,2,2,8,2,1,1,2,2,2,6,1,2,3,1,2,1,1,2,1,2,1,1,4,,1,2,1,1,2,1,2,2,2,2,1,2,,,,,,,,,,,2,,,,,,,,,,,,2,,,,,,,,,,,,,,,1,1,2,2,1,2,1,1,2,2,2,2,2,2,2,2,2,1,1,,2,1,,,,,,,,,,2,2,2,,,2,1,2,1,2,2,2,,,,2,2,,,2,2,2,99,2,97,,1,,2,2,1,2,1,1,1,,,1,1,1,1,,,1,2,5,1,1,1,5,3023,34,Yucat�n,Hospital de,227,1,1,2.22549019607843000000,2012-08-29,31
51,34,Hospital de Especialidades No. 1 M�rida,3023,29,8,12,16,45,16,58,3,31,50,34,2,2,5,4,3,1,1,1,2,2,2,1,1,1,1,1,1,1,1,1,1,1,2,2,2,1,2,1,1,1,1,1,1,1,1,2,,,,,,,,,,,2,,,,,,,,,,,,1,7,4,4,1,2,1,2,2,2,2,2,2,2,1,2,,,,1,2,2,2,1,1,2,2,2,2,2,1,2,2,2,,,,2,2,,,,,,1,,,,2,,,1,2,1,1,2,2,,1,2,2,2,99,,,2,1,1,2,2,2,2,1,,2,1,3,2,2,,,,,,,2,,,,1,4,4,1,4,2,2,3023,34,Yucat�n,Hospital de,227,1,1,2.22549019607843000000,2012-08-29,31
17,34,Hospital de Especialidades No. 1 M�rida,3023,29,8,12,17,25,17,45,3,31,50,31,2,2,3,4,3,1,2,2,2,6,1,2,2,1,2,1,1,1,1,2,1,1,2,,2,2,1,1,1,1,2,2,2,2,1,2,,,,,,,,,,,2,,,,,,,,,,,,2,,,,,,,,,,,,,,,1,1,1,2,1,2,2,1,2,2,2,1,1,2,2,2,2,1,1,,,2,,,,2,2,,,,,2,2,2,,,1,1,1,1,2,1,1,2,2,1,1,1,,2,2,1,2,2,2,2,1,1,,2,2,1,1,1,1,1,,,1,1,2,,,,1,1,1,1,1,1,2,3023,34,Yucat�n,Hospital de,227,1,1,2.22549019607843000000,2012-08-29,31
57,34,Hospital de Especialidades No. 1 M�rida,3023,29,8,12,17,15,17,33,3,31,50,45,1,4,6,9,1,1,4,4,2,5,99,2,2,1,2,99,,99,2,2,2,2,,,,,3,2,,,2,2,1,2,1,2,,,,,,,,,,,2,,,,,,,,,,,,2,,,,,,,,,,,,,,,1,1,2,1,2,2,2,2,2,1,2,2,2,2,2,2,2,2,1,,,,,2,,,,,,,,,1,2,,,2,2,1,2,2,2,,99,99,99,,,,,5,2,2,4,4,2,2,1,,2,2,2,4,2,,,,,,,2,,,,2,5,5,2,2,5,5,3023,34,Yucat�n,Hospital de,227,1,1,2.22549019607843000000,2012-08-29,31
16,34,Hospital de Especialidades No. 1 M�rida,3023,29,8,12,16,3,16,34,3,31,50,71,1,1,1,9,2,2,1,4,2,6,3,2,2,1,2,1,1,1,1,2,1,1,1,,2,2,1,2,,,1,2,1,2,2,2,,,,,,,,,,,2,,,,,,,,,,,,2,,,,,,,,,,,,,,,1,4,1,2,1,1,1,1,2,2,1,1,2,2,2,2,2,2,1,2,2,1,,,1,1,,,,,,,1,2,,,2,1,2,1,1,2,2,,,,2,99,2,,2,2,2,99,2,97,,1,,2,2,2,2,1,1,1,,,1,1,1,1,,,4,99,5,1,1,4,99,3023,34,Yucat�n,Hospital de,227,1,1,2.22549019607843000000,2012-08-29,31
19,34,Hospital de Especialidades No. 1 M�rida,3023,29,8,12,17,46,18,20,3,31,50,68,2,2,2,9,2,2,2,2,2,6,2,1,1,1,2,1,1,2,1,1,1,2,2,1,2,,1,1,1,1,2,2,2,2,1,2,,,,,,,,,,,2,,,,,,,,,,,,2,,,,,,,,,,,,,,,1,2,1,2,1,1,2,1,2,2,1,2,2,2,2,2,2,2,1,1,,1,,,1,,,,,,,,2,2,,,1,1,2,1,2,2,2,,,,2,2,,,2,4,2,2,2,97,,1,,2,2,1,2,1,1,1,,,1,1,1,1,,,1,4,4,1,1,4,4,3023,34,Yucat�n,Hospital de,227,1,1,2.22549019607843000000,2012-08-29,31
10,34,Hospital de Especialidades No. 1 M�rida,3023,29,8,12,16,35,16,44,3,31,50,69,2,2,8,9,99,2,2,2,2,2,1,1,1,1,2,2,1,1,2,2,1,2,,,2,,2,2,,,1,1,1,1,1,2,,,,,,,,,,,2,,,,,,,,,,,,2,,,,,,,,,,,,,,,1,1,1,2,1,1,2,2,2,2,2,1,2,2,2,2,2,2,1,2,,,,,,2,,,,,,,2,2,,,2,1,1,1,99,99,2,99,99,99,2,2,,,2,2,2,2,4,2,1,1,,2,2,1,2,1,2,1,,,1,1,1,1,,,4,5,5,1,1,5,5,3023,34,Yucat�n,Hospital de,227,1,1,2.22549019607843000000,2012-08-29,31
58,34,Hospital de Especialidades No. 1 M�rida,3023,29,8,12,19,52,20,29,3,31,50,23,1,2,8,5,3,3,4,2,2,1,1,2,2,1,2,1,1,2,1,2,1,1,2,,1,1,2,1,2,1,2,2,2,2,2,2,,,,,,,,,,,2,,,,,,,,,,,,2,,,,,,,,,,,,,,,1,4,1,4,1,1,2,2,1,2,2,2,2,2,2,2,2,1,1,2,,,1,,,,,,,,,2,4,2,,,2,1,1,1,2,2,2,2,2,2,2,2,,,4,4,4,4,4,1,2,1,,2,99,2,4,1,2,1,,,1,1,2,,,,2,2,5,2,2,5,5,3023,34,Yucat�n,Hospital de,227,1,1,2.22549019607843000000,2012-08-29,31
59,34,Hospital de Especialidades No. 1 M�rida,3023,29,8,12,18,12,18,45,3,31,50,70,1,2,7,5,4,3,1,1,2,5,1,1,1,1,2,1,1,1,1,1,1,1,1,1,1,1,1,1,1,1,1,1,1,1,1,2,,,,,,,,,,,2,,,,,,,,,,,,2,,,,,,,,,,,,,,,2,,,,1,1,1,1,2,1,2,2,2,2,2,2,2,2,2,1,1,1,,1,,,,,,,,,,2,,,2,1,1,1,2,2,1,1,1,1,1,1,,,1,1,1,1,1,1,1,1,,2,2,1,1,2,,,,,,,2,,,,1,1,1,1,1,2,1,3023,34,Yucat�n,Hospital de,227,1,1,2.22549019607843000000,2012-08-29,31
54,34,Hospital de Especialidades No. 1 M�rida,3023,29,8,12,16,2,16,26,3,31,50,18,2,1,2,6,2,3,4,2,2,1,3,2,1,1,1,1,1,1,1,1,1,1,2,2,2,4,2,1,2,1,2,2,2,2,2,2,,,,,,,,,,,2,,,,,,,,,,,,2,,,,,,,,,,,,,,,1,4,2,4,1,1,2,1,2,2,2,2,1,2,2,2,2,2,2,2,,2,,,,,2,,,,,,,2,,,2,1,1,1,2,1,2,99,99,99,3,2,,2,2,4,2,2,2,2,1,1,,2,2,1,2,2,,,,,,,2,,,,4,4,5,4,1,4,2,3023,34,Yucat�n,Hospital de,227,1,1,2.22549019607843000000,2012-08-29,31
14,34,Hospital de Especialidades No. 1 M�rida,3023,29,8,12,15,25,15,55,3,31,50,27,2,1,1,8,2,3,2,2,2,6,2,1,1,1,2,1,1,1,1,2,1,1,2,,2,2,1,2,,,2,2,2,2,1,2,,,,,,,,,,,2,,,,,,,,,,,,2,,,,,,,,,,,,,,,2,,,,1,2,2,1,1,1,2,2,2,2,2,2,2,2,2,,,2,2,2,,,,,,,,,,2,,,2,1,1,1,2,2,2,1,1,4,2,2,,,1,1,1,2,1,1,1,1,,2,2,2,1,2,,,,,,,1,1,,,99,99,99,1,1,99,99,3023,34,Yucat�n,Hospital de,227,1,1,2.22549019607843000000,2012-08-29,31
75,34,Hospital de Especialidades No. 1 M�rida,3023,29,8,12,15,33,16,5,3,31,50,57,2,2,2,1,1,4,2,2,2,5,3,1,1,1,1,1,1,2,1,1,1,1,2,2,2,1,1,1,1,1,1,1,1,1,1,2,,,,,,,,,,,2,,,,,,,,,,,,2,,,,,,,,,,,,,,,2,,,,99,1,2,1,2,2,2,2,2,2,2,2,2,2,2,2,,2,,,,,,,,,,,,2,,,1,1,1,1,2,2,1,2,2,4,2,2,,,2,2,2,2,2,97,,1,,2,2,1,2,2,,,,,,,2,,,,1,5,5,1,1,5,5,3023,34,Yucat�n,Hospital de,227,1,1,2.22549019607843000000,2012-08-29,31
62,34,Hospital de Especialidades No. 1 M�rida,3023,29,8,12,15,13,15,30,3,31,50,53,2,2,2,2,99,4,1,1,2,1,2,2,1,1,1,1,1,1,1,1,1,1,1,2,2,2,2,1,1,1,1,1,1,1,1,2,,,,,,,,,,,2,,,,,,,,,,,,1,15,4,1,1,1,5,2,1,2,2,1,2,2,2,2,,,,1,1,2,1,2,2,2,2,2,2,2,2,2,2,1,1,,1,,,,,,,,,,,2,2,,,2,1,2,2,2,2,2,,,,,,,,2,2,2,2,2,97,,1,,2,1,2,2,1,99,1,,,1,1,1,1,,,5,5,5,5,5,5,5,3023,34,Yucat�n,Hospital de,227,1,1,2.22549019607843000000,2012-08-29,31
65,34,Hospital de Especialidades No. 1 M�rida,3023,29,8,12,8,32,8,59,3,31,50,61,1,2,1,5,1,4,2,1,1,5,3,1,1,1,1,1,1,2,1,2,1,1,2,,2,2,2,1,1,1,1,1,1,1,1,2,,,,,,,,,,,2,,,,,,,,,,,,2,,,,,,,,,,,,,,,1,2,2,2,1,1,2,1,2,1,1,2,2,2,2,2,2,2,1,1,,1,,1,2,,,,,,,,2,2,,,1,1,1,1,2,2,1,99,99,99,2,2,,,2,2,2,1,2,2,2,1,,2,1,1,1,1,1,1,,,2,,1,1,,,5,4,4,1,99,1,4,3023,34,Yucat�n,Hospital de,227,1,1,2.22549019607843000000,2012-08-29,31
69,34,Hospital de Especialidades No. 1 M�rida,3023,29,8,12,10,2,10,29,3,31,50,71,1,5,2,5,2,4,1,1,2,6,2,2,1,1,2,1,1,1,1,1,1,1,2,2,2,2,1,1,1,1,1,1,1,1,1,2,,,,,,,,,,,2,,,,,,,,,,,,2,,,,,,,,,,,,,,,1,3,1,2,1,1,2,1,2,1,2,1,1,2,2,2,2,1,1,1,,1,,1,,1,1,,,,,1,1,2,,,2,1,1,1,1,1,1,2,2,3,1,1,2,2,2,2,2,2,2,2,1,1,,2,2,1,1,1,1,1,,,2,,1,1,,,99,99,99,1,99,99,99,3023,34,Yucat�n,Hospital de,227,1,1,2.22549019607843000000,2012-08-29,31
70,34,Hospital de Especialidades No. 1 M�rida,3023,29,8,12,10,30,11,0,3,31,50,44,1,2,3,5,2,4,1,1,1,3,2,2,2,1,1,1,1,1,1,2,2,2,1,,,,3,2,,,2,2,2,2,2,2,,,,,,,,,,,2,,,,,,,,,,,,2,,,,,,,,,,,,,,,1,3,2,2,1,2,2,1,2,2,1,2,2,2,2,2,2,2,2,,,1,,,2,,,,,,,,,2,,,1,2,1,2,2,2,,2,2,4,,,,,3,2,2,99,2,2,2,1,,2,2,2,2,2,,,,,,,2,,,,4,5,5,4,99,5,5,3023,34,Yucat�n,Hospital de,227,1,1,2.22549019607843000000,2012-08-29,31
79,34,Hospital de Especialidades No. 1 M�rida,3023,29,8,12,17,16,17,48,3,31,50,80,2,4,3,9,99,4,2,2,2,5,99,3,99,1,2,1,1,1,1,1,1,1,2,2,2,2,1,1,2,1,1,1,1,1,1,2,,,,,,,,,,,2,,,,,,,,,,,,99,,,,,,,,,,,,,,,1,1,1,1,1,1,2,1,1,1,2,2,2,2,1,1,1,2,2,2,,1,2,1,,,,,2,2,2,,,99,,,99,1,1,1,2,1,1,2,2,1,2,2,,1,2,1,2,99,99,1,1,1,,2,2,1,2,1,6,,,,,,1,99,,,3,2,2,1,1,3,3,3023,34,Yucat�n,Hospital de,227,1,1,2.22549019607843000000,2012-08-29,31
63,34,Hospital de Especialidades No. 1 M�rida,3023,29,8,12,15,38,16,3,3,31,50,53,2,2,4,999,2,4,2,2,2,5,2,1,1,2,,,,,,,,,,,,,,,,,,,,,,2,,,,,,,,,,,2,,,,,,,,,,,,1,3,4,1,2,2,2,2,2,2,2,2,97,2,2,1,4,2,2,1,1,1,1,1,1,1,2,2,2,2,2,2,1,2,2,4,2,2,2,5,,,,,,,2,,99,,,2,1,1,1,2,2,2,2,2,4,2,2,,,2,2,2,99,4,1,1,1,,2,1,1,2,2,,,,,,,1,1,,,1,4,4,4,1,1,2,3023,34,Yucat�n,Hospital de,227,1,1,2.22549019607843000000,2012-08-29,31
1,34,Hospital de Especialidades No. 1 M�rida,3023,29,8,12,8,25,8,53,3,31,50,27,1,2,3,2,99,1,2,1,2,6,1,2,1,1,2,3,,1,1,1,1,2,1,2,1,,99,2,,,1,2,2,2,2,2,,,,,,,,,,,2,,,,,,,,,,,,2,,,,,,,,,,,,,,,1,2,1,2,1,1,1,1,2,2,2,2,2,2,2,2,2,2,1,4,2,2,,,,,,,,,,,2,1,5,1,2,1,1,1,2,2,2,5,5,5,2,2,,,4,2,2,2,2,3,2,1,,2,99,1,2,1,1,1,,,1,1,2,,,,2,4,5,4,2,2,5,3023,34,Yucat�n,Hospital de,227,1,1,2.22549019607843000000,2012-08-29,31
18,34,Hospital de Especialidades No. 1 M�rida,3023,29,8,12,19,40,20,0,3,31,50,61,2,2,9,9,3,2,4,4,2,6,1,3,2,1,2,2,1,1,1,1,1,1,1,1,1,1,99,2,,,1,1,1,1,2,2,,,,,,,,,,,2,,,,,,,,,,,,2,,,,,,,,,,,,,,,1,4,2,4,1,1,2,1,2,2,2,2,2,2,2,2,2,2,1,2,,2,,,,,,,,,,,2,1,5,1,1,1,2,1,2,2,2,,,,2,2,,,2,2,2,2,2,97,,1,,2,1,2,4,1,1,1,,,1,1,1,1,,,4,2,4,5,1,2,5,3023,34,Yucat�n,Hospital de,227,1,1,2.22549019607843000000,2012-08-29,31
12,34,Hospital de Especialidades No. 1 M�rida,3023,29,8,12,14,45,15,20,3,31,50,53,2,2,2,9,3,2,2,2,2,3,3,1,3,1,2,1,1,1,1,1,1,1,2,2,2,2,1,1,1,1,1,1,1,1,1,2,,,,,,,,,,,2,,,,,,,,,,,,2,,,,,,,,,,,,,,,2,,,,1,1,1,1,2,1,1,1,2,2,2,1,1,2,2,2,2,1,,2,1,1,,,,1,1,,,1,5,1,1,1,1,1,2,2,1,1,1,1,1,1,,,2,2,2,2,2,1,1,1,,2,2,2,2,2,,,,,,,2,,,,2,2,2,2,2,5,2,3023,34,Yucat�n,Hospital de,227,1,1,2.22549019607843000000,2012-08-29,31
2,34,Hospital de Especialidades No. 1 M�rida,3023,29,8,12,9,30,10,3,3,31,50,90,1,2,2,5,3,3,2,2,1,6,3,2,1,1,1,1,1,2,1,2,1,1,2,,2,2,2,2,,,2,2,2,2,1,2,,,,,,,,,,,2,,,,,,,,,,,,2,,,,,,,,,,,,,,,2,,,,1,1,1,1,2,2,1,1,1,1,1,1,1,1,1,1,2,2,,,2,2,2,2,2,2,2,2,1,1,8,1,2,1,2,1,2,2,1,,,,2,1,,,2,2,2,1,1,97,,1,,2,2,97,2,2,,,,,,,97,,,,4,4,2,4,1,2,4,3023,34,Yucat�n,Hospital de,227,1,1,2.22549019607843000000,2012-08-29,31
7,34,Hospital de Especialidades No. 1 M�rida,3023,29,8,12,12,20,12,50,3,31,50,42,1,2,5,5,2,3,4,2,2,5,3,2,3,1,2,2,3,1,2,2,2,2,,,,,2,2,,,1,2,1,1,2,2,,,,,,,,,,,2,,,,,,,,,,,,2,,,,,,,,,,,,,,,1,3,1,4,1,1,2,1,2,2,2,1,2,2,2,2,2,2,2,2,,2,,,,2,,,,,,,,1,5,1,2,1,1,1,1,2,2,2,4,4,2,2,2,,4,2,2,2,2,2,1,1,,2,2,1,2,2,,,,,,,1,1,,,1,4,4,1,1,4,5,3023,34,Yucat�n,Hospital de,227,1,1,2.22549019607843000000,2012-08-29,31
46,34,Hospital de Especialidades No. 1 M�rida,3023,29,8,12,12,40,13,4,3,31,50,72,1,2,7,5,3,3,1,2,2,6,1,2,1,1,2,1,1,1,1,1,1,1,2,2,2,2,1,1,1,1,1,1,1,2,1,2,,,,,,,,,,,2,,,,,,,,,,,,2,,,,,,,,,,,,,,,1,4,1,4,1,1,2,1,2,1,2,2,2,2,1,2,2,2,1,2,,1,,2,,,,,4,,,,2,1,6,1,2,1,2,1,2,2,3,,,,2,2,,,2,2,2,99,99,97,,1,,2,1,2,2,1,1,1,,,2,,1,1,,,4,2,2,2,1,2,99,3023,34,Yucat�n,Hospital de,227,1,1,2.22549019607843000000,2012-08-29,31
20,34,Hospital de Especialidades No. 1 M�rida,3023,29,8,12,18,25,18,55,3,31,50,52,1,2,5,5,5,3,2,2,2,6,1,2,3,1,2,1,1,2,1,2,1,1,2,,2,2,1,1,2,1,2,2,2,2,1,2,,,,,,,,,,,2,,,,,,,,,,,,2,,,,,,,,,,,,,,,2,,,,1,1,1,1,2,2,2,2,2,2,2,2,2,1,1,2,5,2,,,,,,,,,,2,2,1,5,1,2,1,2,1,2,2,2,,,,3,3,,,3,4,2,2,2,97,,1,,2,1,2,2,1,1,1,,,1,1,1,1,,,5,5,5,1,1,2,5,3023,34,Yucat�n,Hospital de,227,1,1,2.22549019607843000000,2012-08-29,31
11,34,Hospital de Especialidades No. 1 M�rida,3023,29,8,12,16,55,17,22,3,31,50,68,1,2,3,5,2,3,2,1,2,1,1,1,99,1,2,2,3,1,1,1,1,1,2,2,2,2,1,2,,,1,2,2,2,1,2,,,,,,,,,,,2,,,,,,,,,,,,2,,,,,,,,,,,,,,,1,4,1,4,1,1,1,2,1,1,2,2,2,2,2,2,2,2,1,1,1,,1,1,,,,,,,,,1,1,5,1,1,2,1,1,2,1,,99,99,99,2,2,,1,2,2,2,4,4,1,1,1,,2,1,1,2,1,1,1,,,1,1,2,,,,4,4,4,2,1,2,4,3023,34,Yucat�n,Hospital de,227,1,1,2.22549019607843000000,2012-08-29,31
103,34,Hospital de Especialidades No. 1 M�rida,3023,29,8,12,10,3,10,40,3,31,50,54,2,1,4,6,2,3,1,2,2,1,2,3,1,1,2,1,1,1,1,1,1,1,1,2,1,2,1,1,1,1,1,1,1,1,1,2,,,,,,,,,,,2,,,,,,,,,,,,2,,,,,,,,,,,,,,,1,4,1,1,1,1,2,1,2,1,2,1,1,2,2,1,1,1,1,1,,1,,2,,2,2,,,2,2,2,1,1,1,1,1,1,1,1,1,1,2,2,4,4,5,4,2,2,2,2,2,2,2,2,1,1,,2,2,1,1,1,2,1,,,1,1,1,1,,,1,5,5,2,2,5,5,3023,34,Yucat�n,Hospital de,227,1,1,2.22549019607843000000,2012-08-29,31
24,34,Hospital de Especialidades No. 1 M�rida,3023,29,8,12,10,20,10,47,3,31,50,43,2,2,5,10,2,4,2,3,1,5,2,2,1,1,1,1,1,1,1,1,1,2,2,2,2,,2,2,,,2,2,2,2,1,2,,,,,,,,,,,2,,,,,,,,,,,,2,,,,,,,,,,,,,,,2,,,,1,1,2,1,2,1,2,2,2,2,2,2,2,2,2,1,,1,,2,,,,,,,,,,1,5,1,2,1,2,1,2,2,2,,,,2,2,,,2,2,2,2,2,97,,1,,2,99,97,2,1,6,,,,,,1,1,,,1,1,2,1,1,1,4,3023,34,Yucat�n,Hospital de,227,1,1,2.22549019607843000000,2012-08-29,31
64,34,Hospital de Especialidades No. 1 M�rida,3023,29,8,12,8,3,8,30,3,31,50,60,1,1,8,5,2,99,2,2,2,1,3,1,1,1,2,2,3,1,2,2,2,2,,,,,3,2,,,2,2,2,2,1,2,,,,,,,,,,,2,,,,,,,,,,,,2,,,,,,,,,,,,,,,1,3,1,1,1,2,1,1,2,1,1,1,1,2,2,2,1,2,2,,2,4,,2,2,2,2,,,,2,,,1,3,1,2,2,1,1,1,2,,1,2,2,2,2,2,,1,2,3,4,5,3,1,1,,2,1,2,2,2,,,,,,,2,,,,5,5,5,5,4,4,5,3023,34,Yucat�n,Hospital de,227,1,1,2.22549019607843000000,2012-08-29,31
6,34,Hospital de Especialidades No. 1 M�rida,3023,29,8,12,11,10,11,41,3,31,50,30,1,2,5,2,2,1,1,1,2,6,2,2,1,1,2,1,1,1,1,1,1,1,2,2,2,2,1,1,2,1,1,1,1,1,1,2,,,,,,,,,,,2,,,,,,,,,,,,2,,,,,,,,,,,,,,,1,1,1,2,1,1,2,1,2,1,1,1,1,2,2,2,2,2,1,1,,1,,1,1,1,1,,,,,,2,1,7,2,2,1,2,1,1,1,2,,,,2,2,1,1,1,1,1,99,1,97,,1,,2,2,1,1,1,1,1,,,1,1,1,1,,,1,1,99,1,1,1,99,3023,34,Yucat�n,Hospital de,227,1,1,2.22549019607843000000,2012-08-29,31
106,34,Hospital de Especialidades No. 1 M�rida,3023,29,8,12,13,13,13,45,3,31,50,35,1,2,3,5,3,3,2,2,2,2,3,2,2,1,2,2,3,1,1,1,1,1,2,4,4,3,3,1,4,99,1,2,1,2,1,2,,,,,,,,,,,2,,,,,,,,,,,,2,,,,,,,,,,,,,,,1,3,1,4,1,1,2,1,2,1,2,1,1,2,2,1,2,2,1,2,,2,,2,,4,3,,,2,,,2,1,1,2,1,1,2,1,1,1,2,,,,3,3,2,2,1,1,1,1,1,97,,1,,2,2,3,2,1,1,1,,,1,1,1,1,,,2,5,5,2,4,5,5,3023,34,Yucat�n,Hospital de,227,1,1,2.22549019607843000000,2012-08-29,31
21,34,Hospital de Especialidades No. 1 M�rida,3023,29,8,12,18,56,19,30,3,31,50,94,1,4,1,5,2,3,2,2,2,5,1,1,1,1,2,1,1,1,2,1,1,2,,2,2,,2,1,1,1,1,2,1,1,1,2,,,,,,,,,,,2,,,,,,,,,,,,2,,,,,,,,,,,,,,,1,2,2,2,1,1,1,1,2,2,1,2,2,2,2,2,2,2,2,2,2,1,,,2,,,,,,,,,1,8,3,2,1,2,1,2,2,2,,,,2,2,,,2,2,2,2,2,97,,1,,2,2,1,2,2,,,,,,,2,,,,2,4,3,1,1,3,4,3023,34,Yucat�n,Hospital de,227,1,1,2.22549019607843000000,2012-08-29,31
104,34,Hospital de Especialidades No. 1 M�rida,3023,29,8,12,11,0,11,35,3,31,50,73,2,2,3,5,2,3,2,2,2,1,3,3,1,1,2,1,1,1,1,1,1,1,2,4,2,4,1,1,1,1,1,1,1,1,1,2,,,,,,,,,,,2,,,,,,,,,,,,2,,,,,,,,,,,,,,,1,4,1,2,1,1,1,1,2,1,2,2,2,2,1,1,1,1,1,2,2,2,,2,,,,,2,2,2,2,2,1,5,6,1,1,1,2,2,2,2,99,4,2,,,,,2,2,2,2,2,1,2,1,,2,2,1,1,1,1,1,,,1,1,1,1,,,1,5,5,2,2,5,5,3023,34,Yucat�n,Hospital de,227,1,1,2.22549019607843000000,2012-08-29,31
108,34,Hospital de Especialidades No. 1 M�rida,3023,29,8,12,14,50,15,30,3,31,50,58,1,4,3,5,2,3,2,2,1,1,1,3,1,1,1,1,1,1,1,1,1,1,2,2,2,2,2,1,2,1,1,1,1,1,1,2,,,,,,,,,,,2,,,,,,,,,,,,2,,,,,,,,,,,,,,,1,1,1,2,1,1,1,1,2,1,2,1,1,2,2,1,2,2,1,2,2,2,,2,,2,2,,,2,,,2,1,1,8,1,1,1,1,1,1,2,2,2,2,2,2,2,2,2,2,2,2,2,1,1,1,,2,2,1,2,2,,,,,,,1,1,,,2,5,4,2,2,2,5,3023,34,Yucat�n,Hospital de,227,1,1,2.22549019607843000000,2012-08-29,31
49,34,Hospital de Especialidades No. 1 M�rida,3023,29,8,12,11,37,12,8,3,31,50,72,1,4,1,8,2,3,2,99,2,2,1,2,3,1,1,1,3,1,1,2,1,1,3,,2,2,2,1,99,1,1,1,1,1,1,2,,,,,,,,,,,2,,,,,,,,,,,,2,,,,,,,,,,,,,,,1,1,1,2,1,1,2,1,1,1,2,1,1,1,1,1,1,2,1,2,,2,2,2,,2,2,2,2,2,2,,4,1,1,8,1,1,1,1,2,2,2,2,2,2,2,4,,,99,99,99,99,99,1,1,1,,2,2,2,2,1,1,1,,,1,1,1,1,,,2,99,3,2,1,4,99,3023,34,Yucat�n,Hospital de,227,1,1,2.22549019607843000000,2012-08-29,31
78,34,Hospital de Especialidades No. 1 M�rida,3023,29,8,12,16,29,17,5,3,31,50,34,1,1,5,9,2,4,2,2,2,5,3,1,99,1,2,1,1,1,1,1,1,2,2,2,4,,2,1,2,1,2,2,2,2,1,2,,,,,,,,,,,2,,,,,,,,,,,,1,2,4,2,9,,3,2,2,1,2,97,1,2,2,1,1,1,2,1,1,2,1,2,1,1,1,1,2,1,1,1,1,1,2,,2,,2,5,2,2,,2,2,2,2,2,1,2,9,1,1,2,1,1,1,1,,,,2,2,2,2,3,2,2,99,3,97,,1,,2,99,1,1,1,1,99,,,,,1,1,,,99,4,5,99,2,3,3,3023,34,Yucat�n,Hospital de,227,1,1,2.22549019607843000000,2012-08-29,31