Folio,Deleg,Unidmed,Id_Unid,Fecha_D,Fecha_M,Fecha_A,Hr_Ini_H,Hr_Ini_M,Hr_Fin_H,Hr_Fin_M,Edad,Sexo,Edocivi,Escolar,Ocupa,Tel�Fono,Sat1,Sat3,Retro,Prospe,Cons_Mf,Mot_Cons1,Frecmf,Probsal,Tmedico,Citapre,Hrcita,Tdifcons,Citatel,Nocitatel,Btratou,Preosad,Tmsalud,Mhclinco,Expclaa_A,Expclaa_B,Expclaa_C,Expclaa_D,Expclab_A,Expclab_B,Expclab_C,Expclab_D,Mopin,Explora,Cexplora,Mexapriv,Prevasis_A,Prevasis_B,Prevasis_C,Prevmed_A,Prevmed_B,Dpconf,Calfatna_A,Calfatna_B,Calfatna_C,Calfatna_D,Calfatna_E,Calfatna_F,Calfatna_G,Calfatna_H,Calfatna_I,Calfatna_J,Calfatna_K,Calfatna_L,Calfatna_M,Calfatna_N,Calfatnb_A,Calfatnb_B,Calfatnb_C,Calfatnb_D,Calfatnb_E,Calfatnb_F,Calfatnb_G,Calfatnb_H,Calfatnb_I,Calfatnb_J,Calfatnb_K,Calfatnb_L,Calfatnb_M,Calfatnb_N,Infimss,Finfimss,Continf,Cartel,Filtrosaux,Temsad,Saduni,Privalrx,Faltamat,Satlarx,Calfinma_A,Calfinma_B,Calfinma_C,Calfinma_D,Calfinma_E,Calfinmb_A1,Calfinmb_B1,Calfinmb_B2,Calfinmb_B3,Calfinmb_C1,Calfinmb_C2,Calfinmb_D1,Calfinmb_E1,Calfinmb_F,Calfinmb_G,Calfinmb_H,Calfinmb_I,Calfinmb_J,Ordylim1,Ordylim2,Ordylim3,Recomuni,Norecom,Corrup,Atn1fam,Caqod,Sat2,Filtrofarm,Tfarsurt,Totmed,Acnomed,Versurt,Versurt2,Farm1,Farm2,Farm3,Farm4,Traimss,Confi1_A,Confi1_B,Confi1_C,Confi1_D,Confi1_E,Confi1_F,Confi1_G,Id_Unidad,Cve_Delegaci�N,Delegaci�N,Nivel,Unidad,Promedio_Diario2011,Estrato,Moscondia,Fe_Finalnr,Fecha,Entidad
14045,1,UMF 8 Aguascalientes,1,16,11,11,10,0,10,18,51,1,5,1,1,1,2,2,1,1,2,3,2,1,1,1,2,2,1,,1,1,1,1,1,1,1,1,2,1,2,2,1,1,2,1,1,1,1,1,1,1,1,1,2,1,2,2,2,1,2,2,2,2,2,2,2,2,,2,,,,2,,,,,,,2,,,2,2,,,,,,1,1,1,2,2,2,2,2,2,2,2,,,2,2,2,3,3,99,99,99,1,,2,1,2,2,1,1,1,,1,1,1,1,,,5,5,1,5,1,1,5,3,1,1,Aguascalientes,1,UMF ���8 ��AGUASCALIENTES,1221,1,0.25474650532025900000,10.42246530919970000000,2011-11-16,1
14763,1,UMF 8 Aguascalientes,1,16,11,11,18,7,18,29,51,1,2,2,5,1,2,1,2,1,2,3,1,1,2,2,,,,,1,1,3,2,1,1,1,1,2,2,2,2,2,1,1,1,2,2,1,1,1,1,1,1,2,2,2,2,2,1,2,2,2,2,2,2,2,2,,,,,,2,,,,,,,2,,,2,2,,,,,,1,1,1,2,2,2,5,5,5,2,2,,,2,2,2,2,2,2,1,1,1,,2,2,2,2,1,1,1,,1,1,1,1,,,5,1,3,3,2,5,5,5,1,1,Aguascalientes,1,UMF ���8 ��AGUASCALIENTES,1221,1,0.25474650532025900000,10.42246530919970000000,2011-11-16,1
14092,1,UMF 8 Aguascalientes,1,16,11,11,12,0,12,15,61,1,4,7,8,2,2,2,2,2,2,3,2,1,1,1,1,,1,,1,1,1,1,2,2,1,1,,,1,1,1,1,1,1,1,1,2,1,1,1,1,1,2,2,2,2,2,1,2,2,2,2,2,2,1,1,,,,,,1,,,,,,,2,,,2,2,,,,,,1,2,1,2,2,1,,,,1,1,,,1,1,1,1,2,99,1,2,1,,2,2,1,2,1,1,1,,1,1,1,1,,,2,1,2,1,1,1,5,2,1,1,Aguascalientes,1,UMF ���8 ��AGUASCALIENTES,1221,1,0.25474650532025900000,15.54207916986900000000,2011-11-16,1
14672,1,UMF 8 Aguascalientes,1,16,11,11,19,10,19,29,47,1,3,3,1,1,1,1,2,2,2,4,1,1,1,1,1,,1,,1,2,1,1,1,1,1,1,2,2,2,2,1,1,1,1,1,1,2,1,1,1,1,1,2,2,2,2,2,1,2,2,2,2,2,2,2,2,,,,,,2,,,,,,,2,,,2,1,2,1,1,2,2,1,2,1,2,2,2,,,,2,2,,,3,2,2,3,2,3,2,2,1,,2,2,1,1,1,1,1,,1,1,1,1,,,3,4,4,99,2,2,5,5,1,1,Aguascalientes,1,UMF ���8 ��AGUASCALIENTES,1221,1,0.25474650532025900000,10.42246530919970000000,2011-11-16,1
14052,1,UMF 8 Aguascalientes,1,16,11,11,15,20,15,41,45,2,2,9,2,1,2,2,1,2,2,4,3,1,1,2,,,,,1,2,1,3,1,1,2,2,1,1,,,2,2,,,1,1,1,1,2,3,1,1,2,2,2,2,2,1,2,2,2,2,2,2,2,3,,,,,,2,,,,,,,2,,,1,2,,,,,,1,2,1,2,2,1,,,,99,2,,,2,1,2,1,1,2,2,2,1,,2,2,1,2,1,1,1,,1,1,1,1,,,2,2,2,2,2,1,4,4,1,1,Aguascalientes,1,UMF ���8 ��AGUASCALIENTES,1221,1,0.25474650532025900000,11.45447039970010000000,2011-11-16,1
14088,1,UMF 8 Aguascalientes,1,16,11,11,10,19,10,33,67,1,2,2,5,2,2,2,1,99,2,4,2,1,2,1,2,3,1,,1,1,1,1,1,2,1,2,1,,1,,2,1,2,1,1,1,1,1,1,2,1,1,2,2,2,2,2,1,2,2,2,2,2,2,3,1,,,,,,3,,,,,,,2,,,1,1,4,1,2,2,2,1,2,1,2,2,2,,,,1,1,,,1,1,1,1,1,2,1,2,1,,2,1,2,2,1,1,1,,1,1,1,1,,,1,2,2,4,2,2,5,5,1,1,Aguascalientes,1,UMF ���8 ��AGUASCALIENTES,1221,1,0.25474650532025900000,11.87650996347750000000,2011-11-16,1
14044,1,UMF 8 Aguascalientes,1,16,11,11,9,30,9,50,72,1,4,6,5,2,2,2,1,99,2,4,6,1,1,2,,,,,1,2,1,1,1,1,1,1,1,1,1,1,1,1,1,1,1,1,1,1,1,1,1,1,2,1,2,2,2,1,2,2,2,2,2,2,1,1,,1,,,,1,,,,,,,2,,,2,1,1,1,1,2,1,1,1,1,2,2,2,2,2,2,1,1,,,3,2,2,2,2,1,1,1,1,,2,2,1,1,1,1,1,,1,1,1,1,,,5,1,1,5,1,1,3,3,1,1,Aguascalientes,1,UMF ���8 ��AGUASCALIENTES,1221,1,0.25474650532025900000,11.87650996347750000000,2011-11-16,1
14786,1,UMF 8 Aguascalientes,1,16,11,11,16,39,16,56,76,1,4,7,5,1,2,2,2,1,2,4,2,1,1,1,1,,1,,1,1,3,3,1,2,1,2,1,,1,,1,1,1,1,1,1,1,1,1,99,1,1,2,2,2,2,2,1,2,2,2,2,99,2,1,1,,,,,,1,,,,,,,2,,,2,1,1,1,1,2,1,1,2,1,2,2,1,,,,1,1,,,2,2,2,99,99,99,99,2,1,,2,2,2,2,1,1,1,,1,1,1,1,,,3,2,3,4,1,1,99,4,1,1,Aguascalientes,1,UMF ���8 ��AGUASCALIENTES,1221,1,0.25474650532025900000,11.87650996347750000000,2011-11-16,1
14793,1,UMF 8 Aguascalientes,1,16,11,11,9,45,10,2,66,1,2,2,5,2,1,1,2,1,2,4,2,1,1,1,2,3,1,,1,1,1,1,1,1,1,1,1,1,1,1,2,2,,,1,1,2,1,1,1,1,1,2,2,2,2,2,1,2,2,2,2,2,2,2,2,,,,,,2,,,,,,,2,,,2,1,3,2,2,2,2,1,2,1,2,2,3,,,,3,3,,,3,2,2,99,2,99,2,2,1,,2,2,2,2,1,1,1,,1,1,1,1,,,3,1,2,4,1,1,4,4,1,1,Aguascalientes,1,UMF ���8 ��AGUASCALIENTES,1221,1,0.25474650532025900000,11.87650996347750000000,2011-11-16,1
15542,1,UMF 8 Aguascalientes,1,16,11,11,18,34,18,50,63,1,2,4,5,1,2,2,1,1,2,1,2,2,1,1,1,,1,,1,1,1,1,1,2,1,1,2,,2,2,1,1,2,1,1,1,1,1,1,1,1,1,2,2,2,2,2,1,2,2,2,2,2,2,2,2,,,,,,2,,,,,,,2,,,2,2,,,,,,1,2,1,2,2,2,,,,2,2,,,2,2,2,2,2,99,99,99,1,,2,2,1,2,1,1,1,,1,1,1,1,,,5,99,99,5,2,4,5,5,1,1,Aguascalientes,1,UMF ���8 ��AGUASCALIENTES,1221,1,0.25474650532025900000,15.54207916986900000000,2011-11-16,1
14674,1,UMF 8 Aguascalientes,1,16,11,11,8,2,8,34,54,1,3,3,5,2,2,2,2,99,2,3,2,2,1,2,,,,,1,1,1,2,1,2,97,97,2,,,,2,2,,,1,1,1,1,1,1,1,1,2,2,2,2,2,1,2,2,2,2,2,2,2,3,,,,,,4,,,,,,,2,,,1,2,,,,,,1,1,1,2,2,1,1,1,2,2,2,,,2,1,1,2,2,1,2,2,1,,2,2,2,2,1,1,1,,1,1,1,1,,,3,2,2,2,2,2,2,2,1,1,Aguascalientes,1,UMF ���8 ��AGUASCALIENTES,1221,1,0.25474650532025900000,10.42246530919970000000,2011-11-16,1
14775,1,UMF 8 Aguascalientes,1,16,11,11,13,16,13,32,63,1,4,2,5,1,2,2,1,1,2,3,2,2,1,1,2,2,1,,1,1,1,1,1,2,1,1,1,,2,2,1,1,2,1,1,1,2,1,1,1,1,1,1,2,2,2,2,1,2,2,2,2,2,2,1,1,1,,,,,1,,,,,,,2,,,2,1,2,1,2,1,2,1,2,1,2,2,2,,,,3,3,,,3,2,2,2,2,1,1,1,1,,2,2,1,2,1,1,1,,1,1,1,1,,,5,1,3,5,2,5,5,5,1,1,Aguascalientes,1,UMF ���8 ��AGUASCALIENTES,1221,1,0.25474650532025900000,15.54207916986900000000,2011-11-16,1
14047,1,UMF 8 Aguascalientes,1,16,11,11,11,0,11,20,78,2,2,1,8,2,3,3,2,2,2,3,2,2,1,1,1,,1,,1,2,1,1,1,1,1,1,1,1,1,1,1,1,2,1,1,1,1,1,1,1,1,1,2,1,2,2,2,1,2,2,2,2,2,2,1,1,,1,,,,1,,,,,,,2,,,1,1,2,1,1,2,1,1,1,1,2,2,1,1,1,1,1,1,,,1,1,1,1,1,3,1,1,1,,2,1,1,2,1,1,1,,1,1,1,1,,,3,2,2,2,2,1,1,2,1,1,Aguascalientes,1,UMF ���8 ��AGUASCALIENTES,1221,1,0.25474650532025900000,13.05249072964700000000,2011-11-16,1
14085,1,UMF 8 Aguascalientes,1,16,11,11,13,2,13,20,71,2,4,1,4,1,2,2,99,2,2,4,2,2,1,2,,,,,1,1,1,1,1,2,1,1,1,,1,1,1,1,1,1,1,1,1,1,1,1,1,1,1,2,2,2,2,1,2,2,2,2,2,2,2,2,2,,,,,3,,,,,,,2,,,2,2,,,,,,1,2,1,2,2,2,,,,1,4,,,1,1,1,1,1,1,1,1,1,,2,2,1,2,1,1,1,,1,1,1,1,,,1,1,1,1,1,1,1,1,1,1,Aguascalientes,1,UMF ���8 ��AGUASCALIENTES,1221,1,0.25474650532025900000,13.05249072964700000000,2011-11-16,1
14037,1,UMF 8 Aguascalientes,1,16,11,11,18,37,18,56,49,1,2,4,4,2,2,2,1,1,2,4,2,2,1,1,1,,1,,1,1,1,1,1,2,2,1,2,,,2,2,1,2,1,1,1,1,2,1,2,1,1,2,2,2,2,2,1,2,1,2,2,2,2,1,1,,,,,,1,,1,,,,,2,,,2,2,,,,,,1,1,1,2,2,2,3,3,3,2,2,,,2,2,2,4,4,3,1,2,1,,2,2,2,2,1,1,2,3,1,2,1,1,,,3,5,2,5,2,2,5,5,1,1,Aguascalientes,1,UMF ���8 ��AGUASCALIENTES,1221,1,0.25474650532025900000,10.42246530919970000000,2011-11-16,1
14071,1,UMF 8 Aguascalientes,1,16,11,11,15,0,15,19,53,1,2,9,5,1,2,2,2,1,2,4,2,2,1,1,2,2,1,,1,1,1,3,1,1,1,1,1,1,1,1,1,1,1,1,1,1,2,1,1,2,1,2,1,2,2,2,2,1,2,1,2,2,2,2,1,,1,,,,,2,,3,,,,,2,,,1,1,3,1,2,2,1,1,2,1,2,2,1,,,,1,1,,,3,2,2,3,3,99,99,99,1,,2,1,2,3,1,1,1,,1,1,1,1,,,3,5,3,5,3,3,3,5,1,1,Aguascalientes,1,UMF ���8 ��AGUASCALIENTES,1221,1,0.25474650532025900000,10.42246530919970000000,2011-11-16,1
14783,1,UMF 8 Aguascalientes,1,16,11,11,15,20,15,41,60,1,2,3,5,2,2,1,1,1,2,4,2,2,3,2,,,,,1,1,1,1,1,2,1,2,3,,2,,1,2,,,1,1,2,1,1,2,1,1,2,2,2,2,2,1,2,2,2,2,2,2,2,1,,,,,,2,,,,,,,2,,,2,2,,,,,,1,2,1,2,2,2,,,,2,2,,,2,2,2,2,2,99,99,99,1,,2,2,1,1,1,1,1,,1,1,1,1,,,3,2,2,2,1,1,4,4,1,1,Aguascalientes,1,UMF ���8 ��AGUASCALIENTES,1221,1,0.25474650532025900000,15.54207916986900000000,2011-11-16,1
14784,1,UMF 8 Aguascalientes,1,16,11,11,15,47,16,4,51,1,2,2,5,2,3,3,2,99,2,4,2,2,1,1,1,,1,,1,2,1,3,1,1,1,1,1,1,1,1,2,2,,,1,2,1,1,1,2,1,1,2,2,2,1,2,1,2,2,2,2,2,2,2,2,,,,2,,2,,,,,,,2,,,2,1,2,1,2,2,2,1,2,1,1,2,2,,,,3,3,2,,2,2,2,2,2,2,1,99,1,,2,2,2,2,1,1,1,,1,1,1,1,,,3,4,4,4,3,3,4,5,1,1,Aguascalientes,1,UMF ���8 ��AGUASCALIENTES,1221,1,0.25474650532025900000,10.42246530919970000000,2011-11-16,1
14885,1,UMF 8 Aguascalientes,1,16,11,11,15,30,15,48,52,1,1,3,1,2,1,1,1,1,2,1,6,4,1,2,,,,,1,1,1,1,1,2,2,2,2,,,,1,1,2,1,1,2,2,2,2,1,1,1,2,2,2,2,2,1,2,2,2,2,2,2,2,1,,,,,,2,,,,,,,2,,,2,1,2,2,2,2,2,1,2,1,2,2,3,,,,3,2,,,2,2,2,2,2,3,2,2,1,,2,2,1,2,1,1,1,,1,1,1,1,,,5,1,5,5,2,1,5,5,1,1,Aguascalientes,1,UMF ���8 ��AGUASCALIENTES,1221,1,0.25474650532025900000,10.42246530919970000000,2011-11-16,1
14795,1,UMF 8 Aguascalientes,1,16,11,11,10,28,10,45,36,1,1,5,2,2,2,2,1,1,2,1,6,4,3,2,,,,,1,1,1,3,1,2,1,2,2,,2,,99,1,2,2,1,2,2,2,2,1,1,1,2,2,2,2,2,1,1,2,2,2,2,2,2,2,,,,,,2,2,,,,,,2,,,1,2,,,,,,1,2,1,2,2,2,,,,2,2,,,2,3,2,2,2,1,1,99,1,,2,99,1,2,1,1,1,,1,1,1,1,,,1,99,2,2,2,1,2,2,1,1,Aguascalientes,1,UMF ���8 ��AGUASCALIENTES,1221,1,0.25474650532025900000,12.87560238413830000000,2011-11-16,1
14782,1,UMF 8 Aguascalientes,1,16,11,11,15,0,15,18,22,1,2,3,5,2,2,2,2,2,2,1,6,4,3,2,,,,,1,1,1,3,2,2,1,1,,,2,2,2,2,,,1,1,2,2,2,2,1,1,2,2,2,2,2,1,2,2,2,1,1,2,2,2,,,,,,2,,,,2,2,,2,,,2,2,,,,,,1,2,1,2,2,2,,,,2,4,,,4,2,2,99,2,2,2,2,1,,2,2,2,2,1,1,1,,1,1,1,1,,,3,4,4,5,4,2,2,2,1,1,Aguascalientes,1,UMF ���8 ��AGUASCALIENTES,1221,1,0.25474650532025900000,13.58742936999240000000,2011-11-16,1
14766,1,UMF 8 Aguascalientes,1,16,11,11,19,26,19,46,25,1,2,3,5,2,1,1,1,1,2,1,1,4,1,2,,,,,1,1,1,1,1,2,1,1,2,,2,2,2,1,2,1,1,1,2,1,1,2,1,1,2,2,2,2,2,1,2,2,2,2,2,2,2,2,,,,,,2,,,,,,,2,,,1,1,1,1,2,2,1,1,2,1,2,2,2,,,,2,2,,,2,2,2,2,2,99,2,1,1,,2,2,2,2,1,1,1,,1,1,1,1,,,5,1,3,3,3,2,5,5,1,1,Aguascalientes,1,UMF ���8 ��AGUASCALIENTES,1221,1,0.25474650532025900000,13.58742936999240000000,2011-11-16,1
14669,1,UMF 8 Aguascalientes,1,16,11,11,10,12,10,31,48,1,2,7,10,1,1,1,1,1,2,3,3,4,1,1,1,,1,,2,1,1,1,1,2,1,1,2,,2,2,1,1,2,1,1,1,2,1,1,1,1,1,2,2,2,2,2,1,2,2,2,2,2,2,2,2,,,,,,2,,,,,,,2,,,2,2,,,,,,1,2,1,2,2,2,,,,2,2,,,2,2,2,2,2,1,1,1,1,,2,1,1,2,1,1,1,,1,1,1,1,,,5,5,5,4,3,4,4,4,1,1,Aguascalientes,1,UMF ���8 ��AGUASCALIENTES,1221,1,0.25474650532025900000,10.42246530919970000000,2011-11-16,1
14300,1,UMF 8 Aguascalientes,1,16,11,11,17,35,17,50,50,1,2,2,5,1,2,1,1,1,2,4,6,4,1,2,,,,,1,1,1,3,1,1,1,2,2,2,2,,1,2,,,1,1,1,1,1,1,1,1,2,2,2,2,2,1,2,2,2,2,2,2,2,2,,,,,,2,,,,,,,2,,,99,2,,,,,,1,2,1,2,2,2,,,,2,2,,,1,1,1,1,1,99,99,99,1,,2,2,1,1,1,1,1,,1,1,1,1,,,5,99,99,99,1,1,5,5,1,1,Aguascalientes,1,UMF ���8 ��AGUASCALIENTES,1221,1,0.25474650532025900000,10.42246530919970000000,2011-11-16,1
14070,1,UMF 8 Aguascalientes,1,16,11,11,14,25,14,39,51,2,3,6,10,2,2,2,2,2,2,4,2,4,1,2,,,,,1,1,1,1,1,2,1,1,1,,1,1,1,1,1,1,1,1,1,1,1,1,1,1,2,2,2,2,2,1,2,2,2,2,2,2,1,1,,,,,,1,,,,,,,2,,,2,2,,,,,,1,2,1,2,2,2,,,,1,2,,,2,2,2,2,2,99,99,99,1,,2,1,2,1,1,1,1,,2,,1,1,,,1,1,5,5,4,3,5,5,1,1,Aguascalientes,1,UMF ���8 ��AGUASCALIENTES,1221,1,0.25474650532025900000,11.45447039970010000000,2011-11-16,1
14060,1,UMF 8 Aguascalientes,1,16,11,11,8,24,8,40,28,2,2,5,4,2,2,3,2,2,2,1,4,5,4,2,,,,,1,4,,3,1,2,2,2,3,,,,4,1,4,1,2,2,2,2,2,99,2,2,1,2,2,2,2,1,2,2,2,2,2,2,,,2,,,,,2,,,,,,,2,,,1,2,,,,,,1,2,1,2,2,1,,,,2,4,,,2,2,2,99,5,99,99,99,99,,2,1,2,3,1,1,1,,1,1,2,,,,1,2,1,5,1,1,5,5,1,1,Aguascalientes,1,UMF ���8 ��AGUASCALIENTES,1221,1,0.25474650532025900000,14.50291143733460000000,2011-11-16,1
14785,1,UMF 8 Aguascalientes,1,16,11,11,16,10,16,32,49,1,2,9,5,1,3,1,1,1,2,4,2,5,1,1,1,,1,,1,1,1,1,1,2,2,2,2,,,,3,2,,,1,2,2,2,2,99,1,1,1,2,2,2,2,1,2,2,2,1,2,2,2,2,2,,,,,2,,,,2,,,2,,,2,2,,,,,,1,2,1,2,2,2,,,,2,2,,,3,3,2,99,99,2,2,2,1,,2,2,1,3,1,1,1,,1,1,1,1,,,3,1,1,5,2,1,2,5,1,1,Aguascalientes,1,UMF ���8 ��AGUASCALIENTES,1221,1,0.25474650532025900000,10.42246530919970000000,2011-11-16,1
14778,1,UMF 8 Aguascalientes,1,16,11,11,14,52,15,17,24,2,1,5,4,2,2,2,1,1,2,1,2,6,1,2,,,,,1,1,1,1,1,2,1,1,2,,2,2,1,1,2,1,1,1,2,1,1,1,1,1,2,2,2,2,2,1,2,2,2,2,2,2,2,2,,,,,,2,,,,,,,2,,,2,2,,,,,,1,1,1,2,2,2,4,4,4,2,2,,,2,4,4,4,4,1,1,1,1,,1,1,1,2,1,1,1,,1,1,1,1,,,1,2,3,3,3,5,5,5,1,1,Aguascalientes,1,UMF ���8 ��AGUASCALIENTES,1221,1,0.25474650532025900000,14.93282087388830000000,2011-11-16,1
14066,1,UMF 8 Aguascalientes,1,16,11,11,11,30,11,55,46,1,4,5,4,2,2,2,1,1,2,1,3,8,1,2,,,,,1,1,1,1,1,2,2,2,2,,,,1,1,2,1,1,1,1,2,1,1,1,1,2,2,2,2,2,1,2,2,2,2,2,2,1,1,,,,,,1,,,,,,,2,,,2,2,,,,,,1,2,1,2,2,1,,,,3,3,,,1,1,1,4,4,99,99,99,1,,2,99,2,1,1,1,1,,1,1,1,1,,,1,99,99,99,1,1,99,99,1,1,Aguascalientes,1,UMF ���8 ��AGUASCALIENTES,1221,1,0.25474650532025900000,10.42246530919970000000,2011-11-16,1
14058,1,UMF 8 Aguascalientes,1,16,11,11,19,40,19,57,32,1,1,9,1,1,3,3,1,1,2,2,5,8,1,2,,,,,1,3,,2,1,97,97,97,3,,,,2,1,2,1,1,1,1,1,1,3,1,1,2,2,2,2,2,1,2,2,2,2,2,2,3,2,,,,,,3,,,,,,,2,,,1,2,,,,,,1,2,1,2,2,3,,,,2,3,,,1,1,1,1,1,2,2,2,1,,2,2,3,3,1,2,2,2,1,1,1,2,95,,5,2,2,2,2,2,3,3,1,1,Aguascalientes,1,UMF ���8 ��AGUASCALIENTES,1221,1,0.25474650532025900000,13.19625317133590000000,2011-11-16,1
14065,1,UMF 8 Aguascalientes,1,16,11,11,11,0,11,15,37,2,2,5,1,2,2,2,1,1,2,4,4,8,3,2,,,,,1,1,1,1,1,1,1,1,2,2,2,2,1,1,3,1,1,1,1,1,1,1,1,1,2,1,2,2,2,1,2,2,2,2,2,2,2,2,,2,,,,2,,,,,,,2,,,1,2,,,,,,1,2,1,2,2,2,,,,2,1,,,2,2,2,2,4,99,99,99,1,,2,1,1,1,1,1,1,,1,1,1,1,,,5,1,1,1,1,1,1,1,1,1,Aguascalientes,1,UMF ���8 ��AGUASCALIENTES,1221,1,0.25474650532025900000,14.15051065291050000000,2011-11-16,1
14082,1,UMF 8 Aguascalientes,1,16,11,11,11,45,12,3,29,2,2,1,2,2,2,2,99,1,2,4,1,8,1,1,2,2,1,,1,1,1,1,1,97,97,97,1,,,,1,2,,,1,1,1,1,1,2,1,2,2,2,2,2,2,1,2,2,2,2,2,2,2,,,,,,,5,,,,,,,2,,,1,2,,,,,,1,2,1,2,2,1,,,,3,5,,,1,1,1,1,1,3,2,1,1,,2,2,99,3,1,1,1,,1,1,1,1,,,5,3,2,3,2,4,4,5,1,1,Aguascalientes,1,UMF ���8 ��AGUASCALIENTES,1221,1,0.25474650532025900000,14.50291143733460000000,2011-11-16,1
14036,1,UMF 8 Aguascalientes,1,16,11,11,18,13,18,27,18,2,1,7,4,2,1,1,1,1,1,1,6,9,1,2,,,,,1,1,3,3,1,2,1,2,1,,1,,1,1,3,1,1,1,1,2,1,1,1,1,2,2,2,2,2,1,2,2,2,1,1,2,3,1,,,,,,1,,,,1,1,,2,,,2,2,,,,,,1,2,1,2,2,2,,,,3,2,,,2,2,2,5,5,,,,1,,2,2,1,1,1,1,1,,1,1,2,,,,5,5,4,5,1,3,5,5,1,1,Aguascalientes,1,UMF ���8 ��AGUASCALIENTES,1221,1,0.25474650532025900000,14.93282087388830000000,2011-11-16,1
14765,1,UMF 8 Aguascalientes,1,16,11,11,19,5,19,21,59,1,2,3,5,1,2,1,2,1,2,3,1,9,3,2,,,,,1,1,1,1,1,1,1,1,2,2,2,2,4,2,,,1,1,1,1,1,2,1,1,2,2,2,2,2,1,2,2,2,2,2,2,2,2,,,,,,2,,,,,,,2,,,2,1,1,1,2,2,2,1,1,1,2,2,1,3,2,5,1,1,,,2,2,2,2,2,2,2,1,1,,2,1,1,2,1,1,1,,1,1,1,1,,,5,2,5,5,2,5,5,5,1,1,Aguascalientes,1,UMF ���8 ��AGUASCALIENTES,1221,1,0.25474650532025900000,15.54207916986900000000,2011-11-16,1
14034,1,UMF 8 Aguascalientes,1,16,11,11,16,49,17,4,34,1,2,9,4,1,2,2,2,2,2,4,4,9,1,2,,,,,1,2,1,1,1,1,1,1,2,2,2,2,2,1,2,1,1,1,1,2,1,3,1,1,2,2,2,1,1,1,2,2,2,2,2,2,2,2,,,,2,2,2,,,,,,,2,,,2,1,2,1,2,2,2,1,1,1,1,1,1,1,1,3,1,1,1,2,2,2,3,3,4,2,1,2,1,,2,1,2,2,1,1,1,,1,1,1,1,,,3,5,5,5,3,3,5,5,1,1,Aguascalientes,1,UMF ���8 ��AGUASCALIENTES,1221,1,0.25474650532025900000,13.19625317133590000000,2011-11-16,1
14062,1,UMF 8 Aguascalientes,1,16,11,11,9,20,9,34,27,1,2,3,5,1,2,2,1,1,2,3,2,10,1,2,,,,,1,1,1,1,1,1,1,2,2,2,2,,1,2,,,1,1,2,2,1,1,1,1,2,2,2,1,2,1,2,2,2,2,2,2,2,2,,,,2,,2,,,,,,,2,,,1,2,,,,,,1,1,1,2,2,1,3,2,2,2,2,,,2,2,2,2,2,2,1,2,1,,2,2,2,2,1,99,1,,1,1,1,1,,,3,5,3,5,1,1,5,5,1,1,Aguascalientes,1,UMF ���8 ��AGUASCALIENTES,1221,1,0.25474650532025900000,13.19625317133590000000,2011-11-16,1
14090,1,UMF 8 Aguascalientes,1,16,11,11,15,50,16,6,32,1,2,5,4,2,2,2,1,2,2,4,2,10,1,2,,,,,1,1,1,4,1,1,1,1,1,1,1,1,2,2,,,1,1,1,1,2,1,1,2,99,99,99,2,1,2,2,2,2,2,2,2,2,,,,,,2,,,,,,,,2,,,1,2,,,,,,1,1,1,2,2,1,1,1,2,2,2,,,1,1,1,1,1,1,1,1,1,,2,1,2,2,1,1,1,,1,1,1,1,,,2,1,1,1,1,1,1,1,1,1,Aguascalientes,1,UMF ���8 ��AGUASCALIENTES,1221,1,0.25474650532025900000,13.19625317133590000000,2011-11-16,1
14774,1,UMF 8 Aguascalientes,1,16,11,11,12,32,12,57,31,2,2,3,10,1,2,2,1,1,2,1,4,13,1,1,1,,1,,1,1,1,1,1,2,1,1,2,,3,2,2,1,3,1,1,1,2,1,1,1,1,1,2,2,2,2,2,2,2,2,2,2,2,2,2,2,,,,,,,,,,,,,2,,,2,2,,,,,,1,2,1,2,2,2,,,,2,2,,,2,2,1,4,4,1,2,1,1,,2,2,2,2,2,,,,,,1,1,,,5,2,3,3,2,5,5,5,1,1,Aguascalientes,1,UMF ���8 ��AGUASCALIENTES,1221,1,0.25474650532025900000,14.50291143733460000000,2011-11-16,1
14768,1,UMF 8 Aguascalientes,1,16,11,11,20,7,20,21,52,2,2,4,4,2,2,2,2,1,2,2,2,13,1,1,1,,1,,1,1,1,1,1,2,1,1,2,,1,1,1,1,2,1,1,1,2,1,1,2,1,1,2,2,2,2,2,1,2,2,2,2,2,2,1,1,,,,,,1,,,,,,,2,,,2,1,3,1,2,2,2,1,2,1,2,2,2,,,,2,2,,,3,2,3,3,3,2,2,1,1,,2,2,2,2,1,1,1,,1,1,1,1,,,5,4,5,5,3,5,5,5,1,1,Aguascalientes,1,UMF ���8 ��AGUASCALIENTES,1221,1,0.25474650532025900000,11.45447039970010000000,2011-11-16,1
14761,1,UMF 8 Aguascalientes,1,16,11,11,16,56,17,24,41,1,2,7,5,2,2,2,2,1,2,1,4,998,1,1,2,2,1,,1,1,1,1,1,2,1,1,2,,2,1,2,1,2,1,1,1,2,1,1,1,1,1,2,2,2,2,2,1,2,2,2,2,2,2,2,2,,,,,,2,,,,,,,2,,,2,1,2,1,2,2,2,1,2,1,2,2,2,,,,2,2,,,2,3,2,4,3,1,2,1,1,,2,1,1,1,1,2,1,,1,1,1,1,,,5,4,4,3,2,3,4,4,1,1,Aguascalientes,1,UMF ���8 ��AGUASCALIENTES,1221,1,0.25474650532025900000,12.87560238413830000000,2011-11-16,1
14762,1,UMF 8 Aguascalientes,1,16,11,11,17,32,17,54,22,1,2,5,5,1,1,1,1,1,2,3,1,998,2,1,2,3,1,,1,2,1,1,1,2,1,1,2,,2,1,1,1,2,1,1,1,2,2,1,1,1,1,2,2,2,1,2,1,2,2,2,2,2,2,2,2,,,,2,,2,,,,,,,2,,,2,1,1,2,2,2,2,1,1,1,1,2,2,5,3,5,2,2,2,,2,2,2,2,5,2,2,1,1,,2,1,2,2,1,2,1,,1,1,1,1,,,5,3,5,2,2,5,5,5,1,1,Aguascalientes,1,UMF ���8 ��AGUASCALIENTES,1221,1,0.25474650532025900000,13.58742936999240000000,2011-11-16,1
14064,1,UMF 8 Aguascalientes,1,16,11,11,10,20,10,34,54,1,2,3,5,1,1,1,1,1,2,4,2,998,1,2,,,,,1,1,1,1,1,1,1,1,1,1,3,3,2,2,,,1,1,2,2,2,2,1,1,2,2,2,2,2,1,2,2,2,2,2,2,2,2,,,,,,2,,,,,,,2,,,2,2,,,,,,1,1,1,2,2,1,2,4,4,2,4,,,3,3,3,3,3,2,2,2,1,,2,1,1,2,1,1,1,,1,1,1,2,2,3,5,1,1,4,1,1,4,5,1,1,Aguascalientes,1,UMF ���8 ��AGUASCALIENTES,1221,1,0.25474650532025900000,10.42246530919970000000,2011-11-16,1
14666,1,UMF 8 Aguascalientes,1,16,11,11,8,54,9,20,61,1,2,8,5,1,2,2,1,2,2,4,2,1,1,1,1,,2,1,1,1,1,1,1,1,1,1,3,2,1,1,2,2,,,1,1,1,1,1,1,1,1,2,2,2,2,2,1,2,2,2,2,2,2,2,2,,,,,,1,,,,,,,2,,,2,2,,,,,,1,2,1,2,2,2,,,,2,2,,,3,2,3,3,2,2,99,99,1,,2,2,2,2,1,1,1,,1,1,1,1,,,5,2,2,4,2,1,4,4,1,1,Aguascalientes,1,UMF ���8 ��AGUASCALIENTES,1221,1,0.25474650532025900000,15.54207916986900000000,2011-11-16,1
14665,1,UMF 8 Aguascalientes,1,16,11,11,8,27,8,43,31,1,2,5,5,2,2,2,2,1,2,4,2,998,1,1,1,,2,1,1,1,2,1,1,2,2,2,2,,,,2,2,,,1,1,2,2,2,1,1,1,2,2,2,2,2,1,2,2,2,2,2,2,2,2,,,,,,2,,,,,,,2,,,2,2,,,,,,1,1,1,2,2,2,3,3,2,3,3,,,2,2,2,2,2,2,99,99,1,,2,2,2,2,1,1,1,,1,1,1,2,1,2,5,2,2,4,2,1,3,4,1,1,Aguascalientes,1,UMF ���8 ��AGUASCALIENTES,1221,1,0.25474650532025900000,13.19625317133590000000,2011-11-16,1
14771,1,UMF 8 Aguascalientes,1,16,11,11,11,14,11,33,54,1,2,3,5,1,2,2,1,1,2,3,2,1,2,1,1,,2,2,1,1,1,1,1,2,1,1,3,,2,2,2,1,2,1,1,1,2,1,2,2,1,1,2,2,2,2,2,1,2,2,2,2,2,2,2,2,,,,,,2,,,,,,,2,,,2,1,2,1,2,2,2,1,2,1,2,2,2,,,,2,2,,,2,2,3,2,2,1,1,1,1,,2,2,1,2,1,3,1,,1,1,1,1,,,5,2,3,3,2,3,3,3,1,1,Aguascalientes,1,UMF ���8 ��AGUASCALIENTES,1221,1,0.25474650532025900000,10.42246530919970000000,2011-11-16,1
14083,1,UMF 8 Aguascalientes,1,16,11,11,12,10,12,27,27,1,2,3,5,2,2,2,2,1,2,4,2,2,1,1,1,,2,2,1,2,1,1,1,2,1,1,2,,1,1,2,1,1,1,1,1,1,1,1,1,1,1,2,2,2,2,2,1,2,2,2,2,2,2,2,2,,,,,,2,,,,,,,2,,,2,2,,,,,,1,2,1,2,2,2,,,,2,2,,,2,3,2,3,3,1,1,1,1,,2,1,1,1,1,1,1,,1,1,1,1,,,3,2,3,4,2,2,5,5,1,1,Aguascalientes,1,UMF ���8 ��AGUASCALIENTES,1221,1,0.25474650532025900000,13.19625317133590000000,2011-11-16,1
14051,1,UMF 8 Aguascalientes,1,16,11,11,14,4,14,18,59,1,2,1,5,2,1,1,1,1,2,1,5,10,1,1,2,2,2,2,1,1,1,1,1,2,2,2,3,,,,2,1,2,1,1,1,1,1,1,1,1,1,2,2,2,2,2,1,2,2,2,2,2,2,2,2,,,,,,2,,,,,,,2,,,2,2,,,,,,1,1,1,2,2,1,1,1,1,1,1,,,3,1,1,1,1,1,1,1,1,,2,1,1,1,1,1,1,,1,1,1,1,,,5,5,5,5,1,5,5,5,1,1,Aguascalientes,1,UMF ���8 ��AGUASCALIENTES,1221,1,0.25474650532025900000,15.54207916986900000000,2011-11-16,1
14764,1,UMF 8 Aguascalientes,1,16,11,11,18,44,19,0,68,2,2,3,9,1,3,2,2,2,2,4,6,13,1,1,2,99,2,2,1,2,1,2,1,1,1,2,4,2,2,,2,1,1,1,1,1,1,1,1,1,1,1,2,2,2,1,2,1,2,2,2,2,2,2,2,2,,,,2,,2,,,,,,,2,,,2,1,1,1,2,99,2,1,1,1,1,2,2,2,2,2,2,4,2,,2,2,2,2,2,2,2,2,1,,2,1,2,3,1,2,1,,1,1,1,1,,,5,1,1,1,4,1,4,4,1,1,Aguascalientes,1,UMF ���8 ��AGUASCALIENTES,1221,1,0.25474650532025900000,13.05249072964700000000,2011-11-16,1
15341,1,UMF 8 Aguascalientes,1,16,11,11,18,5,18,20,68,1,4,1,5,1,1,1,1,1,2,3,2,998,1,1,1,,2,2,1,1,1,1,1,1,1,1,2,2,2,2,1,1,2,1,1,1,2,1,1,99,1,1,2,2,2,2,2,1,2,2,2,2,2,2,2,2,,,,,,2,,,,,,,2,,,2,1,2,2,2,2,2,1,2,1,2,2,2,,,,2,2,,,2,2,2,2,2,1,1,1,1,,2,2,1,1,1,1,1,,1,1,1,1,,,5,2,2,2,1,5,2,4,1,1,Aguascalientes,1,UMF ���8 ��AGUASCALIENTES,1221,1,0.25474650532025900000,11.87650996347750000000,2011-11-16,1
14670,1,UMF 8 Aguascalientes,1,16,11,11,10,41,10,52,27,1,2,7,5,2,2,2,2,1,2,3,2,998,3,1,1,,2,2,1,1,1,2,1,2,1,1,2,,2,2,1,1,2,1,1,1,2,1,1,1,1,1,2,2,2,2,2,1,2,2,2,2,2,2,2,2,,,,,,2,,,,,,,2,,,2,1,4,1,2,2,2,1,2,1,2,2,2,,,,2,2,,,2,2,2,2,2,2,2,1,1,,2,1,1,2,1,1,1,,1,1,1,1,,,5,2,3,4,2,5,3,3,1,1,Aguascalientes,1,UMF ���8 ��AGUASCALIENTES,1221,1,0.25474650532025900000,13.19625317133590000000,2011-11-16,1
14680,1,UMF 8 Aguascalientes,1,16,11,11,14,0,14,20,61,1,4,3,5,2,2,2,2,1,2,3,2,1,1,1,1,,2,3,1,1,2,1,1,1,1,1,2,2,2,2,2,2,,,1,1,2,1,1,1,1,1,2,2,1,2,2,1,2,1,2,2,2,2,2,3,,,2,,,2,,2,,,,,2,,,2,2,,,,,,1,1,1,2,2,2,2,3,2,2,2,,,2,2,2,2,2,2,99,99,1,,2,2,2,2,1,99,99,99,1,1,1,1,,,5,4,4,5,2,2,4,5,1,1,Aguascalientes,1,UMF ���8 ��AGUASCALIENTES,1221,1,0.25474650532025900000,15.54207916986900000000,2011-11-16,1
14789,1,UMF 8 Aguascalientes,1,16,11,11,19,18,19,37,50,1,2,5,2,2,2,3,2,1,2,4,2,2,1,1,2,3,2,3,1,2,1,1,1,1,1,1,2,2,2,2,2,1,3,1,1,2,2,1,1,2,1,1,2,2,2,2,2,1,2,2,2,2,2,2,1,2,,,,,,2,,,,,,,2,,,2,1,2,1,2,2,2,1,1,1,2,2,3,2,2,3,2,2,,,2,2,2,2,99,1,1,99,1,,2,99,1,2,1,1,1,,2,,1,1,,,1,4,2,5,2,1,5,4,1,1,Aguascalientes,1,UMF ���8 ��AGUASCALIENTES,1221,1,0.25474650532025900000,10.42246530919970000000,2011-11-16,1
14788,1,UMF 8 Aguascalientes,1,16,11,11,19,2,19,13,21,1,2,5,5,2,2,1,99,99,2,4,2,3,1,1,1,,2,3,1,1,1,1,1,1,1,1,2,2,2,2,1,1,2,1,1,1,2,1,1,1,1,1,2,2,2,1,2,1,2,2,2,2,2,2,2,2,,,,2,,2,,,,,,,2,,,2,1,4,1,2,2,2,1,2,1,1,2,2,,,,1,99,1,,2,2,2,2,2,99,1,1,1,,2,2,2,2,1,1,2,3,1,2,1,2,4,1,3,1,1,4,1,1,1,4,1,1,Aguascalientes,1,UMF ���8 ��AGUASCALIENTES,1221,1,0.25474650532025900000,13.58742936999240000000,2011-11-16,1
14772,1,UMF 8 Aguascalientes,1,16,11,11,11,39,11,56,53,1,2,3,5,1,3,3,3,2,2,3,2,1,3,1,2,3,2,4,1,1,1,1,1,2,1,1,2,,2,2,2,1,2,1,1,1,2,1,1,2,1,1,2,2,2,2,2,1,2,2,2,2,2,2,2,2,,,,,,3,,,,,,,2,,,2,1,4,2,4,2,4,1,2,1,2,2,2,,,,2,2,,,2,3,2,3,3,1,2,1,1,,2,2,2,2,1,3,1,,1,1,1,1,,,5,5,4,4,3,5,5,5,1,1,Aguascalientes,1,UMF ���8 ��AGUASCALIENTES,1221,1,0.25474650532025900000,10.42246530919970000000,2011-11-16,1
14068,1,UMF 8 Aguascalientes,1,16,11,11,12,17,12,34,58,1,2,1,5,2,1,1,2,2,2,4,2,1,1,1,1,,2,4,1,1,1,1,1,2,1,1,1,,1,1,1,1,1,2,1,2,1,2,1,1,1,1,2,2,2,2,2,1,2,2,2,2,2,2,2,1,,,,,,1,,,,,,,2,,,1,2,,,,,,1,2,1,2,2,1,,,,2,3,,,1,1,1,1,5,99,99,99,1,,2,1,1,1,1,1,1,,1,1,1,1,,,3,1,1,2,1,1,2,5,1,1,Aguascalientes,1,UMF ���8 ��AGUASCALIENTES,1221,1,0.25474650532025900000,15.54207916986900000000,2011-11-16,1
14086,1,UMF 8 Aguascalientes,1,16,11,11,13,24,13,48,71,2,2,3,9,1,2,2,2,2,2,4,2,1,1,1,1,,2,4,1,1,1,1,1,2,1,1,2,,1,1,1,1,2,1,1,1,1,1,1,1,1,1,2,2,2,2,2,1,2,2,2,1,2,2,3,1,,,,,,3,,,,2,,,2,,,2,1,1,1,2,2,2,1,2,1,2,2,1,,,,1,1,,,1,1,1,1,1,1,2,2,1,,2,2,1,2,1,1,1,,1,1,1,1,,,1,1,1,5,1,1,5,5,1,1,Aguascalientes,1,UMF ���8 ��AGUASCALIENTES,1221,1,0.25474650532025900000,13.05249072964700000000,2011-11-16,1
14061,1,UMF 8 Aguascalientes,1,16,11,11,8,44,9,0,22,1,2,5,5,2,2,2,2,99,2,3,2,3,1,1,1,,2,4,1,1,1,1,1,2,2,2,2,,,,1,2,,,1,1,2,1,1,99,1,1,2,2,2,2,2,1,2,2,2,2,2,2,3,2,,,,,,2,,,,,,,2,,,2,2,,,,,,1,1,1,2,2,1,2,2,2,3,2,,,2,2,2,2,2,2,1,2,1,,2,1,1,2,1,1,1,,1,1,1,1,,,3,1,1,2,2,2,5,5,1,1,Aguascalientes,1,UMF ���8 ��AGUASCALIENTES,1221,1,0.25474650532025900000,13.58742936999240000000,2011-11-16,1