Folio,Deleg,Unidmed,Id_Unid,Fecha_D,Fecha_M,Fecha_A,Hr_Ini_H,Hr_Ini_M,Hr_Fin_H,Hr_Fin_M,Servatn,Tipopac,Sat1,Sat1_Mot1,Sat1_Mot2,Sat1_Mot3,Sat3,Probsal,Semambe,Cartembe,Utilcartembe,Portale,Ingportale,Infoportale,Anticoncepe,Noanticoncepe,Tourobse,Infotourobse,Cartembp,Utilcartembp,Portalp,Ingportalp,Infoportalp,Tourobsp,Infotourobsp,Comunincomp,Motcomunincomp1,Motcomunincomp2,Motcomunincomp3,Infoprocp,Anticoncepp,Noanticoncepp,Tactop,Autortactop,Metdolor,Presentp,Dudasemb,Infoedosaludp,Infomabbp,Califembp,Motcalifembp1,Motcalifembp2,Motcalifembp3,Citapre,Diascita,Antescita,Motivoant,Hrcita,Tmesphoci,Satiemhoci,Tmedreg2,Satiemesp,Durasis_C,Preosad,Tratocomf,Comincomcons,Consdesp,Filtrosaux1,Temsad1,Filtrosaux2,Temsad2,Recmedhoy,Filtrofarm2,Totmed,Motnosurt,Btratou,Btratou_Mot1,Btratou_Mot2,Btratou_Mot3,Calfatna_A,Calfatnb_A,Calfatna_C,Calfatnb_C,Calfatna_E,Calfatnb_E,Calfatna_G,Calfatnb_G,Calfatna_H,Calfatnb_H,Calfatna_N,Calfatnb_N,Calfatna_K,Calfatnb_K,Calfatna_L,Calfatnb_L,Calfatna_J,Calfatnb_J,Calfatna_M,Calfatnb_M,Calfatna_O,Calfatnb_O,Calfatna_Q,Calfatnb_Q,Calfatna_F,Calfatnb_F,Mottratot1,Mottratot2,Mottratot3,Mottratot4,Mottratot5,Saludar,Escuchar,Responder,Tiemuv,Mejoratratou,Gafet,Amable,Calfinmb_F,Limp1,Limp2,Recomej_A,Recomej_B,Recomej_C,Turno,Edad,Edad_C,Sexo,Escolar,Ocupa,Id_Unidad,Cve_Delegaci�N,Delegaci�N,Nivel,Unidad,Promedio_Diario2017,Estrato,Moscondia,Fe_Finalnr,Fecha,Entidad
2001,1,UMF 1 Aguascalientes,2,31,10,2018,13,40,13,48,1,1,1,,,,1,1,32,1,1,3,,,1,,,,,,,,,,,,,,,,,,,,,,,,,,,,,1,4,1,5,1,,,1,2,1,1,2,2,1,1,3,2,,1,1,1,,2,,,,1,10,1,10,2,,2,,2,,1,9,2,,2,,2,,2,,2,,2,,2,,,,,,,1,1,1,2,2,1,1,1,2,1,13,,,1,29,,1,5,4,2,1,Aguascalientes,1,UMF 1 Aguascalientes,1443,1,0.213335305,21.9384859621511,2018-10-31,1
2002,1,UMF 1 Aguascalientes,2,31,10,2018,13,8,13,28,1,1,2,,,,2,3,,,,,,,,,,,,,,,,,,,,,,,,,,,,,,,,,,,,1,4,1,1,1,,,1,1,1,1,2,2,1,1,1,2,,1,1,1,,2,,,,1,10,1,10,2,,2,,2,,1,10,2,,2,,2,,2,,2,,2,,2,,,,,,,1,1,1,2,2,1,1,3,6,,13,,,1,45,,1,9,2,2,1,Aguascalientes,1,UMF 1 Aguascalientes,1443,1,0.213335305,23.3164750765878,2018-10-31,1
2003,1,UMF 1 Aguascalientes,2,31,10,2018,11,4,11,19,1,1,1,,,,1,3,,,,,,,,,,,,,,,,,,,,,,,,,,,,,,,,,,,,1,4,1,1,1,,,2,1,2,1,2,2,1,2,,2,,1,1,1,,1,,,,2,,1,10,2,,2,,2,,1,10,2,,2,,2,,2,,2,,2,,2,,,,,,,1,1,1,2,2,1,1,2,6,,1,,,1,80,,1,9,5,2,1,Aguascalientes,1,UMF 1 Aguascalientes,1443,1,0.213335305,21.8971772020417,2018-10-31,1
2004,1,UMF 1 Aguascalientes,2,31,10,2018,9,41,9,56,1,1,1,,,,1,4,,,,,,,,,,,,,,,,,,,,,,,,,,,,,,,,,,,,1,4,1,1,1,,,1,1,1,2,2,2,1,2,,2,,1,1,1,,1,,,,1,10,1,10,2,,2,,2,,1,9,2,,2,,2,,99,,2,,2,,2,,,,,,,1,1,1,2,2,1,1,3,6,,3,,,1,73,,2,5,9,2,1,Aguascalientes,1,UMF 1 Aguascalientes,1443,1,0.213335305,22.5782648416754,2018-10-31,1
2005,1,UMF 1 Aguascalientes,2,31,10,2018,11,22,11,37,1,1,1,,,,1,4,,,,,,,,,,,,,,,,,,,,,,,,,,,,,,,,,,,,1,4,1,1,1,,,1,1,1,1,2,2,1,2,,2,,1,1,1,,2,,,,1,10,1,10,2,,2,,2,,1,10,2,,2,,2,,1,10,2,,2,,2,,,,,,,1,1,1,2,2,1,1,1,1,1,995,,,1,60,,1,7,9,2,1,Aguascalientes,1,UMF 1 Aguascalientes,1443,1,0.213335305,22.8597434567572,2018-10-31,1
2006,1,UMF 1 Aguascalientes,2,31,10,2018,12,28,12,43,1,1,2,,,,2,4,,,,,,,,,,,,,,,,,,,,,,,,,,,,,,,,,,,,1,3,1,1,3,3,4,1,4,1,1,2,2,1,2,,2,,1,1,1,,2,,,,1,9,1,10,2,,2,,2,,1,9,2,,2,,2,,2,,2,,2,,2,,,,,,,1,1,99,2,1,1,1,2,6,,10,9,,1,49,,1,7,5,2,1,Aguascalientes,1,UMF 1 Aguascalientes,1443,1,0.213335305,23.3164750765878,2018-10-31,1
2007,1,UMF 1 Aguascalientes,2,31,10,2018,16,41,16,56,1,1,2,,,,2,4,,,,,,,,,,,,,,,,,,,,,,,,,,,,,,,,,,,,1,4,1,1,3,1,4,1,4,1,2,2,2,1,2,,2,,1,1,1,,3,3,,,1,9,1,9,2,,2,,2,,1,8,2,,2,,2,,2,,2,,2,,2,,,,,,,99,1,1,2,2,99,1,2,2,1,9,37,,2,57,,1,9,1,2,1,Aguascalientes,1,UMF 1 Aguascalientes,1443,1,0.213335305,22.8597434567572,2018-10-31,1
2008,1,UMF 1 Aguascalientes,2,31,10,2018,17,44,18,9,1,1,2,,,,2,4,,,,,,,,,,,,,,,,,,,,,,,,,,,,,,,,,,,,1,4,1,1,2,,,1,2,1,1,2,2,1,2,,2,,1,1,1,,2,,,,1,5,1,10,2,,2,,2,,1,10,2,,2,,2,,2,,2,,2,,2,,,,,,,1,1,1,1,2,1,1,2,6,,1,,,2,69,,1,3,5,2,1,Aguascalientes,1,UMF 1 Aguascalientes,1443,1,0.213335305,21.8971772020417,2018-10-31,1
2009,1,UMF 1 Aguascalientes,2,31,10,2018,18,35,18,58,1,1,2,,,,2,4,,,,,,,,,,,,,,,,,,,,,,,,,,,,,,,,,,,,1,3,1,1,1,,,1,1,1,1,2,2,1,2,,2,,1,1,1,,2,,,,1,10,1,10,2,,2,,2,,1,10,2,,2,,2,,2,,2,,2,,2,,,,,,,1,1,1,5,2,2,1,2,6,,1,18,,2,51,,2,5,4,2,1,Aguascalientes,1,UMF 1 Aguascalientes,1443,1,0.213335305,24.0417084173040,2018-10-31,1
2010,1,UMF 1 Aguascalientes,2,31,10,2018,8,28,8,43,1,1,2,,,,1,4,,,,,,,,,,,,,,,,,,,,,,,,,,,,,,,,,,,,2,,,,,,,2,2,1,1,2,2,1,2,,2,,1,1,1,,1,,,,1,10,1,10,2,,2,,2,,1,10,2,,2,,1,10,2,,2,,2,,2,,,,,,,1,1,1,1,1,1,1,2,2,1,9,,,1,54,,2,3,2,2,1,Aguascalientes,1,UMF 1 Aguascalientes,1443,1,0.213335305,24.0417084173040,2018-10-31,1
2011,1,UMF 1 Aguascalientes,2,31,10,2018,10,40,10,55,1,1,1,,,,1,4,,,,,,,,,,,,,,,,,,,,,,,,,,,,,,,,,,,,1,3,1,4,1,,,1,1,1,1,2,2,1,1,2,2,,1,1,1,,1,,,,1,10,1,10,2,,2,,2,,1,10,2,,2,,2,,2,,2,,2,,2,,,,,,,1,1,1,1,1,1,1,2,6,,5,,,1,22,,1,9,2,2,1,Aguascalientes,1,UMF 1 Aguascalientes,1443,1,0.213335305,23.5887667059508,2018-10-31,1
2012,1,UMF 1 Aguascalientes,2,31,10,2018,12,22,12,37,1,1,2,,,,2,4,,,,,,,,,,,,,,,,,,,,,,,,,,,,,,,,,,,,1,2,1,4,1,,,3,2,1,1,2,2,1,1,2,2,,2,,,,2,,,,1,9,1,9,2,,2,,2,,2,,2,,2,,2,,2,,2,,2,,2,,,,,,,1,1,1,1,2,1,1,2,2,1,995,,,1,19,,1,5,4,2,1,Aguascalientes,1,UMF 1 Aguascalientes,1443,1,0.213335305,23.5887667059508,2018-10-31,1
2013,1,UMF 1 Aguascalientes,2,31,10,2018,12,57,13,12,1,1,2,,,,2,4,,,,,,,,,,,,,,,,,,,,,,,,,,,,,,,,,,,,1,2,1,1,1,,,1,2,1,1,2,2,1,2,,2,,1,1,1,,2,,,,1,10,1,10,2,,2,,2,,1,10,2,,2,,2,,2,,1,10,2,,2,,,,,,,1,1,1,2,1,1,1,2,2,1,9,,,1,53,,1,3,5,2,1,Aguascalientes,1,UMF 1 Aguascalientes,1443,1,0.213335305,23.3164750765878,2018-10-31,1
2014,1,UMF 1 Aguascalientes,2,31,10,2018,13,58,14,13,1,1,2,,,,2,4,,,,,,,,,,,,,,,,,,,,,,,,,,,,,,,,,,,,1,4,1,4,1,,,2,2,1,1,2,2,1,1,3,2,,1,1,1,,1,,,,1,10,1,10,2,,2,,2,,1,10,2,,2,,2,,2,,2,,2,,2,,,,,,,1,1,1,2,1,1,1,1,6,,995,,,1,73,,2,1,9,2,1,Aguascalientes,1,UMF 1 Aguascalientes,1443,1,0.213335305,22.5782648416754,2018-10-31,1
2015,1,UMF 1 Aguascalientes,2,31,10,2018,19,38,19,53,1,1,2,,,,2,4,,,,,,,,,,,,,,,,,,,,,,,,,,,,,,,,,,,,1,4,3,4,1,,,5,2,2,1,2,2,1,2,,2,,1,1,1,,2,,,,1,9,1,9,2,,2,,2,,1,9,2,,2,,2,,2,,2,,2,,2,,,,,,,1,1,1,2,2,1,1,2,2,1,8,,,2,61,,1,7,5,2,1,Aguascalientes,1,UMF 1 Aguascalientes,1443,1,0.213335305,22.8597434567572,2018-10-31,1
2016,1,UMF 1 Aguascalientes,2,31,10,2018,13,54,14,7,1,1,4,8,,,4,4,,,,,,,,,,,,,,,,,,,,,,,,,,,,,,,,,,,,1,4,1,1,3,3,4,4,4,2,1,2,1,1,1,1,2,,1,1,2,1,2,,,,1,10,1,10,2,,2,,2,,1,10,2,,2,,2,,2,,2,,2,,2,,,,,,,1,1,1,1,2,1,1,2,6,,1,,,2,44,,1,5,5,2,1,Aguascalientes,1,UMF 1 Aguascalientes,1443,1,0.213335305,24.8133888736180,2018-10-31,1
2017,1,UMF 1 Aguascalientes,2,31,10,2018,11,22,11,43,1,2,4,1,,,3,5,,,,,,,,,,,,,,,,,,,,,,,,,,,,,,,,,,,,1,3,3,4,1,,,4,2,1,1,2,2,1,2,,2,,1,1,1,,2,,,,1,10,1,10,2,,2,,2,,1,10,2,,2,,2,,2,,2,,2,,2,,,,,,,1,1,1,4,2,1,1,2,4,2,79,,,1,38,,2,5,4,2,1,Aguascalientes,1,UMF 1 Aguascalientes,1443,1,0.213335305,25.5851820734131,2018-10-31,1
2018,1,UMF 1 Aguascalientes,2,31,10,2018,8,8,8,24,1,1,2,,,,2,21,,,,,,,,,,,,,,,,,,,,,,,,,,,,,,,,,,,,1,4,1,1,1,,,1,2,1,1,2,2,1,2,,2,,1,1,1,,2,,,,1,10,1,10,2,,2,,2,,1,10,2,,2,,2,,2,,2,,2,,2,,,,,,,1,1,1,3,2,2,1,2,6,,995,,,1,64,,1,3,5,2,1,Aguascalientes,1,UMF 1 Aguascalientes,1443,1,0.213335305,22.8597434567572,2018-10-31,1
2019,1,UMF 1 Aguascalientes,2,31,10,2018,8,25,8,40,1,2,2,,,,2,5,,,,,,,,,,,,,,,,,,,,,,,,,,,,,,,,,,,,2,,,,,,,2,2,2,2,2,2,1,2,,2,,1,1,1,,2,,,,1,10,1,10,2,,2,,2,,1,10,2,,2,,2,,2,,2,,2,,2,,,,,,,2,2,1,1,1,1,1,2,6,,1,,,1,37,,1,8,5,2,1,Aguascalientes,1,UMF 1 Aguascalientes,1443,1,0.213335305,24.8133888736180,2018-10-31,1
2020,1,UMF 1 Aguascalientes,2,31,10,2018,8,57,9,12,1,1,2,,,,2,27,,,,,,,,,,,,,,,,,,,,,,,,,,,,,,,,,,,,1,4,1,1,1,,,1,2,1,1,2,2,1,2,,2,,1,1,1,,2,,,,1,10,1,8,2,,2,,2,,1,10,2,,2,,2,,2,,2,,2,,99,,,,,,,1,1,1,3,1,1,2,2,6,,995,,,1,78,,1,3,5,2,1,Aguascalientes,1,UMF 1 Aguascalientes,1443,1,0.213335305,21.8971772020417,2018-10-31,1
2021,1,UMF 1 Aguascalientes,2,31,10,2018,9,49,9,56,1,1,2,,,,2,41,,,,,,,,,,,,,,,,,,,,,,,,,,,,,,,,,,,,1,1,1,1,3,1,2,1,2,1,1,2,2,1,1,4,2,,2,,,,1,,,,1,10,1,10,2,,2,,2,,2,,2,,2,,2,,2,,2,,2,,2,,,,,,,1,1,1,3,3,1,1,2,6,,8,9,10,1,19,,2,6,6,2,1,Aguascalientes,1,UMF 1 Aguascalientes,1443,1,0.213335305,24.3224693786463,2018-10-31,1
2022,1,UMF 1 Aguascalientes,2,31,10,2018,10,52,10,59,1,1,2,,,,2,20,,,,,,,,,,,,,,,,,,,,,,,,,,,,,,,,,,,,1,1,1,1,3,2,3,1,2,1,1,2,2,1,2,,2,,1,1,1,,2,,,,1,10,1,10,2,,2,,2,,1,9,2,,2,,2,,2,,2,,2,,2,,,,,,,1,1,1,3,1,1,1,3,6,,1,3,8,1,47,,1,3,4,2,1,Aguascalientes,1,UMF 1 Aguascalientes,1443,1,0.213335305,23.3164750765878,2018-10-31,1
2023,1,UMF 1 Aguascalientes,2,31,10,2018,10,59,11,14,1,1,2,,,,2,27,,,,,,,,,,,,,,,,,,,,,,,,,,,,,,,,,,,,1,4,1,1,3,3,2,2,2,2,1,2,2,1,2,,2,,1,1,1,,3,1,,,1,8,1,8,2,,2,,2,,1,8,2,,2,,2,,2,,2,,2,,2,,,,,,,1,1,1,2,1,2,1,3,6,,995,,,1,52,,1,6,5,2,1,Aguascalientes,1,UMF 1 Aguascalientes,1443,1,0.213335305,23.3164750765878,2018-10-31,1
2024,1,UMF 1 Aguascalientes,2,31,10,2018,12,10,12,20,1,1,4,14,,,2,7,,,,,,,,,,,,,,,,,,,,,,,,,,,,,,,,,,,,1,1,1,1,99,1,2,1,2,1,1,2,2,2,2,,2,,2,,,,2,,,,1,10,1,10,2,,2,,2,,2,,2,,1,8,2,,2,,2,,2,,2,,,,,,,1,1,1,3,2,1,2,99,6,,995,,,1,18,,1,5,4,2,1,Aguascalientes,1,UMF 1 Aguascalientes,1443,1,0.213335305,23.5887667059508,2018-10-31,1
2025,1,UMF 1 Aguascalientes,2,31,10,2018,12,35,12,45,1,1,2,,,,2,21,,,,,,,,,,,,,,,,,,,,,,,,,,,,,,,,,,,,1,1,1,1,3,2,2,2,2,1,1,2,2,1,2,,2,,1,1,1,,2,,,,1,8,1,10,2,,2,,2,,1,10,2,,2,,2,,2,,2,,2,,1,10,,,,,,1,1,1,2,3,1,1,2,2,1,1,3,14,1,54,,1,5,5,2,1,Aguascalientes,1,UMF 1 Aguascalientes,1443,1,0.213335305,23.3164750765878,2018-10-31,1
2026,1,UMF 1 Aguascalientes,2,31,10,2018,12,55,13,15,1,1,4,1,8,,2,7,,,,,,,,,,,,,,,,,,,,,,,,,,,,,,,,,,,,2,,,,,,,1,4,2,2,2,2,2,2,,2,,1,1,1,,2,,,,1,7,1,9,2,,2,,2,,1,8,2,,1,6,1,8,2,,2,,2,,1,8,,,,,,2,1,1,1,1,1,2,3,6,,1,13,3,1,44,,1,7,5,2,1,Aguascalientes,1,UMF 1 Aguascalientes,1443,1,0.213335305,24.8133888736180,2018-10-31,1
2027,1,UMF 1 Aguascalientes,2,31,10,2018,14,21,14,30,1,1,4,14,,,2,69,,,,,,,,,,,,,,,,,,,,,,,,,,,,,,,,,,,,2,,,,,,,5,4,2,2,2,2,1,2,,2,,1,1,1,,2,,,,1,10,1,10,2,,2,,2,,1,10,2,,2,,2,,2,,2,,2,,2,,,,,,,1,1,1,1,2,2,1,3,3,2,1,14,,1,42,,1,4,4,2,1,Aguascalientes,1,UMF 1 Aguascalientes,1443,1,0.213335305,24.8133888736180,2018-10-31,1
2028,1,UMF 1 Aguascalientes,2,31,10,2018,14,32,14,43,1,2,2,,,,2,7,,,,,,,,,,,,,,,,,,,,,,,,,,,,,,,,,,,,1,1,1,1,1,,,1,2,2,2,2,2,1,2,,2,,2,,,,2,,,,1,9,1,9,2,,2,,2,,2,,2,,2,,2,,2,,2,,2,,2,,,,,,,1,1,1,4,2,2,1,3,6,,995,,,2,34,,1,6,4,2,1,Aguascalientes,1,UMF 1 Aguascalientes,1443,1,0.213335305,21.9384859621511,2018-10-31,1
2029,1,UMF 1 Aguascalientes,2,31,10,2018,14,48,15,3,1,2,2,,,,2,7,,,,,,,,,,,,,,,,,,,,,,,,,,,,,,,,,,,,1,1,1,1,3,4,4,1,2,1,1,2,2,1,2,,2,,1,1,1,,2,,,,1,9,1,10,2,,2,,2,,2,,2,,2,,99,,2,,2,,2,,2,,,,,,,2,1,1,3,2,1,1,2,2,2,13,3,1,2,37,,1,7,4,2,1,Aguascalientes,1,UMF 1 Aguascalientes,1443,1,0.213335305,24.8133888736180,2018-10-31,1
2030,1,UMF 1 Aguascalientes,2,31,10,2018,16,19,16,34,1,1,2,,,,2,79,,,,,,,,,,,,,,,,,,,,,,,,,,,,,,,,,,,,2,,,,,,,1,2,1,1,2,2,1,2,,2,,1,1,1,,2,,,,1,9,1,9,2,,2,,2,,1,8,2,,2,,2,,2,,2,,2,,2,,,,,,,1,1,1,3,2,1,1,2,6,,8,,,1,19,,1,6,6,2,1,Aguascalientes,1,UMF 1 Aguascalientes,1443,1,0.213335305,23.5887667059508,2018-10-31,1
2031,1,UMF 1 Aguascalientes,2,31,10,2018,17,52,18,0,1,1,2,,,,2,7,,,,,,,,,,,,,,,,,,,,,,,,,,,,,,,,,,,,2,,,,,,,1,2,1,1,2,2,1,2,,2,,1,1,1,,2,,,,1,10,1,10,2,,2,,2,,1,10,2,,2,,2,,2,,2,,2,,2,,,,,,,1,1,1,1,1,1,1,2,6,,1,,,2,32,,1,7,5,2,1,Aguascalientes,1,UMF 1 Aguascalientes,1443,1,0.213335305,21.9384859621511,2018-10-31,1
2032,1,UMF 1 Aguascalientes,2,31,10,2018,18,12,18,31,1,1,2,,,,2,7,,,,,,,,,,,,,,,,,,,,,,,,,,,,,,,,,,,,1,1,1,1,1,,,1,2,1,1,2,1,2,2,,2,,1,1,1,,2,,,,1,5,1,9,2,,2,,2,,1,10,2,,2,,2,,2,,2,,2,,2,,,,,,,1,1,1,2,1,2,1,2,6,,1,8,9,2,27,,1,7,4,2,1,Aguascalientes,1,UMF 1 Aguascalientes,1443,1,0.213335305,21.9384859621511,2018-10-31,1
2033,1,UMF 1 Aguascalientes,2,31,10,2018,18,33,18,41,1,1,2,,,,2,7,,,,,,,,,,,,,,,,,,,,,,,,,,,,,,,,,,,,2,,,,,,,1,2,2,2,2,2,1,2,,2,,1,1,1,,1,,,,1,10,1,10,2,,2,,2,,1,10,2,,2,,2,,2,,2,,2,,2,,,,,,,1,1,1,5,1,2,1,2,6,,12,,,2,57,,1,7,5,2,1,Aguascalientes,1,UMF 1 Aguascalientes,1443,1,0.213335305,22.8597434567572,2018-10-31,1
2034,1,UMF 1 Aguascalientes,2,31,10,2018,18,42,18,57,1,1,2,,,,2,7,,,,,,,,,,,,,,,,,,,,,,,,,,,,,,,,,,,,1,3,2,1,1,,,2,1,1,1,2,2,1,2,,2,,2,,,,2,,,,1,8,1,8,2,,2,,2,,2,,2,,2,,2,,2,,2,,2,,2,,,,,,,1,1,1,2,1,2,1,3,6,,1,3,4,2,66,,1,5,9,2,1,Aguascalientes,1,UMF 1 Aguascalientes,1443,1,0.213335305,21.8971772020417,2018-10-31,1
2035,1,UMF 1 Aguascalientes,2,31,10,2018,8,36,8,44,1,2,2,,,,2,5,,,,,,,,,,,,,,,,,,,,,,,,,,,,,,,,,,,,2,,,,,,,3,4,1,1,2,2,1,2,,2,,1,1,1,,2,,,,1,6,1,10,2,,2,,2,,1,10,2,,2,,2,,2,,2,,2,,2,,,,,,,1,2,1,2,3,1,2,4,4,2,1,13,,1,33,,1,3,5,2,1,Aguascalientes,1,UMF 1 Aguascalientes,1443,1,0.213335305,21.9384859621511,2018-10-31,1
2036,1,UMF 1 Aguascalientes,2,31,10,2018,9,13,9,28,1,1,2,,,,2,20,,,,,,,,,,,,,,,,,,,,,,,,,,,,,,,,,,,,2,,,,,,,4,2,1,1,2,2,2,1,1,2,,1,1,1,,2,,,,1,5,1,9,2,,2,,2,,1,10,1,10,2,,2,,2,,2,,2,,2,,,,,,,2,1,1,1,2,99,1,2,6,,999,,,1,37,,1,5,4,2,1,Aguascalientes,1,UMF 1 Aguascalientes,1443,1,0.213335305,24.8133888736180,2018-10-31,1
2037,1,UMF 1 Aguascalientes,2,31,10,2018,10,34,10,43,1,1,2,,,,2,11,,,,,,,,,,,,,,,,,,,,,,,,,,,,,,,,,,,,1,3,1,1,1,,,1,2,1,1,2,2,1,2,,2,,1,1,1,,2,,,,1,9,1,9,2,,2,,2,,1,9,2,,2,,2,,99,,99,,99,,2,,,,,,,1,1,1,2,2,1,1,2,6,,9,,,1,45,,1,7,1,2,1,Aguascalientes,1,UMF 1 Aguascalientes,1443,1,0.213335305,23.3164750765878,2018-10-31,1
2038,1,UMF 1 Aguascalientes,2,31,10,2018,10,48,11,3,1,1,2,,,,2,26,,,,,,,,,,,,,,,,,,,,,,,,,,,,,,,,,,,,2,,,,,,,2,2,1,1,2,2,1,1,1,1,1,1,1,1,,1,,,,1,10,1,9,2,,2,,2,,1,10,2,,2,,2,,2,,2,,2,,2,,,,,,,1,1,1,2,1,1,1,1,6,,8,,,1,26,,2,5,4,2,1,Aguascalientes,1,UMF 1 Aguascalientes,1443,1,0.213335305,22.6208584653844,2018-10-31,1
2039,1,UMF 1 Aguascalientes,2,31,10,2018,11,59,12,14,1,1,2,,,,2,10,,,,,,,,,,,,,,,,,,,,,,,,,,,,,,,,,,,,1,3,1,1,1,,,1,1,1,1,2,2,1,2,,2,,1,1,1,,1,,,,1,10,1,10,2,,2,,2,,1,10,2,,2,,2,,1,10,1,10,2,,1,10,,,,,,1,1,1,2,2,1,1,3,6,,13,,,1,53,,1,5,5,2,1,Aguascalientes,1,UMF 1 Aguascalientes,1443,1,0.213335305,23.3164750765878,2018-10-31,1
2040,1,UMF 1 Aguascalientes,2,31,10,2018,13,28,13,43,1,1,2,,,,2,6,,,,,,,,,,,,,,,,,,,,,,,,,,,,,,,,,,,,2,,,,,,,2,2,1,1,2,2,1,2,,2,,1,1,1,,2,,,,1,10,1,10,2,,2,,2,,1,10,2,,2,,2,,2,,2,,2,,2,,,,,,,1,1,1,5,2,99,1,1,6,,999,,,1,22,,2,7,4,2,1,Aguascalientes,1,UMF 1 Aguascalientes,1443,1,0.213335305,24.3224693786463,2018-10-31,1
2041,1,UMF 1 Aguascalientes,2,31,10,2018,16,7,16,22,1,1,2,,,,2,45,,,,,,,,,,,,,,,,,,,,,,,,,,,,,,,,,,,,2,,,,,,,3,2,1,1,2,2,1,2,,1,1,1,1,1,,1,,,,1,9,1,10,2,,2,,2,,1,9,2,,2,,2,,2,,99,,2,,2,,,,,,,1,1,1,1,2,1,1,3,2,1,995,,,2,74,,1,3,5,2,1,Aguascalientes,1,UMF 1 Aguascalientes,1443,1,0.213335305,21.8971772020417,2018-10-31,1
2042,1,UMF 1 Aguascalientes,2,31,10,2018,17,17,17,32,1,1,1,,,,1,28,,,,,,,,,,,,,,,,,,,,,,,,,,,,,,,,,,,,1,3,1,1,2,,,1,2,2,1,2,2,1,2,,2,,1,1,1,,1,,,,1,8,1,10,2,,2,,2,,1,10,2,,2,,2,,2,,2,,2,,2,,,,,,,1,1,1,1,2,1,1,2,6,,8,,,2,22,,1,7,5,2,1,Aguascalientes,1,UMF 1 Aguascalientes,1443,1,0.213335305,23.5887667059508,2018-10-31,1
2043,1,UMF 1 Aguascalientes,2,31,10,2018,18,10,18,35,1,1,1,,,,1,50,,,,,,,,,,,,,,,,,,,,,,,,,,,,,,,,,,,,1,2,1,1,1,,,1,2,1,1,2,2,1,2,,2,,1,1,1,,1,,,,1,10,1,10,2,,2,,2,,1,10,2,,2,,2,,2,,2,,2,,2,,,,,,,1,1,1,5,2,99,1,2,6,,995,,,2,52,,2,5,4,2,1,Aguascalientes,1,UMF 1 Aguascalientes,1443,1,0.213335305,24.0417084173040,2018-10-31,1
2044,1,UMF 1 Aguascalientes,2,31,10,2018,8,37,8,52,1,1,2,,,,2,7,,,,,,,,,,,,,,,,,,,,,,,,,,,,,,,,,,,,1,1,2,4,1,,,2,2,1,1,2,2,1,1,4,2,,1,1,1,,2,,,,1,10,1,10,2,,2,,2,,1,9,2,,2,,2,,2,,2,,2,,2,,,,,,,1,1,1,2,1,1,1,2,4,2,13,,,1,53,,2,5,4,2,1,Aguascalientes,1,UMF 1 Aguascalientes,1443,1,0.213335305,24.0417084173040,2018-10-31,1
2045,1,UMF 1 Aguascalientes,2,31,10,2018,10,35,10,59,1,1,2,,,,2,4,,,,,,,,,,,,,,,,,,,,,,,,,,,,,,,,,,,,1,4,1,4,3,2,2,1,2,1,1,2,2,1,2,,2,,1,1,1,,1,,,,1,10,1,10,2,,2,,2,,1,10,2,,2,,2,,2,,2,,2,,2,,,,,,,1,1,1,2,2,1,1,2,6,,995,,,1,69,,1,2,5,2,1,Aguascalientes,1,UMF 1 Aguascalientes,1443,1,0.213335305,21.8971772020417,2018-10-31,1
2046,1,UMF 1 Aguascalientes,2,31,10,2018,11,0,11,15,1,1,2,,,,2,9,,,,,,,,,,,,,,,,,,,,,,,,,,,,,,,,,,,,1,4,1,4,1,,,1,2,2,1,2,2,1,2,,2,,1,1,1,,1,,,,1,9,1,10,2,,2,,2,,1,10,2,,2,,2,,2,,2,,2,,2,,,,,,,1,1,1,2,2,1,1,1,6,,995,,,1,49,,2,7,4,2,1,Aguascalientes,1,UMF 1 Aguascalientes,1443,1,0.213335305,24.0417084173040,2018-10-31,1
2047,1,UMF 1 Aguascalientes,2,31,10,2018,12,8,12,23,1,1,2,,,,2,27,,,,,,,,,,,,,,,,,,,,,,,,,,,,,,,,,,,,1,4,1,4,1,,,1,2,1,1,2,2,1,1,1,1,1,1,1,1,,2,,,,1,10,1,10,2,,2,,2,,1,9,2,,2,,2,,2,,2,,2,,2,,,,,,,1,1,1,2,2,1,1,2,6,,995,,,1,53,,1,5,4,2,1,Aguascalientes,1,UMF 1 Aguascalientes,1443,1,0.213335305,23.3164750765878,2018-10-31,1
2048,1,UMF 1 Aguascalientes,2,31,10,2018,13,12,13,21,1,1,2,,,,2,4,,,,,,,,,,,,,,,,,,,,,,,,,,,,,,,,,,,,1,4,2,4,1,,,1,2,1,1,2,2,1,1,1,2,,1,1,1,,1,,,,1,10,1,10,2,,2,,2,,1,10,2,,2,,2,,2,,2,,2,,1,9,,,,,,1,1,1,2,2,1,1,2,3,1,79,,,1,58,,1,7,5,2,1,Aguascalientes,1,UMF 1 Aguascalientes,1443,1,0.213335305,22.8597434567572,2018-10-31,1
2049,1,UMF 1 Aguascalientes,2,31,10,2018,13,49,14,4,1,1,2,,,,2,7,,,,,,,,,,,,,,,,,,,,,,,,,,,,,,,,,,,,1,1,1,2,1,,,1,2,1,2,2,2,1,2,,2,,1,1,1,,2,,,,1,10,1,10,1,10,2,,2,,1,9,2,,2,,2,,1,9,2,,2,,2,,,,,,,1,1,1,2,1,1,1,2,2,1,995,,,1,59,,1,2,5,2,1,Aguascalientes,1,UMF 1 Aguascalientes,1443,1,0.213335305,22.8597434567572,2018-10-31,1
2050,1,UMF 1 Aguascalientes,2,31,10,2018,14,34,14,42,1,1,2,,,,2,4,,,,,,,,,,,,,,,,,,,,,,,,,,,,,,,,,,,,1,4,1,4,1,,,1,2,1,1,2,2,1,2,,2,,1,1,1,,1,,,,1,10,1,10,2,,2,,2,,1,9,2,,2,,2,,2,,2,,2,,2,,,,,,,1,1,1,2,1,1,1,2,6,,13,,,1,64,,1,7,5,2,1,Aguascalientes,1,UMF 1 Aguascalientes,1443,1,0.213335305,22.8597434567572,2018-10-31,1
2051,1,UMF 1 Aguascalientes,2,31,10,2018,14,44,15,5,1,1,2,,,,2,4,,,,,,,,,,,,,,,,,,,,,,,,,,,,,,,,,,,,1,4,1,2,1,,,2,2,1,2,2,2,1,1,1,2,,1,1,1,,2,,,,1,10,1,10,1,10,2,,2,,1,10,2,,2,,2,,2,,2,,2,,2,,,,,,,1,1,1,2,2,1,1,2,6,,995,,,1,44,,1,2,5,2,1,Aguascalientes,1,UMF 1 Aguascalientes,1443,1,0.213335305,24.8133888736180,2018-10-31,1
2052,1,UMF 1 Aguascalientes,2,31,10,2018,16,16,16,25,1,1,2,,,,2,20,,,,,,,,,,,,,,,,,,,,,,,,,,,,,,,,,,,,2,,,,,,,1,2,1,1,2,2,1,2,,2,,1,1,1,,2,,,,1,8,1,9,2,,2,,2,,1,8,2,,2,,2,,2,,2,,2,,2,,,,,,,1,1,1,2,1,1,1,2,6,,1,,,2,23,,2,7,4,2,1,Aguascalientes,1,UMF 1 Aguascalientes,1443,1,0.213335305,24.3224693786463,2018-10-31,1
2053,1,UMF 1 Aguascalientes,2,31,10,2018,16,26,16,41,1,1,3,22,,,2,12,,,,,,,,,,,,,,,,,,,,,,,,,,,,,,,,,,,,1,3,1,5,1,,,1,2,1,1,1,2,1,2,,2,,2,,,,2,,,,1,9,1,10,2,,2,,2,,2,,2,,2,,2,,2,,2,,2,,2,,,,,,,1,1,1,1,2,1,1,2,6,,13,15,,2,56,,2,3,5,2,1,Aguascalientes,1,UMF 1 Aguascalientes,1443,1,0.213335305,23.5707706622247,2018-10-31,1
2054,1,UMF 1 Aguascalientes,2,31,10,2018,16,55,17,10,1,1,2,,,,1,17,,,,,,,,,,,,,,,,,,,,,,,,,,,,,,,,,,,,1,3,1,5,1,,,1,2,1,2,2,2,1,2,,2,,1,1,1,,1,,,,1,10,1,10,2,,2,,2,,1,9,1,10,2,,2,,2,,2,,2,,1,10,,,,,,1,1,1,2,1,1,1,1,6,,995,,,1,19,,1,7,6,2,1,Aguascalientes,1,UMF 1 Aguascalientes,1443,1,0.213335305,23.5887667059508,2018-10-31,1
2055,1,UMF 1 Aguascalientes,2,31,10,2018,17,53,18,3,1,1,4,15,,,4,11,,,,,,,,,,,,,,,,,,,,,,,,,,,,,,,,,,,,2,,,,,,,6,4,1,1,2,2,1,1,2,2,,1,1,1,,3,4,,,1,10,1,9,2,,2,,2,,1,9,2,,2,,99,,2,,2,,2,,2,,,,,,,1,1,1,1,2,1,1,3,6,,22,,,2,65,,2,6,9,2,1,Aguascalientes,1,UMF 1 Aguascalientes,1443,1,0.213335305,22.5782648416754,2018-10-31,1
2056,1,UMF 1 Aguascalientes,2,31,10,2018,18,3,18,18,1,1,2,,,,2,55,,,,,,,,,,,,,,,,,,,,,,,,,,,,,,,,,,,,1,3,1,4,1,,,1,2,1,1,2,2,1,2,,2,,1,1,1,,2,,,,1,9,1,9,2,,2,,2,,1,9,2,,2,,99,,2,,2,,2,,2,,,,,,,1,1,1,2,2,1,1,2,2,2,995,,,2,81,,1,3,5,2,1,Aguascalientes,1,UMF 1 Aguascalientes,1443,1,0.213335305,21.8971772020417,2018-10-31,1
2057,1,UMF 1 Aguascalientes,2,31,10,2018,18,45,19,2,1,1,2,,,,2,27,,,,,,,,,,,,,,,,,,,,,,,,,,,,,,,,,,,,1,4,1,5,1,,,1,2,1,1,2,2,1,2,,2,,1,1,1,,1,,,,1,10,1,10,2,,2,,2,,1,10,2,,2,,2,,2,,2,,2,,2,,,,,,,1,1,1,2,1,1,1,2,6,,12,14,,2,70,,1,3,5,2,1,Aguascalientes,1,UMF 1 Aguascalientes,1443,1,0.213335305,21.8971772020417,2018-10-31,1
2058,1,UMF 1 Aguascalientes,2,31,10,2018,19,29,19,44,1,1,4,21,,,4,19,,,,,,,,,,,,,,,,,,,,,,,,,,,,,,,,,,,,1,4,2,4,1,,,3,2,1,1,1,2,1,2,,2,,1,1,1,,2,,,,1,9,1,9,2,,2,,2,,1,9,2,,2,,2,,2,,99,,2,,2,,,,,,,1,1,1,2,1,1,1,2,6,,1,142,,2,38,,1,3,5,2,1,Aguascalientes,1,UMF 1 Aguascalientes,1443,1,0.213335305,24.8133888736180,2018-10-31,1
2059,1,UMF 1 Aguascalientes,2,31,10,2018,9,43,9,58,1,1,3,21,,,2,10,,,,,,,,,,,,,,,,,,,,,,,,,,,,,,,,,,,,2,,,,,,,3,2,1,1,2,2,1,2,,2,,1,1,1,,1,,,,1,10,1,10,2,,2,,2,,1,10,2,,2,,2,,2,,2,,2,,2,,,,,,,1,1,1,2,1,1,1,2,6,,995,,,1,44,,1,5,4,2,1,Aguascalientes,1,UMF 1 Aguascalientes,1443,1,0.213335305,24.8133888736180,2018-10-31,1
2060,1,UMF 1 Aguascalientes,2,31,10,2018,10,14,10,29,1,1,1,,,,2,13,,,,,,,,,,,,,,,,,,,,,,,,,,,,,,,,,,,,2,,,,,,,3,1,1,1,2,2,1,2,,2,,1,1,1,,1,,,,1,10,1,10,2,,2,,2,,1,10,2,,2,,1,10,2,,2,,1,10,2,,,,,,,1,1,1,2,2,1,1,1,2,1,995,,,1,37,,2,5,4,2,1,Aguascalientes,1,UMF 1 Aguascalientes,1443,1,0.213335305,25.5851820734131,2018-10-31,1
2061,1,UMF 1 Aguascalientes,2,31,10,2018,13,48,13,57,1,2,2,,,,2,16,,,,,,,,,,,,,,,,,,,,,,,,,,,,,,,,,,,,2,,,,,,,3,2,2,1,1,2,1,2,,2,,1,1,1,,2,,,,1,10,1,10,2,,2,,2,,1,7,2,,2,,2,,2,,2,,2,,2,,,,,,,1,1,1,2,2,1,1,3,4,2,1,,,1,47,,1,6,5,2,1,Aguascalientes,1,UMF 1 Aguascalientes,1443,1,0.213335305,23.3164750765878,2018-10-31,1
2062,1,UMF 1 Aguascalientes,2,31,10,2018,15,50,15,57,1,1,2,,,,2,27,,,,,,,,,,,,,,,,,,,,,,,,,,,,,,,,,,,,2,,,,,,,1,2,1,1,2,2,1,2,,2,,1,1,1,,1,,,,1,10,1,10,2,,2,,2,,1,10,2,,2,,2,,2,,2,,2,,2,,,,,,,1,1,1,1,1,1,1,1,2,1,995,,,2,56,,1,7,5,2,1,Aguascalientes,1,UMF 1 Aguascalientes,1443,1,0.213335305,22.8597434567572,2018-10-31,1
2063,1,UMF 1 Aguascalientes,2,31,10,2018,16,20,16,35,1,1,2,,,,2,27,,,,,,,,,,,,,,,,,,,,,,,,,,,,,,,,,,,,1,3,1,1,1,,,1,2,1,1,2,2,1,1,4,2,,1,1,1,,1,,,,1,7,1,10,2,,2,,2,,1,8,2,,2,,2,,2,,2,,2,,2,,,,,,,1,1,1,2,2,99,1,4,6,,8,,,2,55,,1,9,2,2,1,Aguascalientes,1,UMF 1 Aguascalientes,1443,1,0.213335305,22.8597434567572,2018-10-31,1
2064,1,UMF 1 Aguascalientes,2,31,10,2018,17,5,17,20,1,1,2,,,,2,27,,,,,,,,,,,,,,,,,,,,,,,,,,,,,,,,,,,,1,4,1,1,1,,,1,2,1,99,2,2,1,2,,2,,1,1,1,,1,,,,1,10,1,10,2,,2,,2,,1,10,2,,2,,2,,2,,2,,2,,2,,,,,,,1,1,1,2,2,1,1,1,6,,995,,,2,44,,1,2,12,2,1,Aguascalientes,1,UMF 1 Aguascalientes,1443,1,0.213335305,24.8133888736180,2018-10-31,1
2065,1,UMF 1 Aguascalientes,2,31,10,2018,17,34,17,49,1,1,2,,,,2,7,,,,,,,,,,,,,,,,,,,,,,,,,,,,,,,,,,,,1,3,1,4,1,,,1,2,2,1,2,2,1,1,4,1,2,1,1,1,,2,,,,1,9,1,10,2,,2,,2,,1,10,2,,2,,2,,2,,2,,2,,2,,,,,,,1,1,1,2,2,1,1,2,2,1,9,,,2,27,,1,5,2,2,1,Aguascalientes,1,UMF 1 Aguascalientes,1443,1,0.213335305,21.9384859621511,2018-10-31,1
2066,1,UMF 1 Aguascalientes,2,31,10,2018,18,17,18,40,1,1,1,,,,1,7,,,,,,,,,,,,,,,,,,,,,,,,,,,,,,,,,,,,1,3,1,1,1,,,2,2,1,1,2,2,1,1,3,2,,1,1,1,,1,,,,1,10,1,10,2,,2,,2,,1,10,2,,2,,2,,2,,2,,2,,2,,,,,,,1,1,1,2,1,1,1,3,6,,995,,,2,28,,1,7,2,2,1,Aguascalientes,1,UMF 1 Aguascalientes,1443,1,0.213335305,21.9384859621511,2018-10-31,1
2067,1,UMF 1 Aguascalientes,2,31,10,2018,18,40,19,2,1,1,2,,,,2,27,,,,,,,,,,,,,,,,,,,,,,,,,,,,,,,,,,,,1,2,1,5,3,1,2,1,2,1,1,2,2,1,2,,2,,1,1,1,,1,,,,2,,1,10,2,,2,,2,,1,10,2,,2,,2,,2,,2,,2,,2,,,,,,,1,1,1,1,2,99,1,2,2,1,5,,,2,30,,2,5,2,2,1,Aguascalientes,1,UMF 1 Aguascalientes,1443,1,0.213335305,22.6208584653844,2018-10-31,1
2068,1,UMF 1 Aguascalientes,2,31,10,2018,19,2,19,17,1,1,4,1,,,4,11,,,,,,,,,,,,,,,,,,,,,,,,,,,,,,,,,,,,1,3,1,1,1,,,1,2,1,2,1,2,1,2,,1,4,1,1,1,,2,,,,1,10,1,9,2,,2,,2,,1,10,2,,2,,2,,2,,2,,2,,2,,,,,,,1,1,1,2,1,1,1,2,4,2,1,,,2,38,,1,5,4,2,1,Aguascalientes,1,UMF 1 Aguascalientes,1443,1,0.213335305,24.8133888736180,2018-10-31,1
2069,1,UMF 1 Aguascalientes,2,31,10,2018,8,26,8,41,1,2,2,,,,2,9,,,,,,,,,,,,,,,,,,,,,,,,,,,,,,,,,,,,2,,,,,,,4,2,2,1,2,2,1,2,,1,2,1,1,1,,2,,,,1,10,1,10,2,,2,,2,,1,10,2,,2,,2,,2,,2,,2,,2,,,,,,,1,1,1,1,2,1,1,2,2,1,1,8,9,1,33,,1,7,5,2,1,Aguascalientes,1,UMF 1 Aguascalientes,1443,1,0.213335305,21.9384859621511,2018-10-31,1