Folio,Deleg,Id_Unid,Unidmed,Fecha_D,Fecha_M,Fecha_A,Hr_Ini_H,Hr_Ini_M,Hr_Fin_H,Hr_Fin_M,Tipopac,Sat1,Sat1_Mot1,Sat1_Mot2,Sat1_Mot3,Sat3,Probsal,Citapre,Tmedreg2,Durasis_C,Preosad,Tratocomf,Filtrosaux1,Temsad1,Filtrosaux2,Temsad2,Recmedhoy,Filtrofarm2,Totmed,Motnosurt,Btratou,Btratou_Mot1,Btratou_Mot2,Btratou_Mot3,Calfatna_A,Calfatnb_A,Calfatna_C,Calfatnb_C,Calfatna_E,Calfatnb_E,Calfatna_G,Calfatnb_G,Calfatna_H,Calfatnb_H,Calfatna_N,Calfatnb_N,Calfatna_K,Calfatnb_K,Calfatna_L,Calfatnb_L,Calfatna_J,Calfatnb_J,Calfatna_M,Calfatnb_M,Calfatna_F,Calfatnb_F,Mottratot1,Mottratot2,Mottratot3,Mottratot4,Mottratot5,Saludar,Escuchar,Responder,Tiemuv,Mejoratratou,Gafet,Amable,Btratou2,Calfinmb_F,Limp1,Limp2,Recomej_A,Recomej_B,Recomej_C,Sexo,Escolar,Edad,Edad_C,Ocupa,Id_Unidad,Cve_Delegaci�N,Delegaci�N,Nivel,Unidad,Promedio_Diario2017,Estrato,Moscondia,Fe_Finalnr,Fecha,Entidad
1060,1,1,UMF 8 Aguascalientes,13,4,2018,15,57,16,4,1,2,,,,2,9,1,4,1,1,2,2,,2,,1,1,1,,1,,,,1,10,1,9,2,,1,10,2,,1,9,1,10,1,10,2,,2,,2,,,,,,,1,1,1,1,2,99,1,10,1,,,12,,,1,9,30,,1,1,1,Aguascalientes,1,UMF 8 Aguascalientes,1687,1,0.244883147,27.5362609772698,2018-04-13,1
1073,1,1,UMF 8 Aguascalientes,13,4,2018,15,14,15,21,1,2,,,,2,17,2,2,1,1,2,1,4,2,,1,1,1,,1,,,,1,10,1,10,2,,1,10,2,,1,10,2,,2,,2,,2,,2,,,,,,,1,1,1,1,2,1,1,10,4,4,2,13,,,1,5,43,,1,1,1,Aguascalientes,1,UMF 8 Aguascalientes,1687,1,0.244883147,22.7765197173220,2018-04-13,1
1039,1,1,UMF 8 Aguascalientes,13,4,2018,19,28,19,36,1,2,,,,2,4,2,2,1,1,2,2,,2,,1,1,1,,2,,,,1,10,1,10,2,,2,,2,,1,10,2,,2,,2,,1,10,2,,,,,,,1,1,1,5,1,1,1,10,2,,,995,,,1,6,35,,1,1,1,Aguascalientes,1,UMF 8 Aguascalientes,1687,1,0.244883147,22.7765197173220,2018-04-13,1
1021,1,1,UMF 8 Aguascalientes,13,4,2018,17,24,17,30,1,2,,,,3,2,1,3,1,1,2,2,,2,,1,1,1,,2,,,,1,8,1,10,2,,2,,2,,1,8,2,,2,,2,,2,,2,,,,,,,1,1,1,2,2,99,1,8,2,2,1,995,,,2,2,67,,1,1,1,Aguascalientes,1,UMF 8 Aguascalientes,1687,1,0.244883147,22.9387019085907,2018-04-13,1
1054,1,1,UMF 8 Aguascalientes,13,4,2018,11,56,12,4,1,1,,,,1,6,1,1,1,1,2,1,1,2,,1,1,1,,2,,,,1,9,1,10,2,,2,,2,,1,10,2,,2,,2,,2,,2,,,,,,,1,1,1,2,2,1,1,10,2,2,1,995,,,1,5,49,,1,1,1,Aguascalientes,1,UMF 8 Aguascalientes,1687,1,0.244883147,23.9459076488256,2018-04-13,1
1088,1,1,UMF 8 Aguascalientes,13,4,2018,17,42,17,48,1,1,,,,1,28,1,1,,1,2,1,1,1,1,1,1,1,,2,,,,1,9,1,9,2,,2,,2,,1,9,2,,2,,2,,2,,2,,,,,,,1,1,1,2,1,99,1,9,1,,,995,,,2,3,42,,1,1,1,Aguascalientes,1,UMF 8 Aguascalientes,1687,1,0.244883147,23.0799131180450,2018-04-13,1
1006,1,1,UMF 8 Aguascalientes,13,4,2018,14,12,14,19,1,2,,,,2,2,2,3,1,2,2,2,,2,,1,1,1,,2,,,,1,8,1,8,2,,2,,2,,1,7,2,,2,,2,,2,,2,,,,,,,2,2,2,3,3,1,1,8,2,4,2,1,,,1,9,38,,2,1,1,Aguascalientes,1,UMF 8 Aguascalientes,1687,1,0.244883147,22.7765197173220,2018-04-13,1
1025,1,1,UMF 8 Aguascalientes,13,4,2018,14,23,14,30,2,2,,,,2,3,2,2,1,1,2,2,,2,,1,1,1,,2,,,,1,10,1,10,2,,2,,2,,1,10,2,,2,,2,,2,,2,,,,,,,1,1,1,5,1,99,1,10,1,,,1,,,2,3,48,,2,1,1,Aguascalientes,1,UMF 8 Aguascalientes,1687,1,0.244883147,24.2648778183309,2018-04-13,1
1081,1,1,UMF 8 Aguascalientes,13,4,2018,15,51,15,58,1,2,,,,4,22,2,2,1,1,2,2,,2,,1,1,1,,2,,,,1,10,1,10,1,9,2,,2,,1,10,1,10,1,9,1,9,1,10,1,9,,,,,,1,1,1,3,1,1,1,10,2,,,1,,,1,3,39,,2,1,1,Aguascalientes,1,UMF 8 Aguascalientes,1687,1,0.244883147,22.7765197173220,2018-04-13,1
1026,1,1,UMF 8 Aguascalientes,13,4,2018,13,12,13,22,2,4,1,21,,2,3,2,3,1,1,2,2,,2,,1,1,1,,5,4,,,1,9,1,2,2,,2,,2,,1,10,2,,2,,2,,2,,2,,,,,,,2,1,2,1,1,1,1,8,2,,,1,,,2,6,18,,2,1,1,Aguascalientes,1,UMF 8 Aguascalientes,1687,1,0.244883147,23.9209179606866,2018-04-13,1
1010,1,1,UMF 8 Aguascalientes,13,4,2018,15,13,15,23,1,2,,,,2,2,2,4,2,1,2,2,,2,,1,1,1,,2,,,,2,,1,10,2,,1,10,2,,1,10,2,,2,,2,,2,,2,,,,,,,1,1,1,2,2,1,1,10,2,2,1,8,,,1,2,63,,2,1,1,Aguascalientes,1,UMF 8 Aguascalientes,1687,1,0.244883147,21.8065629534164,2018-04-13,1
1027,1,1,UMF 8 Aguascalientes,13,4,2018,14,58,15,6,2,1,,,,1,3,2,3,1,1,2,2,,2,,1,1,1,,2,,,,1,10,1,10,2,,2,,2,,1,10,2,,2,,2,,2,,2,,,,,,,1,1,1,3,2,1,1,10,2,,,8,,,2,5,26,,2,1,1,Aguascalientes,1,UMF 8 Aguascalientes,1687,1,0.244883147,27.9030562543699,2018-04-13,1
1029,1,1,UMF 8 Aguascalientes,13,4,2018,9,17,9,23,1,2,,,,2,3,2,2,1,1,2,1,4,2,,1,1,1,,1,,,,1,10,1,10,2,,2,,2,,1,10,2,,2,,2,,2,,2,,,,,,,1,1,1,2,1,1,1,10,1,,,9,,,2,6,54,,2,1,1,Aguascalientes,1,UMF 8 Aguascalientes,1687,1,0.244883147,24.2648778183309,2018-04-13,1
1043,1,1,UMF 8 Aguascalientes,13,4,2018,9,51,10,4,1,1,,,,2,5,2,2,1,1,2,2,,2,,1,1,1,,2,,,,1,9,1,10,2,,2,,2,,1,10,1,9,2,,2,,2,,2,,,,,,,1,1,1,2,1,1,1,10,1,1,1,9,,,2,6,56,,2,1,1,Aguascalientes,1,UMF 8 Aguascalientes,1687,1,0.244883147,22.0970360974536,2018-04-13,1
1031,1,1,UMF 8 Aguascalientes,13,4,2018,10,18,10,26,1,2,,,,2,3,1,1,1,1,2,2,,2,,1,1,1,,2,,,,1,10,1,9,2,,2,,2,,1,9,2,,2,,2,,2,,2,,,,,,,1,1,1,4,2,1,1,9,2,,,9,,,1,7,55,,2,1,1,Aguascalientes,1,UMF 8 Aguascalientes,1687,1,0.244883147,21.8065629534164,2018-04-13,1
1044,1,1,UMF 8 Aguascalientes,13,4,2018,15,27,15,36,1,4,14,,,2,5,2,3,2,1,2,2,,2,,1,1,1,,2,,,,1,10,1,10,2,,2,,2,,1,10,2,,2,,2,,2,,2,,,,,,,2,1,1,99,,99,1,9,2,,,12,,,2,5,38,,2,1,1,Aguascalientes,1,UMF 8 Aguascalientes,1687,1,0.244883147,23.0799131180450,2018-04-13,1
1049,1,1,UMF 8 Aguascalientes,13,4,2018,8,18,8,27,1,2,,,,2,6,2,1,1,1,2,2,,2,,1,1,1,,1,,,,1,9,1,10,2,,2,,2,,1,8,2,,2,,2,,2,,2,,,,,,,1,1,1,5,2,1,1,10,2,,,13,,,2,5,63,,2,1,1,Aguascalientes,1,UMF 8 Aguascalientes,1687,1,0.244883147,22.0970360974536,2018-04-13,1
1070,1,1,UMF 8 Aguascalientes,13,4,2018,13,5,13,12,1,2,,,,2,15,1,1,1,1,2,2,,2,,1,1,1,,2,,,,1,9,1,9,2,,1,8,1,6,1,9,2,,2,,2,,2,,2,,,,,,,1,1,1,2,2,1,1,8,4,,,13,,,1,9,27,,2,1,1,Aguascalientes,1,UMF 8 Aguascalientes,1687,1,0.244883147,27.5362609772698,2018-04-13,1
1074,1,1,UMF 8 Aguascalientes,13,4,2018,13,38,13,45,2,2,,,,2,18,2,2,1,1,2,1,2,1,2,1,1,1,,2,,,,2,,1,10,2,,2,,2,,1,10,2,,2,,2,,2,,2,,,,,,,1,1,1,1,2,1,1,10,2,,,995,,,2,6,42,,2,1,1,Aguascalientes,1,UMF 8 Aguascalientes,1687,1,0.244883147,23.0799131180450,2018-04-13,1
1092,1,1,UMF 8 Aguascalientes,13,4,2018,14,38,14,48,1,2,,,,2,58,2,2,2,1,2,2,,1,2,1,1,1,,1,,,,1,10,1,10,2,,2,,2,,1,10,2,,2,,2,,2,,2,,,,,,,1,1,1,1,2,1,1,10,2,,,995,,,2,7,33,,2,1,1,Aguascalientes,1,UMF 8 Aguascalientes,1687,1,0.244883147,27.9030562543699,2018-04-13,1
1094,1,1,UMF 8 Aguascalientes,13,4,2018,8,40,8,46,1,2,,,,2,60,2,1,1,1,2,1,2,2,,1,1,1,,2,,,,1,10,1,10,2,,2,,2,,1,10,2,,2,,2,,2,,2,,,,,,,1,1,1,1,2,1,1,10,2,,,995,,,2,7,49,,2,1,1,Aguascalientes,1,UMF 8 Aguascalientes,1687,1,0.244883147,24.2648778183309,2018-04-13,1
1003,1,1,UMF 8 Aguascalientes,13,4,2018,13,56,14,3,1,2,,,,2,1,1,2,1,1,2,2,,2,,1,1,1,,2,,,,1,10,1,10,2,,2,,2,,1,8,2,,2,,2,,2,,2,,,,,,,1,1,1,2,2,1,1,9,2,,,995,,,1,5,35,,2,1,1,Aguascalientes,1,UMF 8 Aguascalientes,1687,1,0.244883147,22.7765197173220,2018-04-13,1
1059,1,1,UMF 8 Aguascalientes,13,4,2018,15,11,15,20,1,1,,,,1,8,1,1,1,1,2,1,3,2,,1,1,1,,2,,,,1,10,1,10,2,,1,10,2,,1,10,2,,2,,2,,2,,2,,,,,,,1,1,1,5,1,1,1,10,2,,,995,,,2,5,46,,2,1,1,Aguascalientes,1,UMF 8 Aguascalientes,1687,1,0.244883147,24.2648778183309,2018-04-13,1
1013,1,1,UMF 8 Aguascalientes,13,4,2018,8,49,8,58,1,2,,,,2,2,1,2,2,1,2,1,3,2,,1,1,1,,2,,,,1,10,1,10,2,,2,,2,,1,10,2,,2,,2,,2,,2,,,,,,,1,1,1,1,2,1,1,10,2,,,995,,,1,5,52,,2,1,1,Aguascalientes,1,UMF 8 Aguascalientes,1687,1,0.244883147,23.9459076488256,2018-04-13,1
1067,1,1,UMF 8 Aguascalientes,13,4,2018,10,13,10,21,1,2,,,,1,12,1,2,1,1,2,1,3,1,3,1,1,1,,2,,,,1,10,1,10,2,,1,10,1,10,1,10,2,,2,,2,,2,,2,,,,,,,1,1,1,1,2,99,1,10,99,2,2,995,,,2,7,48,,2,1,1,Aguascalientes,1,UMF 8 Aguascalientes,1687,1,0.244883147,24.2648778183309,2018-04-13,1
1084,1,1,UMF 8 Aguascalientes,13,4,2018,15,25,15,32,1,2,,,,3,26,2,3,,1,2,2,,2,,1,1,1,,2,,,,1,9,1,10,2,,2,,2,,1,9,2,,2,,2,,2,,2,,,,,,,1,1,1,4,2,99,1,9,2,2,1,1,10,,1,7,40,,2,1,1,Aguascalientes,1,UMF 8 Aguascalientes,1687,1,0.244883147,22.7765197173220,2018-04-13,1
1023,1,1,UMF 8 Aguascalientes,13,4,2018,16,22,16,35,1,1,,,,1,2,1,1,1,2,1,1,1,1,1,1,1,1,,2,,,,1,10,1,10,2,,2,,2,,1,10,2,,2,,2,,2,,2,,,,,,,1,1,1,2,2,1,1,10,2,,,14,13,51,2,3,52,,2,1,1,Aguascalientes,1,UMF 8 Aguascalientes,1687,1,0.244883147,24.2648778183309,2018-04-13,1
1041,1,1,UMF 8 Aguascalientes,13,4,2018,15,40,15,46,1,2,,,,2,5,2,4,1,1,2,2,,1,2,1,1,1,,1,,,,1,8,1,8,2,,2,,2,,1,9,2,,2,,2,,2,,2,,,,,,,1,1,1,1,3,1,1,9,2,,,1,,,2,5,30,,4,1,1,Aguascalientes,1,UMF 8 Aguascalientes,1687,1,0.244883147,27.9030562543699,2018-04-13,1
1064,1,1,UMF 8 Aguascalientes,13,4,2018,12,47,12,55,1,2,,,,2,11,2,1,2,1,2,1,2,2,,1,1,1,,2,,,,1,5,1,10,1,10,2,,2,,1,8,2,,2,,2,,2,,2,,,,,,,1,1,1,2,1,99,1,9,2,2,1,1,,,1,5,36,,4,1,1,Aguascalientes,1,UMF 8 Aguascalientes,1687,1,0.244883147,22.7765197173220,2018-04-13,1
1075,1,1,UMF 8 Aguascalientes,13,4,2018,9,9,9,15,1,2,,,,2,18,2,2,1,1,2,97,,2,,1,1,1,,2,,,,1,7,1,8,2,,2,,2,,1,10,2,,2,,2,,2,,2,,,,,,,1,1,1,5,2,1,1,8,2,,,995,,,1,5,25,,4,1,1,Aguascalientes,1,UMF 8 Aguascalientes,1687,1,0.244883147,23.6064692618813,2018-04-13,1
1035,1,1,UMF 8 Aguascalientes,13,4,2018,8,9,8,18,1,2,,,,2,3,1,1,1,1,2,2,,2,,1,1,1,,1,,,,1,10,1,10,2,,2,,2,,1,6,2,,2,,2,,2,,2,,,,,,,1,1,1,2,1,1,1,10,3,,,995,,,1,3,33,,4,1,1,Aguascalientes,1,UMF 8 Aguascalientes,1687,1,0.244883147,27.5362609772698,2018-04-13,1
1065,1,1,UMF 8 Aguascalientes,13,4,2018,13,45,13,52,1,1,,,,1,11,1,1,1,1,2,2,,2,,1,1,1,,1,,,,1,10,1,10,2,,2,,2,,1,10,2,,2,,2,,2,,2,,,,,,,1,1,1,1,2,1,1,10,2,2,1,995,,,2,3,58,,4,1,1,Aguascalientes,1,UMF 8 Aguascalientes,1687,1,0.244883147,22.0970360974536,2018-04-13,1
1024,1,1,UMF 8 Aguascalientes,13,4,2018,18,53,19,2,1,2,,,,1,2,1,1,1,1,2,1,4,2,,1,1,1,,2,,,,1,10,1,10,2,,1,10,2,,1,10,2,,2,,2,,2,,2,,,,,,,1,1,1,2,2,1,1,10,2,2,2,995,,,2,2,58,,4,1,1,Aguascalientes,1,UMF 8 Aguascalientes,1687,1,0.244883147,22.0970360974536,2018-04-13,1
1093,1,1,UMF 8 Aguascalientes,13,4,2018,15,22,15,32,1,2,,,,2,25,2,4,1,1,1,2,,2,,1,1,1,,2,,,,1,8,1,10,2,,1,8,2,,1,9,2,,2,,2,,2,,2,,,,,,,2,1,1,2,1,99,1,9,2,2,1,1,,,1,3,40,,5,1,1,Aguascalientes,1,UMF 8 Aguascalientes,1687,1,0.244883147,22.7765197173220,2018-04-13,1
1086,1,1,UMF 8 Aguascalientes,13,4,2018,13,17,13,23,1,2,,,,2,27,2,2,1,1,2,2,,2,,1,1,1,,2,,,,1,9,1,10,2,,2,,2,,1,10,2,,2,,2,,2,,2,,,,,,,1,1,1,3,2,1,1,10,2,,,1,,,1,5,23,,5,1,1,Aguascalientes,1,UMF 8 Aguascalientes,1687,1,0.244883147,23.6064692618813,2018-04-13,1
1045,1,1,UMF 8 Aguascalientes,13,4,2018,13,28,13,34,1,3,,,,3,6,1,1,1,1,2,2,,2,,1,1,1,,2,,,,1,10,1,10,2,,2,,2,,1,8,2,,2,,2,,2,,2,,,,,,,1,1,1,2,1,99,1,9,2,,,1,,,1,2,74,,5,1,1,Aguascalientes,1,UMF 8 Aguascalientes,1687,1,0.244883147,22.6371647778128,2018-04-13,1
1082,1,1,UMF 8 Aguascalientes,13,4,2018,16,15,16,26,2,2,,,,2,26,1,1,,1,2,2,,2,,2,2,,,2,,,,1,10,1,10,2,,2,,2,,2,,2,,2,,2,,2,,2,,,,,,,1,1,1,1,2,1,1,10,2,4,1,1,,,1,5,39,,5,1,1,Aguascalientes,1,UMF 8 Aguascalientes,1687,1,0.244883147,22.7765197173220,2018-04-13,1
1068,1,1,UMF 8 Aguascalientes,13,4,2018,12,43,12,53,1,3,,,,2,12,2,3,2,2,1,1,4,1,2,1,1,2,3,1,,,,2,,1,8,2,,2,,2,,1,8,2,,2,,2,,2,,2,,,,,,,2,2,2,2,1,2,2,8,1,2,2,1,,,1,5,58,,5,1,1,Aguascalientes,1,UMF 8 Aguascalientes,1687,1,0.244883147,21.8065629534164,2018-04-13,1
1009,1,1,UMF 8 Aguascalientes,13,4,2018,15,46,15,52,1,2,,,,2,2,1,2,1,1,2,2,,2,,1,1,1,,2,,,,1,10,1,10,2,,2,,2,,1,10,2,,2,,2,,2,,2,,,,,,,1,1,1,2,2,1,1,9,3,,,3,,,1,1,77,,5,1,1,Aguascalientes,1,UMF 8 Aguascalientes,1687,1,0.244883147,22.6371647778128,2018-04-13,1
1066,1,1,UMF 8 Aguascalientes,13,4,2018,18,13,18,20,1,2,,,,2,12,2,1,1,1,2,2,,1,4,1,1,1,,2,,,,1,10,1,10,1,10,2,,1,10,1,10,2,,2,,2,,1,7,2,,,,,,,1,1,1,2,1,1,1,10,3,3,2,8,,,1,5,36,,5,1,1,Aguascalientes,1,UMF 8 Aguascalientes,1687,1,0.244883147,22.7765197173220,2018-04-13,1
1047,1,1,UMF 8 Aguascalientes,13,4,2018,11,10,11,22,1,2,,,,2,6,1,4,1,1,2,1,4,2,,1,1,1,,1,,,,1,10,1,10,2,,2,,2,,1,10,2,,2,,2,,2,,2,,,,,,,1,1,1,2,2,1,1,10,3,2,1,8,,,1,5,73,,5,1,1,Aguascalientes,1,UMF 8 Aguascalientes,1687,1,0.244883147,22.6371647778128,2018-04-13,1
1087,1,1,UMF 8 Aguascalientes,13,4,2018,18,8,18,19,1,2,,,,2,28,1,3,,1,2,1,4,2,,1,1,1,,2,,,,1,10,1,10,2,,2,,2,,1,10,2,,2,,2,,2,,2,,,,,,,1,1,1,2,2,1,1,10,2,,,8,,,1,3,61,,5,1,1,Aguascalientes,1,UMF 8 Aguascalientes,1687,1,0.244883147,21.8065629534164,2018-04-13,1
1030,1,1,UMF 8 Aguascalientes,13,4,2018,15,38,15,44,2,2,,,,2,3,2,4,2,1,2,2,,2,,1,1,1,,2,,,,1,9,1,9,2,,2,,2,,1,9,2,,2,,2,,2,,2,,,,,,,1,1,1,2,1,1,1,8,2,,,9,,,1,5,31,,5,1,1,Aguascalientes,1,UMF 8 Aguascalientes,1687,1,0.244883147,27.5362609772698,2018-04-13,1
1091,1,1,UMF 8 Aguascalientes,13,4,2018,15,43,15,51,1,4,9,12,,2,51,1,2,1,1,2,2,,2,,1,1,1,,2,,,,1,7,1,8,2,,2,,2,,2,,2,,2,,2,,2,,2,,,,,,,99,2,1,2,2,1,1,8,2,,,9,,,1,3,92,,5,1,1,Aguascalientes,1,UMF 8 Aguascalientes,1687,1,0.244883147,22.6371647778128,2018-04-13,1
1097,1,1,UMF 8 Aguascalientes,13,4,2018,19,19,19,26,1,2,,,,2,95,1,1,1,1,2,1,1,2,,1,1,1,,2,,,,1,9,1,10,2,,2,,2,,1,10,2,,2,,2,,2,,2,,,,,,,1,1,1,2,1,99,1,10,2,,,9,,,1,5,50,,5,1,1,Aguascalientes,1,UMF 8 Aguascalientes,1687,1,0.244883147,23.9459076488256,2018-04-13,1
1011,1,1,UMF 8 Aguascalientes,13,4,2018,8,32,8,42,1,1,,,,1,2,1,1,1,1,2,2,,2,,1,1,1,,1,,,,1,10,1,10,2,,2,,2,,1,10,2,,2,,2,,2,,2,,,,,,,1,1,1,3,2,1,1,10,2,2,1,9,,,1,3,59,,5,1,1,Aguascalientes,1,UMF 8 Aguascalientes,1687,1,0.244883147,21.8065629534164,2018-04-13,1
1048,1,1,UMF 8 Aguascalientes,13,4,2018,11,3,11,11,1,2,,,,2,6,1,1,1,1,2,2,,2,,1,1,1,,2,,,,1,8,1,8,2,,2,,2,,1,9,2,,2,,2,,2,,2,,,,,,,1,1,1,2,1,1,1,9,2,2,1,9,,,1,4,68,,5,1,1,Aguascalientes,1,UMF 8 Aguascalientes,1687,1,0.244883147,22.6371647778128,2018-04-13,1
1033,1,1,UMF 8 Aguascalientes,13,4,2018,16,13,16,22,2,2,,,,2,3,2,5,1,1,2,2,,2,,1,1,1,,1,,,,1,10,1,10,2,,2,,2,,1,10,2,,2,,2,,2,,2,,,,,,,1,1,1,1,2,1,1,10,3,,,13,,,1,5,36,,5,1,1,Aguascalientes,1,UMF 8 Aguascalientes,1687,1,0.244883147,22.7765197173220,2018-04-13,1
1032,1,1,UMF 8 Aguascalientes,13,4,2018,8,21,8,27,2,2,,,,2,3,2,4,1,1,2,1,3,2,,2,1,1,,2,,,,1,8,1,9,2,,2,,2,,1,9,2,,2,,2,,2,,2,,,,,,,1,1,1,1,2,99,1,9,2,,,13,,,1,5,34,,5,1,1,Aguascalientes,1,UMF 8 Aguascalientes,1687,1,0.244883147,27.5362609772698,2018-04-13,1
1050,1,1,UMF 8 Aguascalientes,13,4,2018,9,27,9,38,1,1,,,,1,6,1,1,1,1,2,2,,2,,1,1,1,,1,,,,1,10,1,10,2,,2,,2,,1,10,2,,2,,2,,2,,2,,,,,,,1,1,1,2,1,1,1,10,4,4,1,13,,,1,7,84,,5,1,1,Aguascalientes,1,UMF 8 Aguascalientes,1687,1,0.244883147,22.6371647778128,2018-04-13,1
1058,1,1,UMF 8 Aguascalientes,13,4,2018,12,19,12,26,1,1,,,,2,8,1,1,1,1,2,2,,2,,1,1,1,,1,,,,1,10,1,10,2,,2,,1,10,1,10,2,,2,,2,,2,,2,,,,,,,1,1,1,2,1,1,1,10,2,,,13,,,1,1,73,,5,1,1,Aguascalientes,1,UMF 8 Aguascalientes,1687,1,0.244883147,22.6371647778128,2018-04-13,1
1079,1,1,UMF 8 Aguascalientes,13,4,2018,12,39,12,47,1,2,,,,2,20,1,2,1,1,2,1,2,2,,2,2,,,2,,,,1,10,1,10,2,,2,,1,10,2,,2,,2,,2,,2,,2,,,,,,,2,1,1,2,2,1,1,10,2,2,1,13,,,1,7,44,,5,1,1,Aguascalientes,1,UMF 8 Aguascalientes,1687,1,0.244883147,22.7765197173220,2018-04-13,1
1085,1,1,UMF 8 Aguascalientes,13,4,2018,15,44,15,50,1,1,,,,1,26,1,2,,1,2,2,,2,,2,2,,,1,,,,1,10,1,10,2,,2,,2,,2,,2,,2,,2,,2,,2,,,,,,,1,1,1,1,1,1,1,10,1,,,13,,,1,9,33,,5,1,1,Aguascalientes,1,UMF 8 Aguascalientes,1687,1,0.244883147,27.5362609772698,2018-04-13,1
1056,1,1,UMF 8 Aguascalientes,13,4,2018,11,33,11,41,1,3,,,,3,6,1,2,1,1,2,1,2,2,,2,2,,,2,,,,1,9,1,10,2,,2,,1,9,2,,2,,2,,2,,2,,2,,,,,,,1,1,1,1,2,1,1,10,2,5,2,13,,,1,3,54,,5,1,1,Aguascalientes,1,UMF 8 Aguascalientes,1687,1,0.244883147,23.9459076488256,2018-04-13,1
1051,1,1,UMF 8 Aguascalientes,13,4,2018,18,41,18,47,1,2,,,,2,6,1,1,1,1,2,2,,2,,1,1,1,,2,,,,1,8,1,9,2,,2,,2,,1,8,2,,2,,2,,2,,2,,,,,,,2,1,1,2,2,99,1,10,2,,,14,,,1,7,84,,5,1,1,Aguascalientes,1,UMF 8 Aguascalientes,1687,1,0.244883147,22.6371647778128,2018-04-13,1
1080,1,1,UMF 8 Aguascalientes,13,4,2018,16,8,16,16,1,2,,,,2,21,1,5,1,1,2,2,,2,,1,1,1,,1,,,,1,8,1,10,2,,2,,2,,1,10,2,,2,,2,,2,,2,,,,,,,2,2,2,2,1,99,1,10,2,2,1,14,,,1,7,50,,5,1,1,Aguascalientes,1,UMF 8 Aguascalientes,1687,1,0.244883147,23.9459076488256,2018-04-13,1
1002,1,1,UMF 8 Aguascalientes,13,4,2018,17,6,17,13,1,2,,,,2,1,2,4,2,1,2,2,,2,,1,1,1,,2,,,,1,9,1,9,2,,2,,2,,1,9,2,,2,,2,,2,,2,,,,,,,1,1,1,1,3,99,1,9,2,4,2,37,,,1,7,41,,5,1,1,Aguascalientes,1,UMF 8 Aguascalientes,1687,1,0.244883147,22.7765197173220,2018-04-13,1
1053,1,1,UMF 8 Aguascalientes,13,4,2018,9,58,10,11,1,2,,,,2,6,2,2,1,1,2,1,2,2,,1,1,1,,1,,,,1,10,1,10,2,,2,,2,,1,10,2,,2,,2,,2,,2,,,,,,,1,1,1,97,,1,1,10,2,2,1,37,,,1,3,69,,5,1,1,Aguascalientes,1,UMF 8 Aguascalientes,1687,1,0.244883147,22.6371647778128,2018-04-13,1
1034,1,1,UMF 8 Aguascalientes,13,4,2018,14,52,14,59,2,2,,,,2,3,2,4,1,1,2,2,,2,,1,1,1,,1,,,,1,8,1,10,2,,2,,2,,1,10,2,,2,,2,,2,,2,,,,,,,1,1,1,5,2,2,1,10,4,4,2,43,,,1,7,30,,5,1,1,Aguascalientes,1,UMF 8 Aguascalientes,1687,1,0.244883147,27.5362609772698,2018-04-13,1
1017,1,1,UMF 8 Aguascalientes,13,4,2018,12,36,12,42,1,2,,,,2,2,2,1,1,1,2,2,,2,,1,1,1,,2,,,,1,8,1,10,2,,2,,2,,1,8,1,10,2,,2,,2,,2,,,,,,,1,1,1,2,1,99,1,7,1,2,1,995,,,1,2,69,,5,1,1,Aguascalientes,1,UMF 8 Aguascalientes,1687,1,0.244883147,22.6371647778128,2018-04-13,1
1016,1,1,UMF 8 Aguascalientes,13,4,2018,11,30,11,47,1,2,,,,1,2,1,1,1,2,2,2,,2,,1,1,1,,1,,,,1,10,1,10,2,,2,,2,,1,10,2,,2,,2,,2,,2,,,,,,,1,1,1,2,2,1,1,10,2,1,1,995,,,1,3,60,,5,1,1,Aguascalientes,1,UMF 8 Aguascalientes,1687,1,0.244883147,21.8065629534164,2018-04-13,1
1037,1,1,UMF 8 Aguascalientes,13,4,2018,8,54,9,3,1,1,,,,1,3,1,3,1,1,1,1,2,2,,1,1,1,,2,,,,1,10,1,10,2,,2,,2,,1,10,2,,2,,2,,2,,2,,,,,,,1,1,1,1,1,1,1,9,2,,,995,,,1,3,51,,5,1,1,Aguascalientes,1,UMF 8 Aguascalientes,1687,1,0.244883147,23.9459076488256,2018-04-13,1
1040,1,1,UMF 8 Aguascalientes,13,4,2018,16,33,16,41,2,2,,,,2,4,1,1,1,1,2,1,3,2,,1,1,1,,1,,,,1,10,1,10,2,,2,,2,,1,10,2,,2,,2,,2,,2,,,,,,,1,1,1,2,2,1,1,10,2,2,1,995,,,1,2,63,,5,1,1,Aguascalientes,1,UMF 8 Aguascalientes,1687,1,0.244883147,21.8065629534164,2018-04-13,1
1063,1,1,UMF 8 Aguascalientes,13,4,2018,9,12,9,20,1,2,,,,2,10,1,1,1,1,2,2,,2,,1,1,1,,2,,,,1,9,1,10,2,,2,,2,,1,9,2,,2,,2,,1,9,2,,,,,,,1,1,1,2,2,1,1,9,3,,,995,,,1,5,69,,5,1,1,Aguascalientes,1,UMF 8 Aguascalientes,1687,1,0.244883147,22.6371647778128,2018-04-13,1
1090,1,1,UMF 8 Aguascalientes,13,4,2018,19,39,19,46,1,2,,,,2,49,1,1,1,1,2,2,,2,,1,1,1,,2,,,,1,10,1,10,2,,2,,2,,1,10,2,,2,,2,,2,,2,,,,,,,1,1,1,97,,1,1,10,2,,,995,,,1,5,32,,5,1,1,Aguascalientes,1,UMF 8 Aguascalientes,1687,1,0.244883147,27.5362609772698,2018-04-13,1
1096,1,1,UMF 8 Aguascalientes,13,4,2018,15,34,15,46,1,2,,,,2,71,1,1,1,1,2,1,4,2,,1,1,1,,2,,,,1,9,1,10,2,,2,,2,,1,10,2,,2,,2,,2,,2,,,,,,,1,1,1,2,2,1,1,10,2,,,995,,,1,3,76,,5,1,1,Aguascalientes,1,UMF 8 Aguascalientes,1687,1,0.244883147,22.6371647778128,2018-04-13,1
1014,1,1,UMF 8 Aguascalientes,13,4,2018,10,26,10,32,1,2,,,,2,2,1,2,1,1,2,1,3,2,,1,1,1,,2,,,,1,10,1,10,2,,2,,2,,1,10,2,,2,,2,,2,,2,,,,,,,1,1,1,2,1,1,1,10,2,,,995,,,1,5,63,,5,1,1,Aguascalientes,1,UMF 8 Aguascalientes,1687,1,0.244883147,21.8065629534164,2018-04-13,1
1036,1,1,UMF 8 Aguascalientes,13,4,2018,18,49,19,2,2,1,,,,1,3,1,1,1,1,2,2,,2,,1,1,1,,1,,,,1,10,1,10,2,,2,,2,,1,10,2,,2,,2,,2,,2,,,,,,,1,1,1,97,,99,1,10,1,,,995,,,1,3,43,,5,1,1,Aguascalientes,1,UMF 8 Aguascalientes,1687,1,0.244883147,22.7765197173220,2018-04-13,1
1012,1,1,UMF 8 Aguascalientes,13,4,2018,9,43,9,50,1,2,,,,1,2,1,3,1,1,2,2,,2,,1,1,1,,2,,,,1,10,1,10,2,,2,,2,,1,10,2,,2,,2,,2,,2,,,,,,,1,1,1,2,2,1,1,10,2,,,995,,,1,2,66,,5,1,1,Aguascalientes,1,UMF 8 Aguascalientes,1687,1,0.244883147,22.6371647778128,2018-04-13,1
1022,1,1,UMF 8 Aguascalientes,13,4,2018,12,13,12,22,1,3,,,,2,2,1,1,1,1,2,2,,2,,1,1,1,,2,,,,1,8,1,9,2,,1,10,2,,1,10,2,,2,,2,,2,,2,,,,,,,1,1,1,2,2,1,1,10,2,,,999,,,1,2,59,,5,1,1,Aguascalientes,1,UMF 8 Aguascalientes,1687,1,0.244883147,21.8065629534164,2018-04-13,1
1052,1,1,UMF 8 Aguascalientes,13,4,2018,12,22,12,29,1,2,,,,2,6,1,1,1,1,2,1,1,2,,1,1,1,,2,,,,1,9,1,9,2,,2,,2,,1,10,2,,2,,2,,2,,2,,,,,,,1,1,1,3,2,1,1,9,2,,,14,1,,1,2,75,,5,1,1,Aguascalientes,1,UMF 8 Aguascalientes,1687,1,0.244883147,22.6371647778128,2018-04-13,1
1071,1,1,UMF 8 Aguascalientes,13,4,2018,16,27,16,36,1,4,8,12,,4,16,1,3,2,1,2,2,,2,,1,1,1,,2,,,,1,9,1,10,2,,2,,2,,1,10,2,,2,,2,,2,,2,,,,,,,2,1,1,2,3,1,1,8,2,5,2,1,13,,1,3,39,,5,1,1,Aguascalientes,1,UMF 8 Aguascalientes,1687,1,0.244883147,22.7765197173220,2018-04-13,1
1038,1,1,UMF 8 Aguascalientes,13,4,2018,12,9,12,15,1,3,,,,3,4,1,2,2,1,1,2,,2,,2,2,,,2,,,,1,8,1,8,2,,2,,2,,2,,2,,2,,2,,2,,2,,,,,,,1,1,1,1,3,1,1,8,3,3,2,8,13,,1,6,21,,5,1,1,Aguascalientes,1,UMF 8 Aguascalientes,1687,1,0.244883147,23.6064692618813,2018-04-13,1
1072,1,1,UMF 8 Aguascalientes,13,4,2018,17,21,17,28,1,2,,,,2,16,1,3,1,1,2,2,,2,,1,1,1,,2,,,,1,9,1,9,2,,2,,2,,1,9,2,,2,,2,,2,,2,,,,,,,1,1,1,3,2,1,1,9,3,,,9,37,,1,1,74,,5,1,1,Aguascalientes,1,UMF 8 Aguascalientes,1687,1,0.244883147,22.6371647778128,2018-04-13,1
1057,1,1,UMF 8 Aguascalientes,13,4,2018,9,35,9,41,1,2,,,,2,8,2,3,1,1,2,2,,2,,2,2,,,2,,,,1,9,1,9,2,,2,,2,,2,,2,,2,,2,,2,,2,,,,,,,1,1,1,5,1,99,1,9,2,,,1,3,9,1,1,73,,5,1,1,Aguascalientes,1,UMF 8 Aguascalientes,1687,1,0.244883147,22.6371647778128,2018-04-13,1
1078,1,1,UMF 8 Aguascalientes,13,4,2018,8,28,8,45,1,4,1,9,11,4,20,2,2,1,1,2,1,5,1,1,1,1,1,,2,,,,1,10,1,10,2,,2,,2,,1,10,2,,2,,2,,2,,2,,,,,,,1,1,1,2,1,1,1,10,3,5,2,1,13,14,1,5,43,,5,1,1,Aguascalientes,1,UMF 8 Aguascalientes,1687,1,0.244883147,22.7765197173220,2018-04-13,1
1061,1,1,UMF 8 Aguascalientes,13,4,2018,15,59,16,7,1,2,,,,2,9,2,2,1,1,2,2,,2,,1,1,1,,1,,,,1,10,1,10,2,,2,,2,,1,10,2,,2,,2,,2,,2,,,,,,,1,2,1,2,2,1,1,10,2,,,1,,,1,7,18,,6,1,1,Aguascalientes,1,UMF 8 Aguascalientes,1687,1,0.244883147,23.6064692618813,2018-04-13,1
1062,1,1,UMF 8 Aguascalientes,13,4,2018,14,44,14,52,1,2,,,,2,10,2,3,1,1,2,2,,2,,1,1,1,,1,,,,1,10,1,10,2,,1,9,1,8,1,10,2,,2,,2,,2,,1,10,,,,,,1,1,1,97,,1,1,9,1,2,1,9,,,2,8,20,,6,1,1,Aguascalientes,1,UMF 8 Aguascalientes,1687,1,0.244883147,23.9209179606866,2018-04-13,1
1028,1,1,UMF 8 Aguascalientes,13,4,2018,18,32,18,48,1,2,,,,2,3,2,5,1,1,2,2,,2,,1,1,1,,1,,,,1,9,1,9,2,,2,,2,,1,10,2,,2,,2,,2,,2,,,,,,,1,1,1,5,1,1,1,9,2,,,8,10,9,1,7,24,,6,1,1,Aguascalientes,1,UMF 8 Aguascalientes,1687,1,0.244883147,23.6064692618813,2018-04-13,1
1077,1,1,UMF 8 Aguascalientes,13,4,2018,19,14,19,28,1,2,,,,2,20,1,1,1,1,2,2,,2,,1,1,1,,1,,,,1,10,1,10,2,,2,,2,,1,7,2,,2,,2,,2,,2,,,,,,,1,1,1,4,2,1,1,8,3,5,2,1,,,2,9,51,,7,1,1,Aguascalientes,1,UMF 8 Aguascalientes,1687,1,0.244883147,24.2648778183309,2018-04-13,1
1001,1,1,UMF 8 Aguascalientes,13,4,2018,18,16,18,22,1,2,,,,2,1,1,1,1,1,2,2,,2,,1,1,1,,1,,,,1,10,1,10,2,,2,,2,,1,10,2,,2,,2,,2,,2,,,,,,,1,1,1,3,1,99,1,10,2,,,13,3,,2,9,50,,7,1,1,Aguascalientes,1,UMF 8 Aguascalientes,1687,1,0.244883147,24.2648778183309,2018-04-13,1
1018,1,1,UMF 8 Aguascalientes,13,4,2018,13,59,14,6,1,2,,,,2,2,1,2,1,1,2,1,4,2,,1,1,1,,1,,,,1,10,1,10,2,,1,8,2,,1,9,2,,2,,2,,1,8,2,,,,,,,1,1,1,2,2,1,1,9,1,,,995,,,2,2,75,,8,1,1,Aguascalientes,1,UMF 8 Aguascalientes,1687,1,0.244883147,22.9387019085907,2018-04-13,1
1069,1,1,UMF 8 Aguascalientes,13,4,2018,8,35,8,41,1,2,,,,2,15,2,3,1,1,2,2,,2,,1,1,1,,1,,,,1,8,1,9,2,,2,,2,,1,10,2,,2,,2,,2,,2,,,,,,,99,1,1,5,1,1,1,8,2,,,1,,,2,5,60,,9,1,1,Aguascalientes,1,UMF 8 Aguascalientes,1687,1,0.244883147,22.0970360974536,2018-04-13,1
1005,1,1,UMF 8 Aguascalientes,13,4,2018,10,41,10,50,1,2,,,,2,2,1,1,1,1,2,1,7,2,,1,1,1,,1,,,,1,10,1,10,2,,2,,2,,1,10,2,,2,,2,,2,,2,,,,,,,1,1,1,1,2,1,1,10,2,2,1,1,,,2,3,67,,9,1,1,Aguascalientes,1,UMF 8 Aguascalientes,1687,1,0.244883147,22.9387019085907,2018-04-13,1
1007,1,1,UMF 8 Aguascalientes,13,4,2018,16,56,17,3,1,2,,,,2,2,1,1,1,1,2,1,1,2,,1,1,1,,2,,,,1,10,1,10,2,,2,,2,,1,10,2,,2,,2,,2,,2,,,,,,,1,1,1,3,2,99,1,10,2,,,1,,,2,2,76,,9,1,1,Aguascalientes,1,UMF 8 Aguascalientes,1687,1,0.244883147,22.9387019085907,2018-04-13,1
1083,1,1,UMF 8 Aguascalientes,13,4,2018,10,3,10,9,1,2,,,,2,26,1,2,,1,2,2,,2,,1,1,1,,1,,,,2,,1,10,2,,2,,2,,1,10,2,,2,,2,,2,,2,,,,,,,2,1,1,2,2,1,1,10,1,,,1,,,1,7,63,,9,1,1,Aguascalientes,1,UMF 8 Aguascalientes,1687,1,0.244883147,21.8065629534164,2018-04-13,1
1042,1,1,UMF 8 Aguascalientes,13,4,2018,10,33,10,45,1,2,,,,3,5,1,1,2,1,2,1,4,2,,1,1,1,,1,,,,1,10,1,10,2,,2,,2,,1,10,1,10,2,,2,,2,,2,,,,,,,1,1,1,2,1,1,1,10,2,,,5,,,2,8,75,,9,1,1,Aguascalientes,1,UMF 8 Aguascalientes,1687,1,0.244883147,22.9387019085907,2018-04-13,1