Folio,Deleg,Unidmed,Id_Unid,Fecha_D,Fecha_M,Fecha_A,Hr_Ini_H,Hr_Ini_M,Hr_Fin_H,Hr_Fin_M,Edad,Tipopac,Edoproc,Id_Unidproc,Sat1,Sat3,Filtroch,Probsal,Especialid,Tipocons,Tespsubsec,Filtroref,Totorpase,Tiem_Esp2,Proscesoref1,Proscesoref2,Proscesoref3,Proscesoref4,Proscesoref5,Proscesoref6,Satprocref,Sattempref,Satdiferim,Tmedreg3,Pres_Med,Durasis_C,Preosad,Tratocomf,Filtrosaux1,Temsad1,Temsad1a,Temsad1b,Filtrosaux2,Temsad2,Temsad2a,Temsad2b,Recmedhoy,Filtrofarm2,Totmed,Motnosurt,Filtrourg,Probsal_Urg,Mot_Urg,Turgtriag,Tram_Urg1,Tram_Urg_2,Color_Urg,Calteurg,Califurg,Motcalifurg1,Motcalifurg2,Motcalifurg3,Filtrocir,Progciru,Topera,Fechaop,Suspop1,Suspop3,Suspop2,Suspop4,Motoper,Opfinsem,Infofam,Oportiff,Medciru,Medciru2,Calciru,Motcalifcir1,Motcalifcir2,Motcalifcir3,Trabsocciru,Ciclocir,Filtrohos,Tobscama,Razontesp,Infprealta,Calhosp,Motcalifhosp1,Motcalifhosp2,Motcalifhosp3,Btratou,Calfatna_A,Calfatnb_A,Calfatna_B,Calfatnb_B,Calfatna_C,Calfatnb_C,Calfatna_E,Calfatnb_E,Calfatna_G,Calfatnb_G,Calfatna_H,Calfatnb_H,Calfatna_I,Calfatnb_I,Calfatna_J,Calfatnb_J,Calfatna_K,Calfatnb_K,Calfatna_L,Calfatnb_L,Calfatna_M,Calfatnb_M,Calfatna_N,Calfatnb_N,Calfatna_F,Calfatnb_F,Mottratot1,Mottratot2,Mottratot3,Mottratot4,Mottratot5,Saludar,Escuchar,Responder,Tiemuv,Mejoratratou,Gafet,Btratou2,Calfinmb_F,Limp1,Limp2,Recomej_A,Recomej_B,Recomej_C,Sexo,Local,Escolar,Ocupa,Tipodhu,Fecha,Entidad,Cve_Delegaci�N,Delegaci�N,Nivel,Unidad,Promedio_Diario2016,Estrato,Moscondia,Fe_Finalnr
11001,1,HGZ 1 Aguascalientes,11,1,6,2017,8,17,8,26,70,1,1,5,2,2,2,,,,,,,,,,,,,,,,,,,,,,1,3,1,97,2,,,,2,2,,,2,,,,,,,,,,,,2,,,,,,,,,,,,,,,,,,,,2,,,,,,,,2,1,8,2,,2,,2,,1,8,2,,2,,2,,2,,2,,2,,2,,2,,,,,,,2,1,1,4,2,99,8,2,6,,1,,,1,2,3,5,5,2017-06-01,1,1,Aguascalientes,2,HGZ 1 Aguascalientes,750,511,1,7.35381668241951
11002,1,HGZ 1 Aguascalientes,11,1,6,2017,8,41,8,51,75,1,1,1,1,1,1,10,7,2,1,1,4,5,6,,,,,,1,1,1,3,1,2,2,2,1,2,1,1,1,3,1,1,2,2,,,2,,,,,,,,,,,,2,,,,,,,,,,,,,,,,,,,,2,,,,,,,,1,2,,2,,1,10,2,,2,,2,,2,,2,,2,,2,,1,2,2,,2,,,,,,,2,1,1,1,2,99,10,2,3,2,995,,,2,1,1,3,5,2017-06-01,1,1,Aguascalientes,2,HGZ 1 Aguascalientes,750,511,1,8.48224960978147
11003,1,HGZ 1 Aguascalientes,11,1,6,2017,9,15,9,27,53,1,1,2,1,1,1,18,4,2,2,1,2,6,6,,,,,,1,1,1,3,3,2,1,2,1,2,1,1,1,2,1,1,1,1,1,,2,,,,,,,,,,,,1,2,1,2,2,3,1,7,9,2,2,2,1,1,1,,,,2,2,2,,,,,,,,1,2,,2,,1,10,2,,2,,2,,2,,2,,2,,2,,2,,1,10,2,,,,,,,1,1,1,1,2,1,9,2,2,2,1,,,1,2,2,5,5,2017-06-01,1,1,Aguascalientes,2,HGZ 1 Aguascalientes,750,511,1,7.93508234707512
11004,1,HGZ 1 Aguascalientes,11,1,6,2017,9,40,9,54,50,1,1,2,2,2,2,,,,,,,,,,,,,,,,,,,,,,1,3,1,1,2,,,,2,2,,,1,19,3,5,2,,99,4,2,,,,2,,,,,,,,,,,,,,,,,,,,2,,,,,,,,2,2,,2,,2,,2,,1,9,2,,2,,2,,2,,2,,2,,2,,2,,,,,,,1,1,1,1,2,2,10,4,4,2,1,,,1,2,3,5,6,2017-06-01,1,1,Aguascalientes,2,HGZ 1 Aguascalientes,750,511,1,7.93508234707512
11005,1,HGZ 1 Aguascalientes,11,1,6,2017,10,8,10,23,49,1,1,2,2,2,2,,,,,,,,,,,,,,,,,,,,,,1,3,1,2,2,,,,1,1,1,,2,,,,,,,,,,,,2,,,,,,,,,,,,,,,,,,,,2,,,,,,,,2,2,,2,,2,,2,,1,10,2,,2,,2,,2,,2,,2,,1,99,2,,,,,,,99,1,1,2,2,99,10,1,6,,3,,,1,2,3,1,5,2017-06-01,1,1,Aguascalientes,2,HGZ 1 Aguascalientes,750,511,1,7.93508234707512
11006,1,HGZ 1 Aguascalientes,11,1,6,2017,10,36,10,49,35,1,1,2,2,4,2,,,,,,,,,,,,,,,,,,,,,,1,3,1,97,1,2,1,1,2,2,,,2,,,,,,,,,,,,2,,,,,,,,,,,,,,,,,,,,2,,,,,,,,2,2,,2,,2,,2,,1,8,2,,2,,2,,2,,2,,2,,2,,2,,,,,,,2,2,2,1,2,99,9,2,6,,4,3,,2,2,9,10,1,2017-06-01,1,1,Aguascalientes,2,HGZ 1 Aguascalientes,750,511,1,9.82527049410139
11007,1,HGZ 1 Aguascalientes,11,1,6,2017,11,15,11,29,36,1,1,4,1,1,2,,,,,,,,,,,,,,,,,,,,,,1,5,1,1,1,2,1,1,2,2,,,2,,,,,,,,,,,,2,,,,,,,,,,,,,,,,,,,,2,,,,,,,,1,2,,2,,2,,1,10,1,2,2,,2,,2,,2,,2,,2,,2,,2,,,,,,,1,1,1,1,1,1,10,2,2,2,3,5,8,2,2,5,9,6,2017-06-01,1,1,Aguascalientes,2,HGZ 1 Aguascalientes,750,511,1,9.82527049410139
11008,1,HGZ 1 Aguascalientes,11,1,6,2017,11,42,11,52,28,1,1,2,1,1,2,,,,,,,,,,,,,,,,,,,,,,2,,,,1,2,1,1,2,2,,,2,,,,,,,,,,,,97,,,,,,,,,,,,,,,,,,,,2,,,,,,,,1,2,,2,,2,,2,,2,,2,,1,10,2,,2,,2,,2,,2,,2,,,,,,,1,1,1,2,2,1,10,1,2,1,13,,,1,2,5,4,1,2017-06-01,1,1,Aguascalientes,2,HGZ 1 Aguascalientes,750,511,1,7.59202143965249
11009,1,HGZ 1 Aguascalientes,11,1,6,2017,12,20,12,29,62,1,1,2,2,2,1,6,6,2,1,2,3,5,6,,,,,,2,1,1,6,1,1,1,2,1,4,1,1,1,4,1,1,2,1,1,,2,,,,,,,,,,,,2,,,,,,,,,,,,,,,,,,,,2,,,,,,,,2,2,,2,,1,9,2,,2,,2,,2,,2,,1,4,1,5,2,,1,99,2,,,,,,,1,1,1,1,1,1,8,4,4,2,13,1,,1,2,5,5,5,2017-06-01,1,1,Aguascalientes,2,HGZ 1 Aguascalientes,750,511,1,7.35749675824789
11010,1,HGZ 1 Aguascalientes,11,1,6,2017,12,42,12,55,44,1,15,493,1,1,1,6,21,2,1,1,3,7,6,,,,,,1,2,3,2,1,2,1,2,1,4,1,1,2,,,,1,1,1,,2,,,,,,,,,,,,2,,,,,,,,,,,,,,,,,,,,2,,,,,,,,1,1,10,2,,1,10,1,10,1,10,2,,2,,2,,2,,2,,2,,1,10,2,,,,,,,99,1,1,2,2,1,10,2,3,1,13,,,1,2,9,5,5,2017-06-01,1,1,Aguascalientes,2,HGZ 1 Aguascalientes,750,511,1,8.51816928206013
11011,1,HGZ 1 Aguascalientes,11,1,6,2017,13,25,13,35,62,1,1,2,5,5,2,,,,,,,,,,,,,,,,,,,,,,1,5,1,1,2,,,,2,1,1,,2,,,,,,,,,,,,97,,,,,,,,,,,,,,,,,,,,2,,,,,,,,2,2,,2,,1,10,2,,2,,1,10,2,,2,,2,,2,,2,,1,2,2,,,,,,,1,1,1,3,2,1,10,2,6,,14,,,1,2,3,5,6,2017-06-01,1,1,Aguascalientes,2,HGZ 1 Aguascalientes,750,511,1,7.35749675824789
11012,1,HGZ 1 Aguascalientes,11,1,6,2017,13,46,13,59,31,2,1,7,2,2,2,,,,,,,,,,,,,,,,,,,,,,2,,,,1,3,1,1,2,2,,,2,,,,,,,,,,,,2,,,,,,,,,,,,,,,,,,,,2,,,,,,,,1,2,,1,9,2,,2,,2,,1,10,2,,2,,2,,1,10,2,,2,,2,,,,,,,1,1,1,3,2,1,10,2,2,1,995,,,1,2,7,4,1,2017-06-01,1,1,Aguascalientes,2,HGZ 1 Aguascalientes,750,511,1,7.59202143965249
11013,1,HGZ 1 Aguascalientes,11,1,6,2017,14,12,14,23,50,1,1,2,2,2,1,27,1,1,,2,1,1,6,2,,,,,2,2,2,4,2,1,1,2,1,3,1,1,2,,,,1,1,1,,1,7,1,6,2,,5,4,1,,,,2,,,,,,,,,,,,,,,,,,,,1,97,,2,1,,,,1,1,9,1,10,1,10,2,,2,,2,,2,,1,2,2,,1,10,2,,1,99,2,,,,,,,2,1,1,1,2,1,8,1,6,,1,9,,1,2,7,4,1,2017-06-01,1,1,Aguascalientes,2,HGZ 1 Aguascalientes,750,511,1,7.93508234707512
11014,1,HGZ 1 Aguascalientes,11,1,6,2017,15,7,15,17,61,1,1,2041,4,5,1,6,13,2,1,1,1,1,1,,,,,,1,1,1,5,1,1,1,2,2,,,,2,,,,2,2,,,2,,,,,,,,,,,,2,,,,,,,,,,,,,,,,,,,,2,,,,,,,,1,1,9,2,,1,8,2,,2,,2,,2,,1,10,2,,2,,1,10,2,,2,,,,,,,1,1,2,2,1,1,10,1,1,1,1,33,,1,2,3,5,6,2017-06-01,1,1,Aguascalientes,2,HGZ 1 Aguascalientes,750,511,1,7.35749675824789
11015,1,HGZ 1 Aguascalientes,11,1,6,2017,15,32,15,42,73,1,1,2,5,5,1,26,2,2,1,1,1,1,1,,,,,,1,1,1,5,2,1,1,2,1,8,2,1,1,4,1,1,2,2,,,1,4,8,3,2,,3,2,1,,,,2,,,,,,,,,,,,,,,,,,,,2,,,,,,,,2,1,9,1,7,1,9,1,9,2,,2,,2,,2,,2,,2,,2,,2,,2,,,,,,,2,1,1,2,1,99,7,2,5,1,1,,,1,2,5,5,6,2017-06-01,1,1,Aguascalientes,2,HGZ 1 Aguascalientes,750,511,1,7.35381668241951
11016,1,HGZ 1 Aguascalientes,11,1,6,2017,15,58,16,8,49,1,1,7,1,2,1,1,2,1,,1,5,5,6,,,,,,1,1,2,1,1,2,1,1,2,,,,1,2,1,1,2,2,,,2,,,,,,,,,,,,2,,,,,,,,,,,,,,,,,,,,2,,,,,,,,1,1,10,2,,1,8,1,10,2,,2,,2,,2,,2,,2,,2,,2,,2,,,,,,,1,1,1,1,2,99,10,2,6,,995,,,1,2,7,5,1,2017-06-01,1,1,Aguascalientes,2,HGZ 1 Aguascalientes,750,511,1,7.93508234707512
11017,1,HGZ 1 Aguascalientes,11,1,6,2017,16,24,16,38,28,1,1,7,1,1,1,13,6,1,,1,4,3,6,,,,,,2,2,1,3,1,1,1,1,1,2,1,1,1,2,1,1,2,2,,,2,,,,,,,,,,,,2,,,,,,,,,,,,,,,,,,,,2,,,,,,,,1,2,,2,,99,,99,,2,,2,,2,,1,10,2,,2,,2,,2,,2,,,,,,,2,1,1,1,2,1,10,2,2,2,1,,,1,2,9,5,5,2017-06-01,1,1,Aguascalientes,2,HGZ 1 Aguascalientes,750,511,1,7.59202143965249
11018,1,HGZ 1 Aguascalientes,11,1,6,2017,16,52,17,5,31,2,1,2,1,3,1,75,6,1,,1,1,3,10,,,,,,1,1,2,1,1,1,1,2,1,4,1,1,2,,,,1,2,,,2,,,,,,,,,,,,2,,,,,,,,,,,,,,,,,,,,2,,,,,,,,1,1,10,2,,1,10,2,,99,,2,,2,,2,,2,,2,,2,,2,,2,,,,,,,1,1,1,1,1,99,10,4,4,2,1,50,,1,2,5,5,5,2017-06-01,1,1,Aguascalientes,2,HGZ 1 Aguascalientes,750,511,1,7.59202143965249
11019,1,HGZ 1 Aguascalientes,11,1,6,2017,17,18,17,30,66,1,1,5,2,2,1,2,10,1,,1,2,4,8,6,,,,,2,4,3,4,1,1,1,2,2,,,,2,,,,1,1,1,,2,,,,,,,,,,,,2,,,,,,,,,,,,,,,,,,,,2,,,,,,,,2,1,9,1,8,1,10,2,,99,,2,,2,,2,,2,,2,,2,,1,99,2,,,,,,,1,1,1,5,1,1,10,2,6,,1,13,,1,2,3,5,5,2017-06-01,1,1,Aguascalientes,2,HGZ 1 Aguascalientes,750,511,1,7.35381668241951
11020,1,HGZ 1 Aguascalientes,11,1,6,2017,18,41,18,54,41,1,1,5,2,2,1,9,15,2,6,1,4,4,10,,,,,,2,1,4,3,3,1,2,2,1,2,1,1,1,2,1,1,1,1,1,,2,,,,,,,,,,,,2,,,,,,,,,,,,,,,,,,,,1,99,,2,2,,,,3,1,9,2,,1,9,2,,2,,2,,2,,2,,2,,2,,2,,1,9,2,,,,,,,1,1,1,1,2,99,9,2,2,1,995,,,1,2,7,10,1,2017-06-01,1,1,Aguascalientes,2,HGZ 1 Aguascalientes,750,511,1,8.51816928206013
11021,1,HGZ 1 Aguascalientes,11,1,6,2017,19,8,19,17,49,1,1,2041,2,2,1,10,7,2,4,2,5,2,1,,,,,,3,99,5,6,2,2,2,2,2,,,,2,,,,2,2,,,99,,,,,,,,,,,,2,,,,,,,,,,,,,,,,,,,,2,,,,,,,,1,2,,2,,1,10,2,,2,,2,,2,,2,,2,,2,,2,,2,,2,,,,,,,1,1,1,5,1,99,10,1,6,,1,,,1,2,2,5,5,2017-06-01,1,1,Aguascalientes,2,HGZ 1 Aguascalientes,750,511,1,7.93508234707512
11022,1,HGZ 1 Aguascalientes,11,1,6,2017,19,32,19,46,24,1,1,2,2,2,1,18,4,2,4,2,1,2,999,,,,,,2,2,1,1,1,2,1,2,1,5,1,1,2,,,,1,1,1,,1,16,3,3,2,,5,2,2,,,,2,,,,,,,,,,,,,,,,,,,,2,,,,,,,,2,2,,2,,1,10,2,,2,,2,,2,,2,,2,,2,,2,,1,8,2,,,,,,,1,1,1,1,2,1,8,2,2,1,995,,,2,2,5,4,1,2017-06-01,1,1,Aguascalientes,2,HGZ 1 Aguascalientes,750,511,1,11.64748238772760
11023,1,HGZ 1 Aguascalientes,11,1,6,2017,8,19,8,28,21,1,1,2,2,2,2,,,,,,,,,,,,,,,,,,,,,,1,4,1,1,2,,,,2,2,,,2,,,,,,,,,,,,2,,,,,,,,,,,,,,,,,,,,2,,,,,,,,1,1,10,2,,2,,2,,1,10,2,,2,,2,,2,,2,,99,,2,,2,,,,,,,1,1,1,2,1,1,10,2,4,2,995,,,1,2,5,5,5,2017-06-01,1,1,Aguascalientes,2,HGZ 1 Aguascalientes,750,511,1,10.09796389300850
11024,1,HGZ 1 Aguascalientes,11,1,6,2017,9,0,9,12,67,1,1,2,1,1,2,,,,,,,,,,,,,,,,,,,,,,1,1,1,1,2,,,,2,2,,,2,,,,,,,,,,,,2,,,,,,,,,,,,,,,,,,,,2,,,,,,,,2,1,9,2,,2,,2,,1,10,2,,2,,2,,2,,2,,2,,2,,2,,,,,,,1,2,1,2,2,99,10,2,6,,9,,,1,2,7,5,5,2017-06-01,1,1,Aguascalientes,2,HGZ 1 Aguascalientes,750,511,1,7.35381668241951
11025,1,HGZ 1 Aguascalientes,11,1,6,2017,9,26,9,41,62,1,1,4,2,2,2,,,,,,,,,,,,,,,,,,,,,,1,4,1,1,2,,,,2,2,,,2,,,,,,,,,,,,2,,,,,,,,,,,,,,,,,,,,2,,,,,,,,2,2,,1,9,2,,2,,1,9,2,,2,,2,,2,,2,,2,,2,,2,,,,,,,1,1,1,2,2,1,9,2,6,,1,,,1,2,5,5,5,2017-06-01,1,1,Aguascalientes,2,HGZ 1 Aguascalientes,750,511,1,7.35749675824789
11026,1,HGZ 1 Aguascalientes,11,1,6,2017,10,4,10,14,67,1,1,5,2,2,2,,,,,,,,,,,,,,,,,,,,,,1,7,1,1,2,,,,2,2,,,1,999,999,99,99,,99,99,99,,,,2,,,,,,,,,,,,,,,,,,,,2,,,,,,,,2,2,,1,10,2,,2,,1,10,2,,2,,2,,2,,2,,2,,2,,2,,,,,,,1,1,1,5,1,99,10,2,6,,1,,,1,2,2,5,5,2017-06-01,1,1,Aguascalientes,2,HGZ 1 Aguascalientes,750,511,1,7.35381668241951
11027,1,HGZ 1 Aguascalientes,11,1,6,2017,10,26,10,41,46,1,1,5,2,2,2,,,,,,,,,,,,,,,,,,,,,,1,5,1,1,2,,,,2,2,,,2,,,,,,,,,,,,2,,,,,,,,,,,,,,,,,,,,2,,,,,,,,1,2,,2,,2,,2,,1,6,2,,2,,2,,2,,2,,2,,2,,2,,,,,,,1,1,1,3,2,1,9,2,6,,9,10,,1,2,9,5,2,2017-06-01,1,1,Aguascalientes,2,HGZ 1 Aguascalientes,750,511,1,7.93508234707512
11028,1,HGZ 1 Aguascalientes,11,1,6,2017,10,57,11,9,43,1,1,2041,2,2,2,,,,,,,,,,,,,,,,,,,,,,1,4,1,1,1,99,99,99,2,2,,,1,999,999,99,99,,99,99,99,,,,2,,,,,,,,,,,,,,,,,,,,2,,,,,,,,2,2,,2,,2,,2,,1,10,2,,2,,2,,2,,2,,2,,2,,2,,,,,,,1,1,1,3,2,1,10,3,6,,1,,,1,2,3,5,5,2017-06-01,1,1,Aguascalientes,2,HGZ 1 Aguascalientes,750,511,1,8.51816928206013
11029,1,HGZ 1 Aguascalientes,11,1,6,2017,11,47,11,58,60,1,1,6,3,2,2,,,,,,,,,,,,,,,,,,,,,,1,5,1,1,2,,,,99,2,,,2,,,,,,,,,,,,2,,,,,,,,,,,,,,,,,,,,2,,,,,,,,1,2,,1,10,2,,2,,1,10,2,,2,,2,,2,,2,,2,,2,,2,,,,,,,1,1,1,5,1,1,10,2,6,,1,,,1,2,3,5,5,2017-06-01,1,1,Aguascalientes,2,HGZ 1 Aguascalientes,750,511,1,7.35749675824789
11030,1,HGZ 1 Aguascalientes,11,1,6,2017,12,9,12,20,31,1,1,2041,4,2,1,3,1,2,1,1,1,7,6,,,,,,2,3,3,2,1,1,1,99,1,1,1,1,2,,,,2,2,,,2,,,,,,,,,,,,2,,,,,,,,,,,,,,,,,,,,2,,,,,,,,1,1,10,2,,1,10,2,,2,,2,,2,,2,,2,,2,,2,,2,,2,,,,,,,1,1,1,1,2,2,10,2,6,,10,9,,1,2,8,5,5,2017-06-01,1,1,Aguascalientes,2,HGZ 1 Aguascalientes,750,511,1,7.59202143965249
11031,1,HGZ 1 Aguascalientes,11,1,6,2017,12,32,12,42,48,1,32,1788,2,2,1,8,2,2,1,1,3,5,6,4,,,,,2,2,2,1,1,1,1,2,1,2,1,97,1,2,1,1,1,2,,,2,,,,,,,,,,,,2,,,,,,,,,,,,,,,,,,,,2,,,,,,,,2,1,9,2,,1,9,1,9,2,,2,,2,,2,,2,,2,,2,,2,,2,,,,,,,1,1,1,1,2,1,9,2,6,,12,,,1,2,9,10,1,2017-06-01,1,1,Aguascalientes,2,HGZ 1 Aguascalientes,750,511,1,7.93508234707512
11032,1,HGZ 1 Aguascalientes,11,1,6,2017,13,8,13,23,42,1,32,1785,2,4,1,1,2,2,4,1,1,7,6,,,,,,2,4,4,1,1,2,1,1,2,,,,2,,,,2,1,1,,2,,,,,,,,,,,,2,,,,,,,,,,,,,,,,,,,,2,,,,,,,,1,1,10,2,,1,10,2,,2,,2,,2,,2,,2,,2,,2,,1,10,1,10,,,,,,1,1,1,1,2,1,10,99,2,2,9,10,12,2,2,5,4,1,2017-06-01,1,1,Aguascalientes,2,HGZ 1 Aguascalientes,750,511,1,9.82527049410139
11033,1,HGZ 1 Aguascalientes,11,1,6,2017,13,39,13,48,45,1,1,2,2,2,1,26,29,1,,1,4,6,6,,,,,,2,3,3,5,2,2,1,2,1,1,1,1,1,1,1,1,2,2,,,2,,,,,,,,,,,,2,,,,,,,,,,,,,,,,,,,,2,,,,,,,,2,1,9,2,,1,10,1,8,99,,2,,2,,2,,2,,2,,2,,2,,2,,,,,,,1,1,1,1,1,1,10,3,4,2,10,9,1,2,2,5,9,2,2017-06-01,1,1,Aguascalientes,2,HGZ 1 Aguascalientes,750,511,1,9.15270968107906
11034,1,HGZ 1 Aguascalientes,11,1,6,2017,14,0,14,14,36,1,1,8,4,2,2,,,,,,,,,,,,,,,,,,,,,,2,,,,1,2,1,2,2,2,,,2,,,,,,,,,,,,2,,,,,,,,,,,,,,,,,,,,2,,,,,,,,1,1,10,2,,2,,2,,2,,1,10,2,,2,,2,,2,,2,,2,,1,10,,,,,,2,1,1,97,,1,10,1,6,,1,,,2,2,9,2,1,2017-06-01,1,1,Aguascalientes,2,HGZ 1 Aguascalientes,750,511,1,9.82527049410139
11035,1,HGZ 1 Aguascalientes,11,1,6,2017,14,29,14,42,66,1,1,7,1,1,1,15,3,1,,1,1,5,6,,,,,,1,4,4,5,1,1,1,2,2,,,,2,,,,1,1,1,,2,,,,,,,,,,,,2,,,,,,,,,,,,,,,,,,,,2,,,,,,,,1,1,8,2,,1,9,2,,2,,2,,2,,2,,2,,2,,2,,1,8,2,,,,,,,1,1,1,3,1,1,8,3,5,2,1,,,1,2,2,5,5,2017-06-01,1,1,Aguascalientes,2,HGZ 1 Aguascalientes,750,511,1,7.35381668241951
11036,1,HGZ 1 Aguascalientes,11,1,6,2017,14,54,15,8,55,1,32,1788,4,4,2,,,,,,,,,,,,,,,,,,,,,,1,2,1,1,2,,,,2,2,,,2,,,,,,,,,,,,97,,,,,,,,,,,,,,,,,,,,2,,,,,,,,1,1,10,1,10,2,,2,,1,10,2,,2,,2,,2,,2,,99,,2,,2,,,,,,,1,1,1,4,1,1,10,4,5,2,13,,,1,2,9,9,2,2017-06-01,1,1,Aguascalientes,2,HGZ 1 Aguascalientes,750,511,1,7.35749675824789
11037,1,HGZ 1 Aguascalientes,11,1,6,2017,15,20,15,33,72,1,1,10,1,1,1,4,12,1,,2,3,6,6,,,,,,2,2,4,4,1,1,1,2,2,,,,2,,,,1,1,1,,2,,,,,,,,,,,,2,,,,,,,,,,,,,,,,,,,,99,,,,,,,,1,1,7,2,,1,10,2,,2,,2,,2,,2,,2,,2,,2,,1,10,2,,,,,,,2,1,1,5,1,1,10,2,2,2,13,9,,1,2,2,5,5,2017-06-01,1,1,Aguascalientes,2,HGZ 1 Aguascalientes,750,511,1,7.35381668241951
11038,1,HGZ 1 Aguascalientes,11,1,6,2017,15,46,15,54,33,1,1,2,2,2,1,3,1,1,,1,1,5,6,,,,,,2,4,4,4,1,1,1,2,2,,,,2,,,,1,2,,,2,,,,,,,,,,,,2,,,,,,,,,,,,,,,,,,,,2,,,,,,,,2,1,8,2,,1,9,2,,2,,2,,2,,2,,2,,2,,2,,2,,2,,,,,,,2,1,1,2,2,99,8,2,2,1,1,,,1,2,7,2,1,2017-06-01,1,1,Aguascalientes,2,HGZ 1 Aguascalientes,750,511,1,7.59202143965249
11039,1,HGZ 1 Aguascalientes,11,1,6,2017,16,7,16,21,51,1,1,2,3,3,2,,,,,,,,,,,,,,,,,,,,,,1,4,1,1,2,,,,2,2,,,2,,,,,,,,,,,,2,,,,,,,,,,,,,,,,,,,,2,,,,,,,,2,2,,2,,2,,2,,2,,1,9,2,,2,,2,,2,,2,,2,,2,,,,,,,2,1,1,1,3,99,9,3,3,2,13,1,,1,2,7,2,5,2017-06-01,1,1,Aguascalientes,2,HGZ 1 Aguascalientes,750,511,1,7.93508234707512
11040,1,HGZ 1 Aguascalientes,11,1,6,2017,16,35,16,45,49,1,1,2,1,1,2,,,,,,,,,,,,,,,,,,,,,,1,4,1,1,2,,,,1,1,1,,2,,,,,,,,,,,,2,,,,,,,,,,,,,,,,,,,,2,,,,,,,,1,1,10,1,10,1,10,2,,1,10,1,10,2,,2,,2,,2,,2,,1,10,2,,,,,,,1,1,1,1,1,1,10,2,2,1,13,,,2,2,9,8,5,2017-06-01,1,1,Aguascalientes,2,HGZ 1 Aguascalientes,750,511,1,9.15270968107906
11041,1,HGZ 1 Aguascalientes,11,1,6,2017,17,0,17,15,28,1,1,2,2,2,2,,,,,,,,,,,,,,,,,,,,,,2,,,,1,2,1,1,2,2,,,2,,,,,,,,,,,,2,,,,,,,,,,,,,,,,,,,,2,,,,,,,,2,1,8,2,,1,10,2,,2,,2,,2,,2,,2,,2,,2,,2,,2,,,,,,,1,1,1,1,1,99,10,2,6,,8,,,2,2,9,2,1,2017-06-01,1,1,Aguascalientes,2,HGZ 1 Aguascalientes,750,511,1,8.75700655523509
11042,1,HGZ 1 Aguascalientes,11,1,6,2017,17,29,17,42,80,1,1,2,3,3,2,,,,,,,,,,,,,,,,,,,,,,2,,,,1,2,1,1,1,1,1,,2,,,,,,,,,,,,2,,,,,,,,,,,,,,,,,,,,2,,,,,,,,2,2,,2,,2,,2,,2,,2,,2,,2,,2,,2,,2,,1,10,2,,,,,,,1,1,1,1,1,2,10,2,6,,9,8,10,1,2,1,5,5,2017-06-01,1,1,Aguascalientes,2,HGZ 1 Aguascalientes,750,511,1,7.35381668241951
11043,1,HGZ 1 Aguascalientes,11,1,6,2017,17,54,18,7,19,1,1,2,1,1,2,,,,,,,,,,,,,,,,,,,,,,2,,,,1,2,1,1,2,2,,,2,,,,,,,,,,,,2,,,,,,,,,,,,,,,,,,,,2,,,,,,,,1,1,8,2,,2,,2,,2,,2,,2,,2,,2,,2,,2,,2,,2,,,,,,,1,1,1,1,2,1,10,2,6,,1,,,2,2,7,6,5,2017-06-01,1,1,Aguascalientes,2,HGZ 1 Aguascalientes,750,511,1,11.64748238772760
11044,1,HGZ 1 Aguascalientes,11,1,6,2017,18,23,18,31,48,1,32,1788,1,1,1,1,2,1,,1,1,1,6,,,,,,1,1,1,2,1,1,1,2,2,,,,1,2,1,1,2,2,,,2,,,,,,,,,,,,2,,,,,,,,,,,,,,,,,,,,2,,,,,,,,1,1,10,2,,1,10,2,,2,,2,,2,,2,,2,,2,,2,,2,,2,,,,,,,1,99,1,5,1,1,10,2,6,,995,,,2,2,5,3,5,2017-06-01,1,1,Aguascalientes,2,HGZ 1 Aguascalientes,750,511,1,9.15270968107906
11045,1,HGZ 1 Aguascalientes,11,1,6,2017,18,43,18,57,59,1,1,2041,4,4,1,1,2,2,1,1,6,1,6,1,,,,,3,2,3,2,1,1,1,2,1,4,1,1,1,2,1,1,2,2,,,2,,,,,,,,,,,,2,,,,,,,,,,,,,,,,,,,,1,4,99,1,1,,,,1,2,,2,,1,10,1,8,2,,2,,2,,2,,2,,2,,2,,2,,2,,,,,,,1,1,1,1,2,1,10,2,2,1,1,,,2,2,5,2,1,2017-06-01,1,1,Aguascalientes,2,HGZ 1 Aguascalientes,750,511,1,8.48649438812003
11046,1,HGZ 1 Aguascalientes,11,1,6,2017,19,12,19,23,59,1,1,2,4,4,2,,,,,,,,,,,,,,,,,,,,,,1,4,1,1,2,,,,1,2,,,2,,,,,,,,,,,,2,,,,,,,,,,,,,,,,,,,,2,,,,,,,,2,1,10,2,,1,10,2,,2,,2,,2,,2,,2,,2,,2,,2,,2,,,,,,,2,2,1,2,2,2,9,4,4,2,9,8,,1,2,5,2,1,2017-06-01,1,1,Aguascalientes,2,HGZ 1 Aguascalientes,750,511,1,7.35749675824789
11048,1,HGZ 1 Aguascalientes,11,1,6,2017,8,20,8,29,55,1,1,2,2,1,1,2,5,1,,1,1,5,1,,,,,,2,2,4,2,2,1,2,2,2,,,,2,,,,2,2,,,2,,,,,,,,,,,,2,,,,,,,,,,,,,,,,,,,,2,,,,,,,,3,2,,1,10,1,10,2,,2,,2,,2,,2,,2,,2,,2,,2,,2,,,,,,,1,2,2,2,2,99,10,4,5,2,1,13,,1,2,2,5,5,2017-06-01,1,1,Aguascalientes,2,HGZ 1 Aguascalientes,750,511,1,7.35749675824789
11050,1,HGZ 1 Aguascalientes,11,1,6,2017,9,35,9,46,55,1,32,9888,4,3,1,18,4,1,,1,1,7,1,,,,,,4,4,2,4,1,1,1,2,2,,,,2,,,,2,2,,,2,,,,,,,,,,,,2,,,,,,,,,,,,,,,,,,,,97,,,,,,,,2,2,,2,,1,10,2,,2,,2,,2,,2,,2,,2,,2,,2,,1,10,,,,,,1,1,1,97,,1,10,2,2,1,1,9,10,2,1,2,2,1,2017-06-01,1,1,Aguascalientes,2,HGZ 1 Aguascalientes,750,511,1,8.48649438812003
11051,1,HGZ 1 Aguascalientes,11,1,6,2017,10,26,10,39,43,1,1,3,1,3,2,,,,,,,,,,,,,,,,,,,,,,1,2,1,97,2,,,,2,2,,,2,,,,,,,,,,,,2,,,,,,,,,,,,,,,,,,,,2,,,,,,,,2,2,,2,,2,,1,10,1,10,2,,2,,2,,2,,2,,2,,2,,2,,,,,,,1,1,1,1,1,1,10,4,6,,1,9,13,1,2,7,1,5,2017-06-01,1,1,Aguascalientes,2,HGZ 1 Aguascalientes,750,511,1,8.51816928206013
11052,1,HGZ 1 Aguascalientes,11,1,6,2017,11,1,11,13,61,1,1,2,3,3,2,,,,,,,,,,,,,,,,,,,,,,1,4,1,2,2,,,,2,2,,,2,,,,,,,,,,,,2,,,,,,,,,,,,,,,,,,,,2,,,,,,,,2,1,10,2,,2,,1,10,1,10,2,,2,,2,,2,,2,,2,,2,,2,,,,,,,1,1,1,2,1,1,10,3,4,2,14,,,1,1,2,5,5,2017-06-01,1,1,Aguascalientes,2,HGZ 1 Aguascalientes,750,511,1,7.35749675824789
11053,1,HGZ 1 Aguascalientes,11,1,6,2017,11,33,11,44,69,1,1,3,2,2,1,1,2,2,1,1,1,5,1,,,,,,1,4,3,1,2,1,1,2,2,,,,2,,,,1,2,,,2,,,,,,,,,,,,2,,,,,,,,,,,,,,,,,,,,2,,,,,,,,1,2,,1,10,1,10,2,,2,,2,,2,,2,,2,,2,,2,,2,,2,,,,,,,1,1,1,1,2,1,10,2,2,2,1,9,11,1,2,2,5,5,2017-06-01,1,1,Aguascalientes,2,HGZ 1 Aguascalientes,750,511,1,7.35381668241951
11054,1,HGZ 1 Aguascalientes,11,1,6,2017,12,27,12,37,75,1,1,2,1,2,2,,,,,,,,,,,,,,,,,,,,,,2,,,,1,2,1,97,2,2,,,2,,,,,,,,,,,,2,,,,,,,,,,,,,,,,,,,,2,,,,,,,,2,2,,2,,2,,1,8,1,10,1,10,2,,2,,2,,2,,2,,2,,2,,,,,,,1,1,1,99,,1,8,2,6,,1,13,,1,2,1,9,2,2017-06-01,1,1,Aguascalientes,2,HGZ 1 Aguascalientes,750,511,1,7.35381668241951
11055,1,HGZ 1 Aguascalientes,11,1,6,2017,12,55,13,5,68,1,1,5,2,2,1,42,3,2,7,1,1,5,1,,,,,,1,1,1,2,1,1,1,2,1,1,1,1,2,,,,2,2,,,2,,,,,,,,,,,,2,,,,,,,,,,,,,,,,,,,,2,,,,,,,,1,1,10,1,10,1,10,2,,2,,2,,2,,2,,2,,2,,2,,2,,2,,,,,,,1,1,1,1,2,1,10,2,5,2,1,13,,1,1,3,5,5,2017-06-01,1,1,Aguascalientes,2,HGZ 1 Aguascalientes,750,511,1,7.35381668241951
11056,1,HGZ 1 Aguascalientes,11,1,6,2017,13,42,13,56,22,2,1,2041,1,1,1,9,15,1,,1,1,5,2,,,,,,4,1,1,3,2,2,1,2,2,,,,2,,,,2,2,,,1,24,5,6,1,1,4,4,2,,,,2,,,,,,,,,,,,,,,,,,,,2,,,,,,,,3,2,,2,,1,5,2,,2,,2,,2,,2,,2,,2,,2,,2,,2,,,,,,,1,1,1,99,,1,5,3,5,2,1,9,13,1,2,5,5,5,2017-06-01,1,1,Aguascalientes,2,HGZ 1 Aguascalientes,750,511,1,10.09796389300850
11057,1,HGZ 1 Aguascalientes,11,1,6,2017,14,39,14,51,64,1,1,5,3,3,2,,,,,,,,,,,,,,,,,,,,,,1,2,1,97,2,,,,2,2,,,2,,,,,,,,,,,,2,,,,,,,,,,,,,,,,,,,,2,,,,,,,,2,1,10,2,,2,,1,10,1,10,2,,2,,2,,2,,2,,2,,2,,2,,,,,,,1,1,1,4,1,1,10,2,4,2,1,13,10,2,2,2,9,2,2017-06-01,1,1,Aguascalientes,2,HGZ 1 Aguascalientes,750,511,1,8.48649438812003
11058,1,HGZ 1 Aguascalientes,11,1,6,2017,15,8,15,17,39,1,1,1,3,2,1,7,12,1,,1,1,5,1,,,,,,4,3,1,1,1,2,2,2,2,,,,2,,,,2,2,,,2,,,,,,,,,,,,2,,,,,,,,,,,,,,,,,,,,2,,,,,,,,3,2,,2,,1,8,1,10,2,,2,,2,,2,,2,,2,,2,,2,,2,,,,,,,1,1,1,97,,1,8,2,2,1,1,9,13,2,1,4,2,1,2017-06-01,1,1,Aguascalientes,2,HGZ 1 Aguascalientes,750,511,1,9.82527049410139
11059,1,HGZ 1 Aguascalientes,11,1,6,2017,15,38,15,52,73,1,1,5,4,4,1,2,43,2,2,1,1,3,1,,,,,,2,2,1,1,1,1,1,2,1,3,1,2,1,4,1,2,1,2,,,2,,,,,,,,,,,,2,,,,,,,,,,,,,,,,,,,,2,,,,,,,,1,1,10,2,,1,10,2,,2,,2,,2,,2,,2,,2,,2,,2,,2,,,,,,,1,1,1,2,1,2,10,4,4,2,1,12,13,1,2,4,5,5,2017-06-01,1,1,Aguascalientes,2,HGZ 1 Aguascalientes,750,511,1,7.35381668241951
11060,1,HGZ 1 Aguascalientes,11,1,6,2017,16,48,16,56,42,1,1,2,1,2,2,,,,,,,,,,,,,,,,,,,,,,1,4,1,1,2,,,,2,2,,,2,,,,,,,,,,,,2,,,,,,,,,,,,,,,,,,,,2,,,,,,,,3,2,,2,,2,,2,,2,,2,,2,,2,,2,,2,,2,,2,,2,,,,,,,2,2,2,2,3,2,1,2,2,2,1,11,13,1,2,2,1,2,2017-06-01,1,1,Aguascalientes,2,HGZ 1 Aguascalientes,750,511,1,8.51816928206013
11061,1,HGZ 1 Aguascalientes,11,1,6,2017,17,18,17,32,45,1,1,2,1,2,1,18,4,2,7,1,1,5,1,,,,,,2,1,1,4,1,2,2,2,2,,,,2,,,,2,2,,,2,,,,,,,,,,,,2,,,,,,,,,,,,,,,,,,,,2,,,,,,,,2,2,,2,,1,10,2,,2,,2,,2,,2,,2,,2,,2,,2,,2,,,,,,,1,1,1,4,2,1,10,2,6,,1,8,13,1,2,4,5,5,2017-06-01,1,1,Aguascalientes,2,HGZ 1 Aguascalientes,750,511,1,7.93508234707512
11062,1,HGZ 1 Aguascalientes,11,1,6,2017,17,50,18,5,40,1,1,1,1,2,1,5,22,2,2,1,1,3,999,,,,,,1,1,1,1,2,1,1,1,2,,,,2,,,,1,1,1,,2,,,,,,,,,,,,2,,,,,,,,,,,,,,,,,,,,2,,,,,,,,2,2,,2,,99,,1,10,2,,2,,2,,2,,2,,2,,2,,1,99,2,,,,,,,1,1,1,2,2,1,10,2,2,1,995,,,1,1,2,8,5,2017-06-01,1,1,Aguascalientes,2,HGZ 1 Aguascalientes,750,511,1,8.51816928206013
11063,1,HGZ 1 Aguascalientes,11,1,6,2017,18,24,18,38,59,1,1,2,3,4,1,1,2,2,7,1,1,5,1,,,,,,1,1,1,5,2,2,2,2,2,,,,2,,,,2,2,,,2,,,,,,,,,,,,2,,,,,,,,,,,,,,,,,,,,2,,,,,,,,2,1,8,2,,1,9,2,,2,,2,,2,,2,,2,,2,,2,,2,,2,,,,,,,1,1,1,3,2,99,8,2,2,1,1,13,10,2,1,3,2,1,2017-06-01,1,1,Aguascalientes,2,HGZ 1 Aguascalientes,750,511,1,8.48649438812003
11064,1,HGZ 1 Aguascalientes,11,1,6,2017,18,57,19,8,70,1,1,2,2,1,1,2,5,2,7,1,99,99,1,2,,,,,3,1,1,1,2,1,1,2,2,,,,2,,,,1,1,1,,1,19,3,3,2,,97,4,2,,,,2,,,,,,,,,,,,,,,,,,,,2,,,,,,,,2,2,,2,,1,8,2,,2,,2,,2,,2,,2,,2,,2,,1,9,2,,,,,,,2,1,1,5,1,1,8,2,2,1,1,,,2,2,8,9,2,2017-06-01,1,1,Aguascalientes,2,HGZ 1 Aguascalientes,750,511,1,8.48224960978147
11065,1,HGZ 1 Aguascalientes,11,1,6,2017,8,44,8,55,39,1,11,9888,1,1,1,18,4,1,,1,1,1,1,,,,,,2,1,2,2,1,1,1,2,1,1,1,1,2,,,,1,1,1,,1,16,1,1,1,1,99,5,1,,,,2,,,,,,,,,,,,,,,,,,,,2,,,,,,,,1,1,9,1,8,1,10,2,,2,,2,,2,,2,,2,,2,,2,,1,8,2,,,,,,,1,1,1,2,2,1,8,2,2,1,1,,,2,2,7,2,1,2017-06-01,1,1,Aguascalientes,2,HGZ 1 Aguascalientes,750,511,1,9.82527049410139
11066,1,HGZ 1 Aguascalientes,11,1,6,2017,9,8,9,21,78,1,1,3,1,1,2,,,,,,,,,,,,,,,,,,,,,,1,4,1,1,2,,,,99,2,,,2,,,,,,,,,,,,2,,,,,,,,,,,,,,,,,,,,1,1,,1,2,,,,2,2,,2,,1,8,1,10,1,10,2,,2,,2,,2,,2,,2,,2,,2,,,,,,,1,1,1,2,2,1,10,3,4,2,1,13,,1,2,5,9,2,2017-06-01,1,1,Aguascalientes,2,HGZ 1 Aguascalientes,750,511,1,7.35381668241951
11067,1,HGZ 1 Aguascalientes,11,1,6,2017,9,36,9,49,27,1,1,2,2,2,1,3,1,2,1,1,8,5,999,,,,,,2,2,1,2,1,2,2,1,1,5,1,1,1,1,1,1,2,2,,,1,3,1,3,2,,99,3,2,,,,2,,,,,,,,,,,,,,,,,,,,2,,,,,,,,2,2,,2,,1,8,2,,2,,2,,2,,2,,2,,2,,2,,2,,2,,,,,,,2,2,2,2,2,1,8,2,2,2,1,,,1,2,5,2,1,2017-06-01,1,1,Aguascalientes,2,HGZ 1 Aguascalientes,750,511,1,7.59202143965249
11068,1,HGZ 1 Aguascalientes,11,1,6,2017,10,3,10,12,45,1,1,5,5,5,1,1,2,1,,1,1,1,1,,,,,,4,4,4,3,1,1,1,1,2,,,,1,2,1,2,2,2,,,2,,,,,,,,,,,,2,,,,,,,,,,,,,,,,,,,,2,,,,,,,,2,2,,2,,1,8,2,,2,,2,,2,,2,,2,,2,,2,,2,,2,,,,,,,2,2,2,1,2,2,5,5,5,2,1,,,2,1,5,2,1,2017-06-01,1,1,Aguascalientes,2,HGZ 1 Aguascalientes,750,511,1,9.15270968107906
11070,1,HGZ 1 Aguascalientes,11,1,6,2017,10,48,10,57,75,1,1,2,2,2,2,,,,,,,,,,,,,,,,,,,,,,1,1,1,1,1,1,2,2,2,2,,,2,,,,,,,,,,,,2,,,,,,,,,,,,,,,,,,,,2,,,,,,,,2,1,9,2,,2,,1,10,1,10,2,,2,,2,,2,,2,,2,,2,,2,,,,,,,1,1,1,2,2,1,8,2,2,2,1,,,1,2,5,9,2,2017-06-01,1,1,Aguascalientes,2,HGZ 1 Aguascalientes,750,511,1,7.35381668241951
11071,1,HGZ 1 Aguascalientes,11,1,6,2017,11,12,11,25,45,1,1,2,2,2,1,3,1,2,2,1,8,5,2,,,,,,2,2,2,2,2,2,1,1,2,,,,1,1,1,1,2,2,,,2,,,,,,,,,,,,2,,,,,,,,,,,,,,,,,,,,1,2,,2,2,,,,2,2,,2,,1,8,1,5,2,,1,10,2,,2,,2,,2,,2,,2,,2,,,,,,,1,2,1,1,2,1,9,2,6,,1,,,1,2,7,1,5,2017-06-01,1,1,Aguascalientes,2,HGZ 1 Aguascalientes,750,511,1,7.93508234707512