Folio,Deleg,Id_Unid,Unidmed,Fecha_D,Fecha_M,Fecha_A,Hr_Ini_H,Hr_Ini_M,Hr_Fin_H,Hr_Fin_M,Edad,Edoproc,Id_Unidproc,Sat1,Sat3,Filtroch,Probsal,Especialid,Totorpase,Tiem_Esp2,Tmedreg3,Durasis_C,Preosad,Tratocomf,Filtrosaux1,Temsad1,Temsad1a,Filtrosaux2,Temsad2,Temsad2a,Recmedhoy,Filtrofarm2,Totmed,Motnosurt,Filtrourg,Probsal_Urg,Mot_Urg,Turgtriag,Tram_Urg,Calteurg,Califurg,Motcalifurg1,Motcalifurg2,Motcalifurg3,Filtrocir,Progciru,Topera,Fechaop,Suspop1,Suspop3,Suspop2,Suspop4,Motoper,Opfinsem,Infofam,Oportiff,Medciru,Medciru2,Calciru,Motcalifcir1,Motcalifcir2,Motcalifcir3,Trabsocciru,Ciclocir,Filtrohos,Tobscama,Razontesp,Infprealta,Calhosp,Motcalifhosp1,Motcalifhosp2,Motcalifhosp3,Btratou,Calfatna_A,Calfatnb_A,Calfatna_B,Calfatnb_B,Calfatna_C,Calfatnb_C,Calfatna_E,Calfatnb_E,Calfatna_F,Calfatnb_F,Calfatna_G,Calfatnb_G,Calfatna_H,Calfatnb_H,Calfatna_I,Calfatnb_I,Calfatna_J,Calfatnb_J,Calfatna_K,Calfatnb_K,Calfatna_L,Calfatnb_L,Calfatna_M,Calfatnb_M,Calfatna_N,Calfatnb_N,Saludar,Escuchar,Responder,Tiemuv,Mejoratratou,Gafet,Btratou2,Calfinmb_F,Limp1,Limp2,Recomej_A,Recomej_B,Recomej_C,Sexo,Local,Escolar,Fecha,Entidad,Id_Unidad,Cve_Delegaci�N,Delegaci�N,Nivel,Unidad,Promedio_Diario2015,Estrato,Moscondia,Fe_Finalnr
30010001,7,3001,Hospital de Especialidades No. 71 Torre�n,11,11,2016,8,3,8,10,25,8,232,2,2,1,9,26,7,5,3,2,1,2,1,3,1,1,3,1,2,2,,,2,,,,,,,,,,2,,,,,,,,,,,,,,,,,,,,2,,,,,,,,2,1,8,2,,1,10,2,,2,,2,,2,,2,,2,,2,,2,,2,,2,,1,1,1,1,1,1,8,2,6,,995,,,1,2,5,2016-11-11,5,3001,7,Coahuila,3,Hospital de Especialidades No. 71 Torre�n,436,1,1.00000000000000000000,2.71538935056274000000
30010002,7,3001,Hospital de Especialidades No. 71 Torre�n,11,11,2016,8,13,8,20,49,8,242,2,1,2,,,,,,,,,1,6,1,2,,,2,2,,,2,,,,,,,,,,2,,,,,,,,,,,,,,,,,,,,2,,,,,,,,1,2,,2,,2,,1,10,2,,1,10,2,,2,,2,,2,,2,,2,,2,,1,1,1,5,2,1,10,2,2,2,13,,,1,2,3,2016-11-11,5,3001,7,Coahuila,3,Hospital de Especialidades No. 71 Torre�n,436,1,1.00000000000000000000,2.95187781416483000000
30010003,7,3001,Hospital de Especialidades No. 71 Torre�n,11,11,2016,8,21,8,28,57,8,233,1,1,2,,,,,,,,,1,3,1,2,,,2,2,,,2,,,,,,,,,,2,,,,,,,,,,,,,,,,,,,,2,,,,,,,,2,2,,2,,2,,1,9,2,,1,10,2,,2,,2,,2,,2,,2,,2,,1,1,1,2,2,99,10,3,6,,995,,,1,2,7,2016-11-11,5,3001,7,Coahuila,3,Hospital de Especialidades No. 71 Torre�n,436,1,1.00000000000000000000,2.57570914245861000000
30010004,7,3001,Hospital de Especialidades No. 71 Torre�n,11,11,2016,8,36,8,43,43,8,233,2,2,2,,,,,,,,,1,6,1,2,,,2,2,,,2,,,,,,,,,,2,,,,,,,,,,,,,,,,,,,,2,,,,,,,,2,1,10,2,,2,,1,10,2,,1,10,2,,2,,2,,2,,2,,2,,2,,1,1,1,1,1,1,10,3,3,2,1,,,2,2,3,2016-11-11,5,3001,7,Coahuila,3,Hospital de Especialidades No. 71 Torre�n,436,1,1.00000000000000000000,2.55669636635553000000
30010005,7,3001,Hospital de Especialidades No. 71 Torre�n,11,11,2016,8,44,8,53,22,8,245,2,2,1,26,21,7,5,4,1,1,2,1,1,1,1,1,1,2,2,,,2,,,,,,,,,,1,2,1,1,,,,,98,2,2,1,2,2,3,7,,,2,1,1,1,,2,2,,,,2,1,9,2,,1,10,2,,2,,2,,2,,2,,2,,2,,2,,2,,2,,1,1,1,1,2,1,9,5,5,2,13,1,,1,2,7,2016-11-11,5,3001,7,Coahuila,3,Hospital de Especialidades No. 71 Torre�n,436,1,1.00000000000000000000,2.71538935056274000000
30010024,7,3001,Hospital de Especialidades No. 71 Torre�n,11,11,2016,9,15,9,22,73,8,232,2,1,1,10,5,7,6,4,1,1,2,2,,,2,,,1,1,1,,2,,,,,,,,,,2,,,,,,,,,,,,,,,,,,,,2,,,,,,,,1,1,9,2,,1,10,2,,2,,2,,2,,2,,2,,2,,2,,2,,1,10,1,1,1,5,2,99,10,2,1,1,995,,,1,2,2,2016-11-11,5,3001,7,Coahuila,3,Hospital de Especialidades No. 71 Torre�n,436,1,1.00000000000000000000,2.92970945374820000000
30010025,7,3001,Hospital de Especialidades No. 71 Torre�n,11,11,2016,9,26,9,34,38,8,233,1,1,2,,,,,,,,,1,5,1,1,5,1,2,2,,,2,,,,,,,,,,2,,,,,,,,,,,,,,,,,,,,1,3,99,1,1,,,,1,2,,2,,2,,1,10,2,,1,10,2,,2,,2,,2,,2,,2,,2,,1,1,1,4,2,1,10,1,1,1,995,,,1,2,9,2016-11-11,5,3001,7,Coahuila,3,Hospital de Especialidades No. 71 Torre�n,436,1,1.00000000000000000000,2.79022749834482000000
30010037,7,3001,Hospital de Especialidades No. 71 Torre�n,11,11,2016,10,10,10,17,28,10,444,1,1,2,,,,,,,,,2,,,1,6,1,2,2,,,2,,,,,,,,,,2,,,,,,,,,,,,,,,,,,,,2,,,,,,,,2,2,,2,,2,,2,,2,,2,,1,9,2,,2,,2,,2,,2,,2,,1,1,1,2,2,1,9,2,4,2,10,8,13,1,1,9,2016-11-11,5,3001,7,Coahuila,3,Hospital de Especialidades No. 71 Torre�n,436,1,1.00000000000000000000,2.90141859342744000000
30010038,7,3001,Hospital de Especialidades No. 71 Torre�n,11,11,2016,10,27,10,36,62,8,246,3,2,1,14,13,1,2,6,2,1,2,1,1,1,2,,,2,2,,,2,,,,,,,,,,2,,,,,,,,,,,,,,,,,,,,2,,,,,,,,1,1,9,2,,1,10,2,,2,,2,,2,,2,,2,,2,,1,7,2,,2,,1,1,1,1,1,1,9,1,3,2,1,13,8,2,1,2,2016-11-11,5,3001,7,Coahuila,3,Hospital de Especialidades No. 71 Torre�n,436,1,1.00000000000000000000,2.36013235810309000000
30010039,7,3001,Hospital de Especialidades No. 71 Torre�n,11,11,2016,10,43,10,50,55,6,156,2,1,1,10,5,6,3,3,1,1,2,1,1,1,1,1,1,2,2,,,2,,,,,,,,,,2,,,,,,,,,,,,,,,,,,,,2,,,,,,,,1,1,8,2,,1,10,2,,2,,2,,2,,2,,2,,2,,2,,2,,2,,99,1,1,5,1,1,10,2,3,2,13,,,2,1,8,2016-11-11,5,3001,7,Coahuila,3,Hospital de Especialidades No. 71 Torre�n,436,1,1.00000000000000000000,2.36013235810309000000
30010049,7,3001,Hospital de Especialidades No. 71 Torre�n,11,11,2016,11,25,11,32,58,10,447,2,1,1,16,4,1,4,5,1,1,2,1,4,1,1,3,1,1,1,1,,2,,,,,,,,,,2,,,,,,,,,,,,,,,,,,,,2,,,,,,,,2,1,10,1,10,1,10,2,,2,,2,,2,,2,,2,,2,,2,,2,,1,8,2,1,1,3,2,1,10,2,6,,995,,,1,1,1,2016-11-11,5,3001,7,Coahuila,3,Hospital de Especialidades No. 71 Torre�n,436,1,1.00000000000000000000,2.57570914245861000000
30010050,7,3001,Hospital de Especialidades No. 71 Torre�n,11,11,2016,11,54,12,2,19,10,443,2,1,1,65,21,6,3,5,2,1,2,1,1,1,2,,,1,1,1,,1,67,4,1,1,4,1,,,,2,,,,,,,,,,,,,,,,,,,,2,,,,,,,,2,1,9,2,,1,10,1,10,2,,2,,2,,2,,2,,2,,2,,2,,1,10,1,1,1,1,2,1,10,2,4,2,13,,,1,2,7,2016-11-11,5,3001,7,Coahuila,3,Hospital de Especialidades No. 71 Torre�n,436,1,1.00000000000000000000,2.71538935056274000000
30010061,7,3001,Hospital de Especialidades No. 71 Torre�n,11,11,2016,12,31,12,38,19,8,255,2,2,1,4,2,6,2,4,1,1,2,1,1,1,1,1,1,2,2,,,2,,,,,,,,,,2,,,,,,,,,,,,,,,,,,,,2,,,,,,,,2,2,,1,5,1,10,1,10,2,,2,,1,10,2,,2,,2,,2,,2,,2,,1,1,1,1,1,1,10,2,2,1,995,,,2,1,5,2016-11-11,5,3001,7,Coahuila,3,Hospital de Especialidades No. 71 Torre�n,436,1,1.00000000000000000000,2.48812187893014000000
30010078,7,3001,Hospital de Especialidades No. 71 Torre�n,11,11,2016,14,21,14,28,42,8,233,2,2,1,52,14,6,3,6,2,1,1,1,3,1,2,,,2,2,,,2,,,,,,,,,,2,,,,,,,,,,,,,,,,,,,,2,,,,,,,,2,1,8,2,,1,8,2,,2,,2,,2,,2,,2,,2,,2,,2,,2,,1,1,1,5,1,1,10,2,2,1,13,1,3,2,2,9,2016-11-11,5,3001,7,Coahuila,3,Hospital de Especialidades No. 71 Torre�n,436,1,1.00000000000000000000,2.55669636635553000000
30010079,7,3001,Hospital de Especialidades No. 71 Torre�n,11,11,2016,14,59,15,6,45,6,202,5,4,1,18,11,7,7,6,1,1,2,2,,,2,,,2,2,,,2,,,,,,,,,,2,,,,,,,,,,,,,,,,,,,,2,,,,,,,,4,1,10,2,,1,5,2,,2,,2,,2,,2,,2,,2,,2,,2,,2,,1,1,1,2,1,1,10,2,2,1,13,1,,1,1,5,2016-11-11,5,3001,7,Coahuila,3,Hospital de Especialidades No. 71 Torre�n,436,1,1.00000000000000000000,2.95187781416483000000
30010087,7,3001,Hospital de Especialidades No. 71 Torre�n,11,11,2016,15,27,15,34,42,6,156,4,4,1,18,2,7,3,1,2,2,1,1,3,1,2,,,2,2,,,2,,,,,,,,,,2,,,,,,,,,,,,,,,,,,,,2,,,,,,,,4,1,10,1,10,1,7,2,,2,,2,,2,,2,,2,,2,,2,,2,,2,,2,2,2,97,,1,7,4,6,,13,1,,1,2,5,2016-11-11,5,3001,7,Coahuila,3,Hospital de Especialidades No. 71 Torre�n,436,1,1.00000000000000000000,2.79022749834482000000
30010092,7,3001,Hospital de Especialidades No. 71 Torre�n,11,11,2016,16,51,16,58,43,10,447,2,2,1,158,9,1,2,6,2,1,2,1,1,1,2,,,1,1,1,,2,,,,,,,,,,2,,,,,,,,,,,,,,,,,,,,2,,,,,,,,2,1,10,2,,1,9,2,,2,,1,10,2,,2,,2,,2,,2,,2,,1,9,1,1,1,1,2,1,10,2,4,2,13,1,,2,2,7,2016-11-11,5,3001,7,Coahuila,3,Hospital de Especialidades No. 71 Torre�n,436,1,1.00000000000000000000,2.55669636635553000000
30010097,7,3001,Hospital de Especialidades No. 71 Torre�n,11,11,2016,17,16,17,23,64,10,455,3,2,2,,,,,,,,,2,,,1,4,1,2,2,,,2,,,,,,,,,,2,,,,,,,,,,,,,,,,,,,,2,,,,,,,,2,2,,1,8,2,,1,10,2,,2,,1,9,2,,2,,2,,2,,2,,2,,1,1,1,3,2,1,9,4,3,2,13,8,1,1,2,3,2016-11-11,5,3001,7,Coahuila,3,Hospital de Especialidades No. 71 Torre�n,436,1,1.00000000000000000000,2.57570914245861000000
30010098,7,3001,Hospital de Especialidades No. 71 Torre�n,11,11,2016,17,40,17,47,37,8,232,2,2,1,3,4,99,99,1,1,1,2,2,,,2,,,1,1,1,,2,,,,,,,,,,2,,,,,,,,,,,,,,,,,,,,2,,,,,,,,1,1,10,2,,1,10,2,,2,,2,,2,,2,,2,,2,,2,,2,,1,9,1,1,1,5,1,1,10,2,2,2,12,13,,1,2,9,2016-11-11,5,3001,7,Coahuila,3,Hospital de Especialidades No. 71 Torre�n,436,1,1.00000000000000000000,2.79022749834482000000
30010006,7,3001,Hospital de Especialidades No. 71 Torre�n,11,11,2016,8,3,8,11,23,32,1775,2,2,1,33,6,1,1,1,1,1,1,1,2,1,2,,,2,2,,,2,,,,,,,,,,1,1,3,2,1,2,2,28,14,2,2,2,1,1,2,,,,1,1,2,,,,,,,,2,1,9,1,10,1,10,2,,2,,1,9,2,,2,,2,,2,,2,,2,,2,,1,2,1,2,2,1,9,3,6,,13,,,1,1,6,2016-11-11,5,3001,7,Coahuila,3,Hospital de Especialidades No. 71 Torre�n,436,1,1.00000000000000000000,2.71538935056274000000
30010007,7,3001,Hospital de Especialidades No. 71 Torre�n,11,11,2016,8,15,8,22,56,8,233,2,2,1,185,21,7,3,2,1,1,2,1,1,1,2,,,2,2,,,2,,,,,,,,,,2,,,,,,,,,,,,,,,,,,,,2,,,,,,,,2,1,9,2,,1,10,2,,2,,1,10,2,,2,,2,,2,,2,,2,,2,,99,1,1,2,2,1,9,3,3,2,13,12,2,2,2,1,2016-11-11,5,3001,7,Coahuila,3,Hospital de Especialidades No. 71 Torre�n,436,1,1.00000000000000000000,2.36013235810309000000
30010008,7,3001,Hospital de Especialidades No. 71 Torre�n,11,11,2016,8,25,8,36,49,8,232,2,2,1,33,29,7,3,3,1,1,2,1,3,1,2,,,1,1,1,,2,,,,,,,,,,1,1,3,1,,,,,36,2,2,2,1,1,2,,,,1,2,2,,,,,,,,2,1,9,2,,1,10,2,,2,,2,,2,,2,,2,,2,,2,,2,,1,10,2,2,1,2,2,1,9,2,3,2,995,,,1,2,9,2016-11-11,5,3001,7,Coahuila,3,Hospital de Especialidades No. 71 Torre�n,436,1,1.00000000000000000000,2.95187781416483000000
30010009,7,3001,Hospital de Especialidades No. 71 Torre�n,11,11,2016,8,38,8,45,50,10,444,2,2,2,,,,,,,,,1,2,1,2,,,2,2,,,1,15,2,4,1,2,2,,,,2,,,,,,,,,,,,,,,,,,,,1,97,,1,2,,,,2,1,10,2,,2,,1,10,2,,2,,2,,2,,2,,2,,2,,99,,2,,1,1,1,2,2,1,9,2,3,2,13,36,2,1,1,8,2016-11-11,5,3001,7,Coahuila,3,Hospital de Especialidades No. 71 Torre�n,436,1,1.00000000000000000000,2.95187781416483000000
30010010,7,3001,Hospital de Especialidades No. 71 Torre�n,11,11,2016,8,47,8,54,29,8,233,2,2,2,,,,,,,,,1,7,1,2,,,2,2,,,1,22,2,6,2,5,3,1,2,3,2,,,,,,,,,,,,,,,,,,,,2,,,,,,,,2,1,9,2,,2,,2,,2,,1,9,2,,2,,2,,2,,2,,2,,2,,2,2,2,2,2,1,9,4,5,2,1,,,1,2,7,2016-11-11,5,3001,7,Coahuila,3,Hospital de Especialidades No. 71 Torre�n,436,1,1.00000000000000000000,2.90141859342744000000
30010027,7,3001,Hospital de Especialidades No. 71 Torre�n,11,11,2016,9,0,9,7,64,8,232,2,2,1,26,13,7,2,4,1,1,2,1,3,1,2,,,2,2,,,2,,,,,,,,,,2,,,,,,,,,,,,,,,,,,,,1,99,,2,99,,,,2,1,10,2,,1,10,2,,2,,2,,2,,2,,2,,2,,2,,2,,2,,1,1,1,2,2,1,9,3,3,2,995,,,1,2,3,2016-11-11,5,3001,7,Coahuila,3,Hospital de Especialidades No. 71 Torre�n,436,1,1.00000000000000000000,2.57570914245861000000
30010028,7,3001,Hospital de Especialidades No. 71 Torre�n,11,11,2016,9,17,9,24,31,8,233,2,2,1,10,5,6,2,3,2,1,2,1,3,1,2,,,2,2,,,2,,,,,,,,,,2,,,,,,,,,,,,,,,,,,,,2,,,,,,,,2,1,9,2,,1,9,2,,2,,2,,2,,2,,2,,99,,99,,2,,99,,2,1,1,2,2,1,9,2,2,2,995,,,1,2,5,2016-11-11,5,3001,7,Coahuila,3,Hospital de Especialidades No. 71 Torre�n,436,1,1.00000000000000000000,2.90141859342744000000
30010029,7,3001,Hospital de Especialidades No. 71 Torre�n,11,11,2016,9,58,10,5,23,10,454,2,2,1,32,12,7,2,1,1,1,1,2,,,2,,,2,2,,,2,,,,,,,,,,2,,,,,,,,,,,,,,,,,,,,2,,,,,,,,2,1,10,2,,1,10,2,,2,,2,,2,,2,,2,,2,,2,,2,,2,,99,1,1,2,2,1,9,2,2,2,995,,,1,2,5,2016-11-11,5,3001,7,Coahuila,3,Hospital de Especialidades No. 71 Torre�n,436,1,1.00000000000000000000,2.71538935056274000000
30010040,7,3001,Hospital de Especialidades No. 71 Torre�n,11,11,2016,10,17,10,25,55,8,242,2,2,1,20,25,7,2,3,1,1,2,1,1,1,2,,,2,1,1,,1,11,2,6,2,2,2,,,,2,,,,,,,,,,,,,,,,,,,,2,,,,,,,,2,1,10,2,,1,10,2,,2,,2,,2,,2,,2,,2,,2,,2,,1,9,1,1,1,2,2,1,9,2,3,2,2,,,1,2,9,2016-11-11,5,3001,7,Coahuila,3,Hospital de Especialidades No. 71 Torre�n,436,1,1.00000000000000000000,2.57570914245861000000
30010041,7,3001,Hospital de Especialidades No. 71 Torre�n,11,11,2016,10,46,10,53,41,8,232,2,2,1,24,24,7,2,4,2,1,2,1,1,2,2,,,2,2,,,2,,,,,,,,,,1,1,6,1,,,,,8,2,2,2,1,1,2,,,,1,2,2,,,,,,,,2,1,10,2,,1,10,2,,2,,2,,2,,2,,2,,2,,2,,2,,2,,1,1,1,2,2,1,9,3,5,2,9,8,,1,2,7,2016-11-11,5,3001,7,Coahuila,3,Hospital de Especialidades No. 71 Torre�n,436,1,1.00000000000000000000,2.79022749834482000000
30010051,7,3001,Hospital de Especialidades No. 71 Torre�n,11,11,2016,11,2,11,9,29,6,153,2,2,1,10,5,7,2,4,1,1,2,1,1,1,2,,,2,2,,,2,,,,,,,,,,2,,,,,,,,,,,,,,,,,,,,2,,,,,,,,2,1,10,2,,1,10,2,,2,,2,,2,,2,,2,,2,,2,,2,,2,,1,1,1,2,2,1,9,2,2,2,2,10,,2,1,5,2016-11-11,5,3001,7,Coahuila,3,Hospital de Especialidades No. 71 Torre�n,436,1,1.00000000000000000000,2.65858120153024000000
30010052,7,3001,Hospital de Especialidades No. 71 Torre�n,11,11,2016,11,40,11,47,76,10,1951,2,1,1,26,13,1,7,3,1,1,2,1,1,1,1,1,1,2,2,,,2,,,,,,,,,,2,,,,,,,,,,,,,,,,,,,,2,,,,,,,,2,1,8,2,,1,9,2,,2,,2,,2,,2,,2,,2,,2,,2,,2,,1,1,1,1,2,1,9,2,2,2,9,,,1,2,9,2016-11-11,5,3001,7,Coahuila,3,Hospital de Especialidades No. 71 Torre�n,436,1,1.00000000000000000000,2.92970945374820000000
30010053,7,3001,Hospital de Especialidades No. 71 Torre�n,11,11,2016,11,56,12,3,42,32,1777,2,2,1,6,10,7,2,6,1,1,2,2,,,2,,,2,2,,,2,,,,,,,,,,2,,,,,,,,,,,,,,,,,,,,2,,,,,,,,2,1,10,2,,1,10,1,8,2,,2,,2,,2,,2,,2,,2,,2,,2,,1,1,1,5,2,1,9,2,2,1,2,,,1,1,9,2016-11-11,5,3001,7,Coahuila,3,Hospital de Especialidades No. 71 Torre�n,436,1,1.00000000000000000000,2.79022749834482000000
30010062,7,3001,Hospital de Especialidades No. 71 Torre�n,11,11,2016,12,18,12,25,38,32,1784,2,2,1,6,10,3,1,1,1,1,2,1,3,1,1,3,1,1,1,1,,2,,,,,,,,,,1,1,3,1,,,,,105,2,2,2,1,1,2,,,,1,2,1,97,,1,3,1,2,3,2,1,10,2,,1,10,2,,2,,2,,2,,99,,2,,99,,99,,2,,99,,1,1,1,2,2,1,9,2,4,2,13,,,1,1,5,2016-11-11,5,3001,7,Coahuila,3,Hospital de Especialidades No. 71 Torre�n,436,1,1.00000000000000000000,2.79022749834482000000
30010063,7,3001,Hospital de Especialidades No. 71 Torre�n,11,11,2016,12,48,12,56,25,10,446,3,2,1,33,9,2,3,3,1,1,1,1,1,1,1,2,1,1,1,1,,2,,,,,,,,,,1,2,2,1,,,,,14,2,2,2,1,1,2,,,,1,1,1,1,,1,1,,,,1,1,9,2,,1,9,2,,2,,1,8,2,,2,,2,,2,,99,,99,,1,9,1,1,1,2,2,1,9,2,3,2,8,9,13,2,1,5,2016-11-11,5,3001,7,Coahuila,3,Hospital de Especialidades No. 71 Torre�n,436,1,1.00000000000000000000,2.48812187893014000000
30010080,7,3001,Hospital de Especialidades No. 71 Torre�n,11,11,2016,14,49,14,56,40,8,233,2,2,1,26,13,7,4,5,1,1,2,1,1,1,1,1,1,2,2,,,2,,,,,,,,,,2,,,,,,,,,,,,,,,,,,,,2,,,,,,,,2,1,7,2,,1,1,2,,2,,1,9,1,9,2,,2,,2,,2,,2,,2,,1,2,2,2,2,2,9,5,5,2,1,2,9,1,2,7,2016-11-11,5,3001,7,Coahuila,3,Hospital de Especialidades No. 71 Torre�n,436,1,1.00000000000000000000,2.79022749834482000000
30010088,7,3001,Hospital de Especialidades No. 71 Torre�n,11,11,2016,15,13,15,20,44,32,1776,3,2,1,43,18,7,7,6,1,1,2,1,1,1,1,1,1,2,2,,,1,4,2,6,2,2,2,,,,2,,,,,,,,,,,,,,,,,,,,2,,,,,,,,2,1,9,2,,1,10,2,,2,,1,8,2,,2,,2,,2,,2,,2,,2,,1,1,1,2,2,2,9,2,3,2,173,,,1,1,3,2016-11-11,5,3001,7,Coahuila,3,Hospital de Especialidades No. 71 Torre�n,436,1,1.00000000000000000000,2.79022749834482000000
30010093,7,3001,Hospital de Especialidades No. 71 Torre�n,11,11,2016,16,25,16,32,22,8,246,2,2,1,20,25,7,2,4,1,1,2,2,,,2,,,2,2,,,2,,,,,,,,,,2,,,,,,,,,,,,,,,,,,,,2,,,,,,,,2,1,10,2,,2,,1,10,2,,2,,2,,2,,2,,2,,2,,2,,2,,2,1,1,2,2,1,9,2,3,2,995,,,1,1,5,2016-11-11,5,3001,7,Coahuila,3,Hospital de Especialidades No. 71 Torre�n,436,1,1.00000000000000000000,2.71538935056274000000
30010099,7,3001,Hospital de Especialidades No. 71 Torre�n,11,11,2016,17,12,17,19,62,6,166,2,2,1,16,4,7,4,3,1,1,2,2,,,2,,,1,2,,,2,,,,,,,,,,2,,,,,,,,,,,,,,,,,,,,2,,,,,,,,1,1,10,2,,1,10,2,,2,,2,,2,,99,,2,,2,,2,,2,,2,,1,1,1,2,2,2,10,2,2,2,995,,,1,1,3,2016-11-11,5,3001,7,Coahuila,3,Hospital de Especialidades No. 71 Torre�n,436,1,1.00000000000000000000,2.57570914245861000000
30010100,7,3001,Hospital de Especialidades No. 71 Torre�n,11,11,2016,17,32,17,42,22,8,233,4,2,1,4,29,6,3,4,1,1,2,2,,,1,3,1,2,2,,,1,4,2,4,1,3,2,,,,2,,,,,,,,,,,,,,,,,,,,2,,,,,,,,2,1,10,2,,1,10,2,,2,,1,9,2,,2,,2,,2,,2,,2,,2,,1,1,1,1,2,2,9,2,6,,9,8,1,2,2,8,2016-11-11,5,3001,7,Coahuila,3,Hospital de Especialidades No. 71 Torre�n,436,1,1.00000000000000000000,2.48812187893014000000
30010107,7,3001,Hospital de Especialidades No. 71 Torre�n,11,11,2016,18,2,18,9,59,8,233,2,2,1,10,5,7,4,4,1,1,2,1,1,1,1,2,1,2,2,,,2,,,,,,,,,,2,,,,,,,,,,,,,,,,,,,,2,,,,,,,,2,1,10,2,,1,9,2,,2,,99,,99,,2,,2,,2,,2,,2,,2,,1,1,1,2,2,1,9,2,6,,995,,,1,2,3,2016-11-11,5,3001,7,Coahuila,3,Hospital de Especialidades No. 71 Torre�n,436,1,1.00000000000000000000,2.57570914245861000000
30010110,7,3001,Hospital de Especialidades No. 71 Torre�n,11,11,2016,19,8,19,15,68,8,232,3,3,1,26,13,1,1,1,1,1,1,2,,,2,,,1,1,1,,2,,,,,,,,,,2,,,,,,,,,,,,,,,,,,,,1,6,2,1,2,,,,1,1,9,2,,1,6,2,,2,,2,,2,,2,,2,,1,9,2,,2,,1,2,1,1,1,2,2,1,9,5,5,2,13,1,,1,1,7,2016-11-11,5,3001,7,Coahuila,3,Hospital de Especialidades No. 71 Torre�n,436,1,1.00000000000000000000,2.92970945374820000000
30010112,7,3001,Hospital de Especialidades No. 71 Torre�n,11,11,2016,8,4,8,11,67,8,3001,2,2,2,,,,,,,,,1,5,1,2,,,2,2,,,2,,,,,,,,,,2,,,,,,,,,,,,,,,,,,,,2,,,,,,,,2,1,10,2,,2,,1,10,2,,1,10,2,,2,,2,,2,,2,,2,,2,,1,1,1,4,2,1,10,3,6,,47,,,1,2,3,2016-11-11,5,3001,7,Coahuila,3,Hospital de Especialidades No. 71 Torre�n,436,1,1.00000000000000000000,2.92970945374820000000
30010113,7,3001,Hospital de Especialidades No. 71 Torre�n,11,11,2016,8,16,8,25,43,8,233,2,2,1,26,7,1,6,1,2,2,2,1,6,1,2,,,2,2,,,2,,,,,,,,,,2,,,,,,,,,,,,,,,,,,,,2,,,,,,,,2,2,,1,8,2,,2,,2,,1,8,2,,2,,2,,2,,2,,2,,2,,1,1,1,5,2,2,8,2,2,2,1,9,8,2,2,8,2016-11-11,5,3001,7,Coahuila,3,Hospital de Especialidades No. 71 Torre�n,436,1,1.00000000000000000000,2.55669636635553000000
30010115,7,3001,Hospital de Especialidades No. 71 Torre�n,11,11,2016,8,33,8,41,50,8,232,1,1,1,52,14,1,3,3,1,1,2,1,2,1,2,,,1,1,1,,2,,,,,,,,,,2,,,,,,,,,,,,,,,,,,,,2,,,,,,,,1,1,10,2,,1,10,1,10,2,,1,10,2,,2,,2,,2,,2,,2,,1,10,1,1,1,1,1,1,10,3,2,1,13,36,,1,2,5,2016-11-11,5,3001,7,Coahuila,3,Hospital de Especialidades No. 71 Torre�n,436,1,1.00000000000000000000,2.95187781416483000000
30010116,7,3001,Hospital de Especialidades No. 71 Torre�n,11,11,2016,8,41,8,48,75,10,458,2,2,2,,,,,,,,,1,4,1,2,,,2,2,,,2,,,,,,,,,,2,,,,,,,,,,,,,,,,,,,,2,,,,,,,,2,2,,2,,2,,1,10,2,,1,10,2,,2,,2,,2,,2,,2,,2,,1,1,1,3,2,1,10,2,6,,995,,,1,2,7,2016-11-11,5,3001,7,Coahuila,3,Hospital de Especialidades No. 71 Torre�n,436,1,1.00000000000000000000,2.92970945374820000000
30010118,7,3001,Hospital de Especialidades No. 71 Torre�n,11,11,2016,8,51,8,58,46,8,246,2,2,2,,,,,,,,,1,1,1,2,,,2,2,,,2,,,,,,,,,,2,,,,,,,,,,,,,,,,,,,,2,,,,,,,,2,2,,2,,2,,2,,2,,1,8,2,,2,,2,,2,,2,,2,,2,,99,1,1,1,1,99,10,4,2,2,1,,,1,2,7,2016-11-11,5,3001,7,Coahuila,3,Hospital de Especialidades No. 71 Torre�n,436,1,1.00000000000000000000,2.95187781416483000000
30010133,7,3001,Hospital de Especialidades No. 71 Torre�n,11,11,2016,9,2,9,9,56,8,232,2,2,2,,,,,,,,,1,6,1,2,,,2,2,,,2,,,,,,,,,,2,,,,,,,,,,,,,,,,,,,,2,,,,,,,,1,2,,2,,2,,2,,2,,1,10,2,,2,,2,,2,,2,,2,,2,,1,1,1,2,1,1,10,2,6,,12,,,1,2,5,2016-11-11,5,3001,7,Coahuila,3,Hospital de Especialidades No. 71 Torre�n,436,1,1.00000000000000000000,2.57570914245861000000
30010134,7,3001,Hospital de Especialidades No. 71 Torre�n,11,11,2016,9,11,9,18,32,8,232,2,1,2,,,,,,,,,1,4,1,2,,,2,2,,,2,,,,,,,,,,2,,,,,,,,,,,,,,,,,,,,1,1,,1,2,,,,2,1,10,2,,2,,1,10,1,10,1,10,2,,2,,2,,2,,1,10,2,,2,,1,1,1,3,1,1,10,4,4,2,13,,,1,2,7,2016-11-11,5,3001,7,Coahuila,3,Hospital de Especialidades No. 71 Torre�n,436,1,1.00000000000000000000,2.90141859342744000000
30010139,7,3001,Hospital de Especialidades No. 71 Torre�n,11,11,2016,10,3,10,11,30,8,242,2,2,1,26,13,2,7,6,2,1,2,1,4,2,1,6,2,2,2,,,2,,,,,,,,,,2,,,,,,,,,,,,,,,,,,,,2,,,,,,,,2,2,,2,,1,9,1,10,2,,2,,2,,2,,2,,2,,2,,2,,2,,2,1,1,1,1,1,9,2,4,2,1,22,,1,2,9,2016-11-11,5,3001,7,Coahuila,3,Hospital de Especialidades No. 71 Torre�n,436,1,1.00000000000000000000,2.90141859342744000000
30010140,7,3001,Hospital de Especialidades No. 71 Torre�n,11,11,2016,10,18,10,25,30,8,245,2,1,2,,,,,,,,,1,1,1,2,,,2,2,,,2,,,,,,,,,,2,,,,,,,,,,,,,,,,,,,,2,,,,,,,,1,2,,2,,2,,1,10,2,,1,10,2,,2,,2,,1,10,1,10,2,,2,,1,1,1,1,1,1,10,2,2,1,995,,,2,2,5,2016-11-11,5,3001,7,Coahuila,3,Hospital de Especialidades No. 71 Torre�n,436,1,1.00000000000000000000,2.65858120153024000000
30010141,7,3001,Hospital de Especialidades No. 71 Torre�n,11,11,2016,10,37,10,44,70,8,233,1,1,1,26,13,1,1,1,1,1,2,1,1,1,1,1,1,2,2,,,2,,,,,,,,,,2,,,,,,,,,,,,,,,,,,,,1,1,,1,1,,,,1,1,10,1,10,1,10,1,10,2,,1,10,2,,2,,2,,2,,1,10,2,,2,,1,1,1,1,1,99,10,4,5,2,13,,,1,2,9,2016-11-11,5,3001,7,Coahuila,3,Hospital de Especialidades No. 71 Torre�n,436,1,1.00000000000000000000,2.92970945374820000000
30010149,7,3001,Hospital de Especialidades No. 71 Torre�n,11,11,2016,11,3,11,10,39,8,233,3,1,1,16,4,1,5,4,1,1,2,2,,,2,,,1,1,1,,2,,,,,,,,,,2,,,,,,,,,,,,,,,,,,,,2,,,,,,,,2,1,8,2,,1,10,2,,2,,2,,2,,2,,2,,2,,2,,2,,1,10,1,1,1,3,2,99,8,2,6,,8,,,1,2,9,2016-11-11,5,3001,7,Coahuila,3,Hospital de Especialidades No. 71 Torre�n,436,1,1.00000000000000000000,2.79022749834482000000
30010150,7,3001,Hospital de Especialidades No. 71 Torre�n,11,11,2016,11,31,11,38,37,32,1780,2,1,1,65,21,1,3,2,1,1,2,2,,,2,,,2,2,,,2,,,,,,,,,,2,,,,,,,,,,,,,,,,,,,,2,,,,,,,,1,1,10,2,,1,10,2,,2,,2,,2,,2,,2,,2,,2,,2,,2,,1,1,1,3,2,1,10,1,1,2,995,,,1,2,5,2016-11-11,5,3001,7,Coahuila,3,Hospital de Especialidades No. 71 Torre�n,436,1,1.00000000000000000000,2.79022749834482000000
30010158,7,3001,Hospital de Especialidades No. 71 Torre�n,11,11,2016,12,0,12,14,32,32,1777,2,2,1,16,4,1,1,4,2,1,2,1,1,1,2,,,1,1,1,,1,16,5,5,20,2,2,,,,1,1,1,1,,,,,11,2,1,2,1,1,1,,,,1,2,1,1,,1,1,,,,1,1,9,2,,1,10,1,10,1,10,2,,2,,1,10,2,,1,10,1,10,2,,1,10,1,1,1,1,1,1,10,2,2,1,2,,,2,2,6,2016-11-11,5,3001,7,Coahuila,3,Hospital de Especialidades No. 71 Torre�n,436,1,1.00000000000000000000,2.65858120153024000000
30010159,7,3001,Hospital de Especialidades No. 71 Torre�n,11,11,2016,12,42,12,50,49,8,255,2,2,1,26,13,1,3,4,2,2,2,1,2,1,1,6,1,2,2,,,2,,,,,,,,,,2,,,,,,,,,,,,,,,,,,,,2,,,,,,,,5,1,1,2,,2,,2,,2,,1,10,2,,2,,2,,2,,2,,2,,2,,2,2,2,1,1,99,1,2,2,2,1,,,2,1,7,2016-11-11,5,3001,7,Coahuila,3,Hospital de Especialidades No. 71 Torre�n,436,1,1.00000000000000000000,2.70481718278444000000
30010164,7,3001,Hospital de Especialidades No. 71 Torre�n,11,11,2016,13,11,13,18,48,8,233,2,2,1,26,13,1,2,4,1,1,2,1,2,1,1,2,1,1,1,1,,2,,,,,,,,,,2,,,,,,,,,,,,,,,,,,,,2,,,,,,,,2,1,8,2,,1,10,1,10,2,,2,,2,,2,,2,,2,,1,8,2,,1,9,1,1,1,1,2,1,9,2,2,1,13,,,1,2,7,2016-11-11,5,3001,7,Coahuila,3,Hospital de Especialidades No. 71 Torre�n,436,1,1.00000000000000000000,2.95187781416483000000
30010165,7,3001,Hospital de Especialidades No. 71 Torre�n,11,11,2016,13,46,13,58,35,8,233,2,2,1,26,12,1,2,3,1,1,2,2,,,1,2,1,2,2,,,1,26,5,5,2,5,5,14,,,2,,,,,,,,,,,,,,,,,,,,1,1,,1,1,,,,4,1,8,2,,2,,2,,2,,2,,2,,2,,1,8,2,,1,1,2,,2,,1,1,1,1,2,1,8,2,1,1,1,13,,1,2,7,2016-11-11,5,3001,7,Coahuila,3,Hospital de Especialidades No. 71 Torre�n,436,1,1.00000000000000000000,2.79022749834482000000
30010173,7,3001,Hospital de Especialidades No. 71 Torre�n,11,11,2016,15,7,15,23,29,32,1776,2,1,1,33,3,1,3,3,1,1,1,1,2,1,1,1,1,2,2,,,2,,,,,,,,,,1,2,3,1,,,,,14,2,4,2,1,1,1,,,,2,2,2,,,,,,,,2,2,,1,9,2,,2,,2,,2,,2,,2,,1,10,2,,1,10,2,,2,,1,1,1,1,2,1,10,3,3,2,13,,,1,1,9,2016-11-11,5,3001,7,Coahuila,3,Hospital de Especialidades No. 71 Torre�n,436,1,1.00000000000000000000,2.90141859342744000000
30010177,7,3001,Hospital de Especialidades No. 71 Torre�n,11,11,2016,16,59,17,6,74,6,150,2,2,1,4,2,1,7,6,1,1,2,2,,,2,,,2,2,,,2,,,,,,,,,,2,,,,,,,,,,,,,,,,,,,,2,,,,,,,,2,1,10,2,,1,10,1,10,2,,2,,2,,2,,2,,2,,1,9,2,,2,,1,1,1,5,1,1,10,2,2,1,36,,,2,1,3,2016-11-11,5,3001,7,Coahuila,3,Hospital de Especialidades No. 71 Torre�n,436,1,1.00000000000000000000,2.68450422745772000000
30010180,7,3001,Hospital de Especialidades No. 71 Torre�n,11,11,2016,17,26,17,33,25,8,233,2,2,1,10,5,1,2,2,1,1,2,2,,,2,,,2,2,,,2,,,,,,,,,,2,,,,,,,,,,,,,,,,,,,,2,,,,,,,,2,1,10,2,,1,10,2,,2,,2,,2,,2,,2,,2,,2,,2,,2,,1,1,1,5,1,1,10,1,6,,995,,,1,2,7,2016-11-11,5,3001,7,Coahuila,3,Hospital de Especialidades No. 71 Torre�n,436,1,1.00000000000000000000,2.71538935056274000000