folio,deleg,id_unid,unidmed,fecha_d,fecha_m,fecha_a,hr_ini_h,hr_ini_m,hr_fin_h,hr_fin_m,edad,tipopac,edoproc,id_unidproc,sat1,sat3,filtroch,probsal,especialid,tipocons,tespsubsec,totorpase,tiem_esp2,proscesoref_1,proscesoref_2,proscesoref_3,proscesoref_4,proscesoref_5,proscesoref_6,satprocref,sattempref,satdiferim,tmedreg3,durasis_c,preosad,tratocomf,preven3,filtrosaux1,temsad1,temsad1a,filtrosaux2,temsad2,temsad2a,recmedhoy,filtrofarm2,tfarsurt,totmed,motnosurt,filtrourg,probsal_urg,mot_urg,turgtriag,tram_urg,calteurg,califurg,filtrocir,progciru,topera,fechaop,suspop1,suspop3,suspop4,motoper,opfinsem,infofam,oportiff,calciru,medciru,filtrohos,tobscama,razontesp,infprealta,calhosp,btratou,calfatna_a,calfatnb_a,calfatna_b,calfatnb_b,calfatna_c,calfatnb_c,calfatna_e,calfatnb_e,calfatna_f,calfatnb_f,calfatna_g,calfatnb_g,calfatna_h,calfatnb_h,calfatna_i,calfatnb_i,calfatna_j,calfatnb_j,calfatna_k,calfatnb_k,calfatna_l,calfatnb_l,calfatna_m,calfatnb_m,calfatna_n,calfatnb_n,saludar,escuchar,responder,tiemuv,mejoratratou,gafet,tratoigual,btratou2,calfinmb_f,limp1,limp2,recomej_a,recomej_b,recomej_c,sugeren,local,sexo,escolar,id_unidad,Cve_Delegaci�n,Delegaci�n,Nivel,Promedio_diario2015,Estrato,MOSCondia,FE_FinalNR
110001,1,11,HGZ 1 Aguascalientes,1,7,2016,8,22,8,30,42,1,32,1785,1,3,2,,,,,,,,,,,,,,,,,,,,1,1,2,1,2,,,2,2,,,,2,,,,,,,2,,,,,,,,,,,,,2,,,,,1,2,,1,8,2,,2,,2,,1,10,2,,2,,2,,2,,2,,2,,2,,1,1,1,3,2,99,1,10,2,2,2,12,,,996,2,1,8,11,1,Aguascalientes,2,758,1433,1,9.698463973
110002,1,11,HGZ 1 Aguascalientes,1,7,2016,8,44,8,50,70,1,1,2,2,2,2,,,,,,,,,,,,,,,,,,,,2,1,3,1,2,,,2,2,,,,2,,,,,,,2,,,,,,,,,,,,,2,,,,,2,2,,1,8,2,,2,,2,,1,9,2,,2,,2,,2,,2,,2,,2,,2,1,1,2,2,1,1,9,2,3,2,10,,,996,2,1,2,11,1,Aguascalientes,2,758,1433,1,7.686550997
110003,1,11,HGZ 1 Aguascalientes,1,7,2016,8,52,8,58,71,1,1,2,1,1,2,,,,,,,,,,,,,,,,,,,,2,2,,,1,3,1,2,2,,,,2,,,,,,,2,,,,,,,,,,,,,2,,,,,1,2,,1,10,2,,2,,2,,2,,1,10,2,,2,,2,,1,9,2,,2,,1,2,1,2,1,1,1,10,2,6,,12,,,996,1,1,7,11,1,Aguascalientes,2,758,1433,1,7.686550997
110004,1,11,HGZ 1 Aguascalientes,1,7,2016,9,0,9,7,54,1,1,2,2,2,2,,,,,,,,,,,,,,,,,,,,1,1,3,1,2,,,2,2,,,,2,,,,,,,2,,,,,,,,,,,,,2,,,,,2,2,,1,10,2,,2,,2,,1,10,2,,2,,2,,2,,2,,2,,2,,1,1,1,2,2,1,1,10,2,6,,12,,,996,2,2,3,11,1,Aguascalientes,2,758,1433,1,13.270917
110007,1,11,HGZ 1 Aguascalientes,1,7,2016,10,11,10,22,80,1,14,820,2,2,1,16,16,2,1,,,,,,,,,,,,5,1,1,2,1,1,1,1,1,1,1,1,1,1,1,,2,,,,,,,1,3,1,1,,,,11,1,2,2,2,1,1,1,,1,2,2,1,9,1,10,1,10,1,9,2,,2,,2,,2,,2,,2,,2,,2,,1,9,1,1,1,1,2,1,1,10,2,2,2,8,6,9,996,1,1,3,11,1,Aguascalientes,2,758,1433,1,7.686550997
110008,1,11,HGZ 1 Aguascalientes,1,7,2016,10,50,10,58,54,1,32,9888,1,2,1,7,18,2,7,,,,,,,,,,,,3,1,1,2,1,2,,,2,,,1,1,1,1,,1,4,1,6,1,3,2,2,,,,,,,,,,,,,2,,,,,2,1,9,2,,1,10,1,9,2,,2,,2,,1,10,2,,2,,2,,2,,1,10,99,1,1,99,,1,1,10,2,2,1,12,,,996,1,1,5,11,1,Aguascalientes,2,758,1433,1,11.18831829
110010,1,11,HGZ 1 Aguascalientes,1,7,2016,11,46,11,54,72,1,1,2,2,2,2,,,,,,,,,,,,,,,,,,,,1,1,1,1,2,,,2,2,,,,2,,,,,,,2,,,,,,,,,,,,,99,,,,,1,2,,1,9,2,,2,,1,9,1,10,2,,2,,2,,2,,2,,2,,2,,1,1,1,1,2,1,1,10,1,6,,12,,,996,1,1,3,11,1,Aguascalientes,2,758,1433,1,7.686550997
110014,1,11,HGZ 1 Aguascalientes,1,7,2016,13,30,13,38,56,1,32,1785,2,2,2,,,,,,,,,,,,,,,,,,,,2,1,2,1,1,2,1,1,1,1,1,,2,,,,,,,2,,,,,,,,,,,,,2,,,,,2,2,,1,9,1,9,2,,1,8,2,,1,9,2,,2,,2,,2,,2,,1,9,2,1,1,2,1,1,1,10,2,2,1,2,6,,996,2,1,1,11,1,Aguascalientes,2,758,1433,1,8.784300906
110015,1,11,HGZ 1 Aguascalientes,1,7,2016,14,24,14,34,19,1,1,2,5,5,2,,,,,,,,,,,,,,,,,,,,1,1,1,2,1,1,1,1,1,1,2,1,1,14,5,6,1,5,3,2,,,,,,,,,,,,,1,6,1,2,5,2,1,10,2,,1,10,2,,2,,2,,2,,2,,2,,1,3,1,1,2,,1,10,2,2,2,1,3,2,2,1,2,6,,1,7,,996,2,2,5,11,1,Aguascalientes,2,758,1433,1,12.20052679
110016,1,11,HGZ 1 Aguascalientes,1,7,2016,15,16,15,23,64,1,1,2,2,2,2,,,,,,,,,,,,,,,,,,,,2,2,,,1,1,1,1,1,1,1,,2,,,,,,,2,,,,,,,,,,,,,2,,,,,2,2,,2,,1,9,2,,2,,2,,1,9,2,,2,,2,,2,,2,,1,7,1,2,1,3,2,1,1,9,4,5,2,1,,,14,2,1,4,11,1,Aguascalientes,2,758,1433,1,8.784300906
110018,1,11,HGZ 1 Aguascalientes,1,7,2016,17,5,17,13,75,1,1,2,2,2,2,,,,,,,,,,,,,,,,,,,,2,2,,,1,2,1,2,2,,,,2,,,,,,,2,,,,,,,,,,,,,2,,,,,2,2,,1,9,2,,2,,2,,2,,1,9,2,,2,,2,,2,,2,,2,,1,1,1,2,1,1,1,10,2,2,1,1,8,,996,2,1,7,11,1,Aguascalientes,2,758,1433,1,7.686550997
110019,1,11,HGZ 1 Aguascalientes,1,7,2016,17,17,17,24,51,2,1,2,2,2,1,33,10,1,,7,5,1,2,3,4,,,2,2,2,4,1,1,2,2,2,,,2,,,2,2,,,,2,,,,,,,2,,,,,,,,,,,,,2,,,,,2,1,9,1,9,1,9,2,,2,,2,,2,,2,,2,,2,,2,,2,,2,,1,1,1,2,2,1,1,10,2,6,,6,9,,14,1,1,3,11,1,Aguascalientes,2,758,1433,1,11.18831829
110020,1,11,HGZ 1 Aguascalientes,1,7,2016,8,12,8,21,50,1,1,2,2,2,2,,,,,,,,,,,,,,,,,,,,2,1,3,1,2,,,2,2,,,,1,999,1,6,2,3,2,1,2,6,1,,,,2,1,2,2,2,1,1,1,,1,2,2,2,,2,,1,10,1,10,2,,1,10,2,,2,,2,,2,,2,,2,,2,,1,1,1,1,1,1,1,10,2,2,1,12,,,996,2,1,5,11,1,Aguascalientes,2,758,1433,1,11.18831829
110021,1,11,HGZ 1 Aguascalientes,1,7,2016,8,28,8,35,41,1,32,1788,2,1,2,,,,,,,,,,,,,,,,,,,,2,1,2,1,2,,,2,2,,,,2,,,,,,,2,,,,,,,,,,,,,2,,,,,1,2,,2,,1,10,2,,2,,1,10,2,,2,,2,,2,,2,,2,,2,,1,1,1,5,1,99,99,10,2,6,,1,,,996,1,1,5,11,1,Aguascalientes,2,758,1433,1,9.698463973
110024,1,11,HGZ 1 Aguascalientes,1,7,2016,8,48,8,55,21,1,1,7,2,1,2,,,,,,,,,,,,,,,,,,,,2,1,2,1,1,1,1,2,2,,,,2,,,,,,,2,,,,,,,,,,,,,2,,,,,2,2,,2,,1,10,2,,1,10,2,,1,10,2,,2,,2,,1,8,2,,2,,1,1,1,1,2,1,2,10,1,6,,9,,,996,2,1,5,11,1,Aguascalientes,2,758,1433,1,10.28590391
110025,1,11,HGZ 1 Aguascalientes,1,7,2016,8,57,9,5,34,1,1,5,2,2,2,,,,,,,,,,,,,,,,,,,,1,1,1,1,2,,,2,2,,,,2,,,,,,,2,,,,,,,,,,,,,2,,,,,1,2,,1,7,1,10,2,,2,,1,10,2,,2,,2,,2,,2,,2,,2,,1,1,1,2,1,1,1,10,2,2,1,1,2,,996,2,1,9,11,1,Aguascalientes,2,758,1433,1,9.399923761
110026,1,11,HGZ 1 Aguascalientes,1,7,2016,9,9,9,19,45,1,1,3,2,2,2,,,,,,,,,,,,,,,,,,,,2,1,6,1,1,6,1,2,2,,,,2,,,,,,,2,,,,,,,,,,,,,2,,,,,2,2,,2,,1,8,2,,2,,1,8,1,8,2,,2,,2,,2,,2,,2,,1,1,1,2,2,1,1,8,2,3,1,1,12,,996,2,2,3,11,1,Aguascalientes,2,758,1433,1,13.270917
110027,1,11,HGZ 1 Aguascalientes,1,7,2016,9,23,9,30,56,1,1,5,2,2,2,,,,,,,,,,,,,,,,,,,,2,1,2,1,1,1,1,2,2,,,,2,,,,,,,2,,,,,,,,,,,,,2,,,,,1,1,10,2,,1,10,2,,2,,2,,1,10,2,,2,,2,,2,,2,,2,,1,1,1,2,2,1,2,10,3,2,1,12,,,996,2,1,5,11,1,Aguascalientes,2,758,1433,1,8.784300906
110028,1,11,HGZ 1 Aguascalientes,1,7,2016,9,42,9,52,48,1,1,5,2,2,1,4,29,1,,2,3,1,,,,,,2,2,2,4,1,1,2,2,2,,,1,1,1,2,2,,,,2,,,,,,,2,,,,,,,,,,,,,2,,,,,2,1,10,2,,1,10,2,,2,,2,,2,,2,,2,,99,,2,,2,,2,,1,1,1,1,1,99,99,10,1,1,1,12,,,996,1,2,99,11,1,Aguascalientes,2,758,1433,1,13.270917
110030,1,11,HGZ 1 Aguascalientes,1,7,2016,10,26,10,37,33,1,1,5,4,4,1,16,16,2,2,,,,,,,,,,,,2,1,2,2,2,2,,,2,,,1,1,1,1,,1,16,5,4,2,4,4,2,,,,,,,,,,,,,2,,,,,2,1,6,2,,1,9,2,,2,,2,,2,,2,,2,,2,,2,,2,,1,9,1,1,2,5,1,1,2,8,4,4,2,5,1,,996,2,2,5,11,1,Aguascalientes,2,758,1433,1,11.14962989
110032,1,11,HGZ 1 Aguascalientes,1,7,2016,11,21,11,33,33,2,1,2,2,2,1,14,19,2,1,,,,,,,,,,,,5,1,1,2,2,1,2,1,2,,,2,2,,,,1,14,5,2,4,4,2,2,,,,,,,,,,,,,1,2,,2,2,1,1,9,2,,1,10,2,,2,,2,,2,,2,,2,,2,,2,,2,,2,,1,1,1,1,1,99,1,10,2,4,2,5,,,996,2,1,5,11,1,Aguascalientes,2,758,1433,1,9.399923761
110033,1,11,HGZ 1 Aguascalientes,1,7,2016,11,46,11,54,40,1,1,6,2,5,2,,,,,,,,,,,,,,,,,,,,1,2,,,1,1,1,2,2,,,,2,,,,,,,2,,,,,,,,,,,,,2,,,,,2,2,,2,,1,10,2,,2,,2,,1,10,2,,2,,2,,2,,2,,2,,1,1,2,97,,1,1,10,1,6,,12,,,996,2,1,3,11,1,Aguascalientes,2,758,1433,1,9.698463973
110034,1,11,HGZ 1 Aguascalientes,1,7,2016,12,9,12,22,44,1,1,2041,2,2,2,,,,,,,,,,,,,,,,,,,,2,1,2,1,1,4,1,1,1,1,1,,2,,,,,,,1,2,5,2,1,3,21,29,2,2,2,1,1,1,1,,1,2,1,1,8,2,,1,9,1,10,1,7,2,,2,,1,8,2,,2,,2,,2,,1,9,1,1,1,2,2,1,1,10,3,2,2,8,6,,996,2,2,3,11,1,Aguascalientes,2,758,1433,1,11.50374052
110035,1,11,HGZ 1 Aguascalientes,1,7,2016,12,40,12,49,22,1,1,5,2,2,1,53,94,2,3,,,,,,,,,,,,5,1,1,2,2,2,,,2,,,1,1,1,1,,2,,,,,,,2,,,,,,,,,,,,,2,,,,,1,2,,2,,1,10,2,,2,,2,,2,,2,,2,,2,,2,,2,,1,10,1,1,1,3,1,1,1,9,1,2,1,7,9,,996,1,1,5,11,1,Aguascalientes,2,758,1433,1,10.28590391
110037,1,11,HGZ 1 Aguascalientes,1,7,2016,13,12,13,20,70,1,1,2,1,1,1,1,16,2,2,,,,,,,,,,,,2,1,1,1,1,1,2,1,1,1,1,1,1,1,1,,2,,,,,,,2,,,,,,,,,,,,,2,,,,,2,2,,2,,1,10,2,,2,,1,10,1,10,2,,2,,2,,2,,2,,1,10,1,1,1,2,2,1,1,10,1,1,1,9,,,996,1,1,3,11,1,Aguascalientes,2,758,1433,1,7.686550997
110038,1,11,HGZ 1 Aguascalientes,1,7,2016,13,55,14,7,47,1,1,2,1,1,1,113,10,1,,2,5,3,,,,,,2,2,1,6,1,1,2,1,2,,,2,,,1,1,1,1,,2,,,,,,,2,,,,,,,,,,,,,2,,,,,1,1,10,1,10,1,10,1,10,2,,2,,2,,2,,2,,2,,2,,2,,1,9,1,1,1,2,1,1,2,10,2,6,,1,,,996,2,1,5,11,1,Aguascalientes,2,758,1433,1,11.18831829
110039,1,11,HGZ 1 Aguascalientes,1,7,2016,14,53,15,10,58,1,1,10,2,2,1,28,28,2,1,,,,,,,,,,,,3,2,1,2,1,1,3,1,1,3,1,2,2,,,,2,,,,,,,2,,,,,,,,,,,,,2,,,,,2,1,9,2,,1,10,1,9,2,,1,8,2,,2,,2,,2,,2,,1,8,2,,1,1,1,3,2,1,1,8,2,2,1,9,,,996,1,1,3,11,1,Aguascalientes,2,758,1433,1,8.784300906
110042,1,11,HGZ 1 Aguascalientes,1,7,2016,16,38,16,50,61,1,1,2,2,2,1,2,3,2,2,,,,,,,,,,,,3,1,1,2,1,1,3,1,2,,,1,1,1,1,,2,,,,,,,2,,,,,,,,,,,,,2,,,,,1,2,,2,,1,10,2,,2,,1,10,2,,2,,2,,2,,2,,1,10,1,10,1,1,1,3,2,1,1,10,2,6,,12,,,996,2,1,3,11,1,Aguascalientes,2,758,1433,1,8.784300906
110043,1,11,HGZ 1 Aguascalientes,1,7,2016,17,8,17,27,60,1,1,2,2,2,1,2,3,2,1,,,,,,,,,,,,3,1,1,2,1,1,3,1,2,,,1,1,1,1,,2,,,,,,,2,,,,,,,,,,,,,2,,,,,2,1,7,2,,1,10,2,,2,,1,10,2,,2,,2,,2,,2,,2,,1,7,1,1,1,3,2,1,1,10,2,2,1,9,18,,996,2,1,3,11,1,Aguascalientes,2,758,1433,1,8.784300906
110045,1,11,HGZ 1 Aguascalientes,1,7,2016,8,16,8,22,65,1,1,2,2,2,2,,,,,,,,,,,,,,,,,,,,1,1,3,1,2,,,2,2,,,,2,,,,,,,2,,,,,,,,,,,,,2,,,,,2,1,8,2,,1,8,1,9,2,,1,9,2,,2,,2,,2,,2,,2,,2,,1,1,1,2,2,1,1,9,2,6,,12,,,996,2,1,2,11,1,Aguascalientes,2,758,1433,1,7.686550997
110046,1,11,HGZ 1 Aguascalientes,1,7,2016,8,29,8,35,31,1,1,2041,2,2,2,,,,,,,,,,,,,,,,,,,,2,2,,,1,1,1,2,2,,,,2,,,,,,,2,,,,,,,,,,,,,2,,,,,2,2,,1,10,2,,2,,2,,2,,1,10,2,,2,,2,,2,,2,,2,,1,1,1,4,2,1,1,9,2,6,,12,,,996,2,2,5,11,1,Aguascalientes,2,758,1433,1,11.14962989
110047,1,11,HGZ 1 Aguascalientes,1,7,2016,8,37,8,44,54,1,1,2,2,2,2,,,,,,,,,,,,,,,,,,,,1,1,4,1,1,3,1,2,2,,,,2,,,,,,,2,,,,,,,,,,,,,2,,,,,2,1,10,1,9,2,,1,9,2,,1,10,1,10,2,,2,,2,,2,,2,,2,,1,1,1,3,2,1,99,10,2,2,1,12,,,996,2,2,3,11,1,Aguascalientes,2,758,1433,1,13.270917
110050,1,11,HGZ 1 Aguascalientes,1,7,2016,8,56,9,2,42,1,32,9888,2,2,2,,,,,,,,,,,,,,,,,,,,1,1,1,1,2,,,2,2,,,,2,,,,,,,2,,,,,,,,,,,,,2,,,,,2,1,10,2,,2,,1,10,2,,1,10,2,,2,,2,,2,,2,,2,,2,,1,1,1,3,2,1,1,10,2,2,2,12,,,996,2,1,5,11,1,Aguascalientes,2,758,1433,1,9.698463973
110051,1,11,HGZ 1 Aguascalientes,1,7,2016,9,6,9,12,64,1,1,2,2,2,2,,,,,,,,,,,,,,,,,,,,1,1,3,1,2,,,2,2,,,,2,,,,,,,2,,,,,,,,,,,,,2,,,,,2,2,,1,9,2,,1,9,2,,1,9,2,,2,,2,,2,,2,,2,,2,,1,1,1,2,2,1,1,10,2,2,1,12,,,996,2,2,2,11,1,Aguascalientes,2,758,1433,1,10.41941472
110052,1,11,HGZ 1 Aguascalientes,1,7,2016,9,20,9,30,59,1,1,2,2,2,1,16,16,2,2,,,,,,,,,,,,3,2,1,2,1,1,2,1,2,,,2,2,,,,2,,,,,,,2,,,,,,,,,,,,,2,,,,,3,1,8,2,,1,5,2,,2,,2,,2,,2,,2,,2,,2,,2,,2,,2,2,2,1,2,1,1,9,2,3,1,1,,,1,2,1,3,11,1,Aguascalientes,2,758,1433,1,8.784300906
110053,1,11,HGZ 1 Aguascalientes,1,7,2016,9,44,9,52,38,1,1,2,2,2,1,9,21,2,1,,,,,,,,,,,,3,1,1,2,1,2,,,2,,,2,2,,,,2,,,,,,,2,,,,,,,,,,,,,2,,,,,1,1,10,2,,1,10,2,,1,9,2,,2,,2,,2,,2,,2,,2,,2,,1,1,1,2,1,1,1,9,2,6,,12,,,996,2,1,5,11,1,Aguascalientes,2,758,1433,1,9.698463973
110054,1,11,HGZ 1 Aguascalientes,1,7,2016,10,3,10,12,58,1,1,8,2,2,1,6,18,2,2,,,,,,,,,,,,2,1,1,2,1,2,,,2,,,1,1,1,2,1,2,,,,,,,2,,,,,,,,,,,,,2,,,,,2,1,9,1,10,1,10,2,,2,,2,,2,,2,,2,,2,,2,,2,,1,8,1,1,1,2,1,1,99,8,2,6,,1,2,7,3,2,1,5,11,1,Aguascalientes,2,758,1433,1,8.784300906
110055,1,11,HGZ 1 Aguascalientes,1,7,2016,10,21,10,30,80,1,1,5,2,2,1,16,16,2,1,,,,,,,,,,,,4,1,1,2,1,1,2,1,2,,,1,1,1,1,,2,,,,,,,1,2,6,1,,,,11,1,2,2,2,2,2,,,,,2,1,8,2,,1,9,2,,2,,2,,2,,2,,2,,2,,2,,2,,1,9,1,1,1,1,2,1,1,10,2,2,1,12,,,996,2,2,2,11,1,Aguascalientes,2,758,1433,1,9.117329137
110056,1,11,HGZ 1 Aguascalientes,1,7,2016,11,50,11,59,73,1,1,2,4,2,1,14,12,2,2,,,,,,,,,,,,4,1,2,2,2,1,1,1,2,,,2,2,,,,2,,,,,,,2,,,,,,,,,,,,,2,,,,,4,1,6,2,,1,1,2,,2,,2,,2,,2,,2,,2,,2,,2,,2,,2,2,2,3,2,2,2,1,3,4,2,1,,,40,2,1,2,11,1,Aguascalientes,2,758,1433,1,7.686550997
110057,1,11,HGZ 1 Aguascalientes,1,7,2016,12,6,12,12,24,1,1,2,2,2,1,15,10,1,,2,2,1,,,,,,2,2,2,1,1,1,2,1,1,1,1,2,,,1,1,99,1,,2,,,,,,,2,,,,,,,,,,,,,2,,,,,2,1,8,1,8,1,8,1,9,1,9,2,,2,,2,,2,,2,,2,,2,,1,8,1,1,1,2,2,1,1,8,2,4,2,1,4,,996,2,1,7,11,1,Aguascalientes,2,758,1433,1,10.28590391
110058,1,11,HGZ 1 Aguascalientes,1,7,2016,12,21,12,32,33,1,1,8,2,2,2,,,,,,,,,,,,,,,,,,,,2,1,1,1,1,1,1,2,2,,,,1,4,1,5,2,2,2,2,,,,,,,,,,,,,2,,,,,2,2,,2,,2,,1,8,2,,1,8,1,8,2,,2,,1,9,2,,2,,2,,1,1,1,1,1,1,2,9,3,3,1,4,,,996,2,2,7,11,1,Aguascalientes,2,758,1433,1,11.14962989
110059,1,11,HGZ 1 Aguascalientes,1,7,2016,12,55,13,2,24,1,1,2,2,2,2,,,,,,,,,,,,,,,,,,,,2,1,3,1,2,,,2,2,,,,2,,,,,,,2,,,,,,,,,,,,,2,,,,,2,2,,2,,2,,2,,2,,1,9,2,,2,,2,,2,,2,,2,,2,,1,1,1,1,1,1,1,10,2,6,,7,8,,14,2,1,5,11,1,Aguascalientes,2,758,1433,1,10.28590391
110060,1,11,HGZ 1 Aguascalientes,1,7,2016,13,49,13,59,44,2,1,6,1,2,2,,,,,,,,,,,,,,,,,,,,1,1,1,1,1,1,1,1,1,1,1,,1,12,4,5,3,2,2,2,,,,,,,,,,,,,1,2,,2,2,1,2,,1,10,1,10,1,10,2,,2,,2,,2,,1,10,1,10,1,8,2,,1,10,1,1,1,1,2,1,1,10,2,2,1,8,,,996,1,1,4,11,1,Aguascalientes,2,758,1433,1,9.698463973
110061,1,11,HGZ 1 Aguascalientes,1,7,2016,14,41,14,49,40,1,1,5,2,2,1,26,17,2,7,,,,,,,,,,,,4,2,1,2,2,2,,,2,,,1,1,1,1,,2,,,,,,,2,,,,,,,,,,,,,2,,,,,2,99,,2,,1,10,1,9,2,,2,,2,,2,,2,,2,,2,,2,,1,10,1,1,1,1,2,1,1,10,2,4,2,5,4,1,996,2,1,9,11,1,Aguascalientes,2,758,1433,1,9.698463973
110062,1,11,HGZ 1 Aguascalientes,1,7,2016,15,33,15,40,48,1,1,2,2,2,2,,,,,,,,,,,,,,,,,,,,2,1,2,1,1,1,1,2,2,,,,2,,,,,,,2,,,,,,,,,,,,,2,,,,,1,2,,1,9,2,,2,,2,,2,,1,9,2,,2,,2,,1,8,2,,2,,1,1,1,1,2,1,1,10,3,6,,5,,,996,2,1,3,11,1,Aguascalientes,2,758,1433,1,11.18831829
110063,1,11,HGZ 1 Aguascalientes,1,7,2016,16,36,16,44,25,2,1,2,2,2,1,30,27,2,1,,,,,,,,,,,,1,1,2,2,1,1,1,1,1,1,1,2,2,,,,2,,,,,,,2,,,,,,,,,,,,,2,,,,,2,1,9,2,,1,10,2,,2,,2,,2,,2,,2,,2,,2,,2,,2,,1,1,1,1,2,1,1,9,3,3,2,5,,,996,2,1,7,11,1,Aguascalientes,2,758,1433,1,10.28590391
110064,1,11,HGZ 1 Aguascalientes,1,7,2016,17,4,17,12,60,1,1,6,2,2,1,45,28,1,,2,4,1,,,,,,2,2,2,3,2,1,2,1,2,,,2,,,2,2,,,,2,,,,,,,2,,,,,,,,,,,,,2,,,,,2,1,10,2,,1,10,2,,2,,2,,2,,2,,2,,2,,2,,2,,2,,1,1,1,1,2,1,99,10,2,6,,12,,,996,2,1,2,11,1,Aguascalientes,2,758,1433,1,8.784300906
110066,1,11,HGZ 1 Aguascalientes,1,7,2016,18,16,18,23,23,2,1,2,2,2,1,24,19,1,,2,2,1,,,,,,2,2,2,6,1,1,2,2,2,,,2,,,1,1,1,1,,2,,,,,,,2,,,,,,,,,,,,,2,,,,,2,1,6,2,,1,9,2,,2,,2,,2,,2,,2,,2,,2,,2,,1,9,1,1,1,99,,1,1,9,2,2,2,4,,,996,2,1,7,11,1,Aguascalientes,2,758,1433,1,10.28590391
110067,1,11,HGZ 1 Aguascalientes,1,7,2016,19,9,19,15,34,1,1,2,2,2,1,9,5,2,2,,,,,,,,,,,,2,1,1,2,1,1,2,1,2,,,1,1,1,1,,2,,,,,,,2,,,,,,,,,,,,,2,,,,,1,2,,2,,1,10,2,,2,,2,,2,,2,,2,,2,,2,,2,,2,,1,1,1,2,1,1,1,10,2,6,,12,,,996,2,1,5,11,1,Aguascalientes,2,758,1433,1,9.399923761
110068,1,11,HGZ 1 Aguascalientes,1,7,2016,19,31,19,38,30,1,1,2,2,2,1,3,10,2,2,,,,,,,,,,,,2,1,1,2,2,2,,,2,,,1,1,1,1,,2,,,,,,,2,,,,,,,,,,,,,2,,,,,2,1,8,2,,1,9,2,,2,,2,,2,,2,,2,,2,,2,,2,,1,8,1,1,1,2,2,1,99,8,3,6,,2,,,996,2,1,7,11,1,Aguascalientes,2,758,1433,1,9.399923761
110069,1,11,HGZ 1 Aguascalientes,1,7,2016,8,19,8,25,50,1,1,2041,2,2,2,,,,,,,,,,,,,,,,,,,,2,1,1,1,2,,,2,2,,,,2,,,,,,,2,,,,,,,,,,,,,2,,,,,2,2,,2,,2,,1,9,2,,2,,2,,2,,2,,2,,2,,2,,2,,1,1,1,1,2,1,1,8,2,2,2,1,,,14,2,1,2,11,1,Aguascalientes,2,758,1433,1,11.18831829
110070,1,11,HGZ 1 Aguascalientes,1,7,2016,8,28,8,35,23,1,1,2041,4,4,2,,,,,,,,,,,,,,,,,,,,2,1,1,1,2,,,2,2,,,,2,,,,,,,2,,,,,,,,,,,,,2,,,,,2,2,,2,,2,,2,,2,,1,10,2,,2,,2,,2,,2,,2,,2,,1,1,1,1,2,1,1,8,3,4,2,1,10,,996,2,2,3,11,1,Aguascalientes,2,758,1433,1,12.20052679
110071,1,11,HGZ 1 Aguascalientes,1,7,2016,8,36,8,43,73,1,32,1775,2,2,2,,,,,,,,,,,,,,,,,,,,1,1,1,1,2,,,2,2,,,,2,,,,,,,2,,,,,,,,,,,,,2,,,,,2,2,,2,,2,,2,,2,,1,8,2,,2,,2,,2,,2,,2,,2,,1,1,1,3,1,1,1,8,2,6,,1,4,6,14,2,1,2,11,1,Aguascalientes,2,758,1433,1,7.686550997
110072,1,11,HGZ 1 Aguascalientes,1,7,2016,8,45,8,51,53,1,1,1,2,2,1,19,14,2,1,,,,,,,,,,,,2,2,1,2,2,2,,,2,,,1,2,,,,2,,,,,,,2,,,,,,,,,,,,,2,,,,,2,2,,2,,1,10,2,,2,,2,,2,,2,,2,,2,,2,,2,,2,,2,1,1,1,2,1,1,9,2,6,,1,,,14,2,1,5,11,1,Aguascalientes,2,758,1433,1,11.18831829
110074,1,11,HGZ 1 Aguascalientes,1,7,2016,9,16,9,24,73,1,1,2,1,1,1,8,3,2,4,,,,,,,,,,,,4,1,1,2,1,1,4,1,1,3,1,2,2,,,,2,,,,,,,2,,,,,,,,,,,,,2,,,,,1,1,10,1,10,1,10,1,10,1,10,2,,2,,2,,2,,2,,2,,2,,1,10,1,1,1,1,2,1,1,10,2,6,,12,,,996,2,1,9,11,1,Aguascalientes,2,758,1433,1,7.686550997
110075,1,11,HGZ 1 Aguascalientes,1,7,2016,9,32,9,38,32,1,1,3,2,2,1,2,27,2,7,,,,,,,,,,,,1,1,1,2,2,2,,,2,,,2,2,,,,2,,,,,,,2,,,,,,,,,,,,,2,,,,,2,1,9,2,,1,10,2,,2,,2,,2,,2,,2,,2,,2,,2,,2,,1,1,1,5,1,2,1,8,2,6,,1,,,14,2,1,5,11,1,Aguascalientes,2,758,1433,1,9.399923761
110076,1,11,HGZ 1 Aguascalientes,1,7,2016,9,55,10,7,66,1,1,6,1,1,1,17,94,2,3,,,,,,,,,,,,2,1,1,2,2,2,,,2,,,2,2,,,,2,,,,,,,2,,,,,,,,,,,,,2,,,,,2,1,9,2,,1,10,2,,2,,2,,2,,2,,2,,2,,2,,2,,2,,2,1,1,2,2,1,1,9,2,2,1,12,,,14,2,2,5,11,1,Aguascalientes,2,758,1433,1,9.117329137
110077,1,11,HGZ 1 Aguascalientes,1,7,2016,10,8,10,20,58,1,1,2041,5,5,1,16,16,2,4,,,,,,,,,,,,5,1,1,2,2,2,,,2,,,2,2,,,,2,,,,,,,97,,,,,,,,,,,,,2,,,,,3,2,,2,,2,,2,,2,,2,,2,,2,,2,,2,,2,,2,,2,,1,2,2,4,2,1,1,7,3,4,2,10,,,8,2,1,3,11,1,Aguascalientes,2,758,1433,1,8.784300906
110082,1,11,HGZ 1 Aguascalientes,1,7,2016,13,4,13,10,55,1,32,1783,2,2,2,,,,,,,,,,,,,,,,,,,,1,1,3,1,1,3,1,2,2,,,,2,,,,,,,2,,,,,,,,,,,,,2,,,,,2,2,,2,,2,,2,,2,,2,,1,9,2,,2,,2,,2,,2,,2,,1,1,1,3,2,1,1,10,2,3,2,12,,,996,2,1,4,11,1,Aguascalientes,2,758,1433,1,8.784300906
110083,1,11,HGZ 1 Aguascalientes,1,7,2016,13,24,13,30,49,1,1,2,2,2,2,,,,,,,,,,,,,,,,,,,,1,1,2,1,2,,,2,2,,,,2,,,,,,,2,,,,,,,,,,,,,2,,,,,2,1,8,2,,2,,1,9,2,,2,,2,,2,,2,,2,,2,,2,,2,,1,1,1,2,2,2,1,8,2,4,2,1,,,14,2,1,6,11,1,Aguascalientes,2,758,1433,1,11.18831829
110085,1,11,HGZ 1 Aguascalientes,1,7,2016,15,26,15,32,74,1,1,2,2,2,2,,,,,,,,,,,,,,,,,,,,2,1,1,1,2,,,2,2,,,,2,,,,,,,2,,,,,,,,,,,,,2,,,,,2,2,,2,,2,,2,,2,,1,9,2,,2,,2,,2,,2,,2,,2,,2,1,1,1,2,1,2,9,2,2,1,12,,,996,2,2,1,11,1,Aguascalientes,2,758,1433,1,9.117329137
110086,1,11,HGZ 1 Aguascalientes,1,7,2016,16,21,16,27,32,1,1,2,1,1,1,19,14,2,7,,,,,,,,,,,,5,1,1,1,1,2,,,2,,,1,2,,,,2,,,,,,,2,,,,,,,,,,,,,2,,,,,2,1,9,2,,1,10,2,,2,,2,,2,,2,,2,,2,,2,,2,,2,,1,1,1,2,2,1,1,9,5,6,,2,,,14,2,1,5,11,1,Aguascalientes,2,758,1433,1,9.399923761
110087,1,11,HGZ 1 Aguascalientes,1,7,2016,16,56,17,3,40,1,1,2,2,2,99,,,,,,,,,,,,,,,,,,,,1,1,1,1,1,1,1,1,1,1,1,,2,,,,,,,2,,,,,,,,,,,,,2,,,,,2,1,10,1,10,1,10,1,10,2,,2,,2,,2,,2,,2,,2,,2,,1,10,2,2,1,1,2,1,1,10,2,2,1,12,,,996,2,1,9,11,1,Aguascalientes,2,758,1433,1,9.698463973
110088,1,11,HGZ 1 Aguascalientes,1,7,2016,17,21,17,28,47,1,1,2041,2,2,1,10,3,2,3,,,,,,,,,,,,2,1,1,2,1,2,,,2,,,2,2,,,,2,,,,,,,2,,,,,,,,,,,,,2,,,,,2,1,10,2,,1,10,1,8,2,,2,,2,,2,,2,,2,,2,,2,,2,,1,1,1,1,2,1,1,9,2,2,1,1,,,14,2,1,5,11,1,Aguascalientes,2,758,1433,1,11.18831829
110090,1,11,HGZ 1 Aguascalientes,1,7,2016,8,26,8,33,59,1,1,2,3,2,2,,,,,,,,,,,,,,,,,,,,2,1,4,1,2,,,2,2,,,,2,,,,,,,2,,,,,,,,,,,,,2,,,,,2,2,,2,,2,,1,10,2,,1,10,2,,2,,2,,2,,2,,2,,2,,1,1,1,3,1,1,1,10,5,4,2,5,10,46,4,2,1,2,11,1,Aguascalientes,2,758,1433,1,8.784300906
110091,1,11,HGZ 1 Aguascalientes,1,7,2016,8,36,8,44,64,1,1,6,2,2,1,29,14,2,6,,,,,,,,,,,,4,2,1,2,1,1,7,1,1,7,1,2,2,,,,2,,,,,,,2,,,,,,,,,,,,,2,,,,,2,1,10,2,,1,7,2,,2,,2,,2,,2,,2,,2,,2,,2,,2,,1,1,1,1,2,1,1,10,2,6,,4,9,,8,2,1,7,11,1,Aguascalientes,2,758,1433,1,8.784300906
110093,1,11,HGZ 1 Aguascalientes,1,7,2016,8,59,9,6,77,1,1,2,2,2,2,,,,,,,,,,,,,,,,,,,,2,1,4,1,2,,,2,2,,,,1,1,4,1,2,4,3,2,,,,,,,,,,,,,1,99,,2,5,1,2,,1,9,2,,2,,1,10,1,10,2,,2,,2,,2,,2,,2,,2,,1,1,1,1,2,2,1,10,4,6,,5,1,,14,2,1,2,11,1,Aguascalientes,2,758,1433,1,7.686550997
110097,1,11,HGZ 1 Aguascalientes,1,7,2016,10,29,10,37,38,1,1,1,2,2,2,,,,,,,,,,,,,,,,,,,,1,1,2,1,2,,,2,1,1,1,,1,7,3,6,4,3,3,2,,,,,,,,,,,,,2,,,,,2,2,,2,,2,,2,,2,,2,,2,,2,,2,,1,10,1,10,2,,2,,1,1,1,5,2,1,1,10,3,6,,5,10,,9,2,1,5,11,1,Aguascalientes,2,758,1433,1,9.698463973
110098,1,11,HGZ 1 Aguascalientes,1,7,2016,11,27,11,36,65,1,1,2,1,1,1,52,8,2,1,,,,,,,,,,,,6,2,2,2,2,1,2,1,1,2,1,2,2,,,,2,,,,,,,2,,,,,,,,,,,,,2,,,,,2,2,,2,,2,,2,,2,,1,10,2,,2,,2,,2,,2,,2,,2,,1,1,1,1,2,1,1,10,2,1,1,12,,,999,2,1,2,11,1,Aguascalientes,2,758,1433,1,7.686550997
110099,1,11,HGZ 1 Aguascalientes,1,7,2016,11,49,11,55,28,1,1,5,2,2,2,,,,,,,,,,,,,,,,,,,,1,1,2,1,1,1,1,2,2,,,,2,,,,,,,2,,,,,,,,,,,,,2,,,,,2,1,9,2,,2,,2,,2,,1,9,1,9,2,,2,,2,,1,10,2,,2,,1,1,1,1,1,1,1,9,2,6,,4,6,,996,2,1,5,11,1,Aguascalientes,2,758,1433,1,9.399923761
110100,1,11,HGZ 1 Aguascalientes,1,7,2016,12,13,12,20,63,1,1,2,2,2,2,,,,,,,,,,,,,,,,,,,,2,2,,,2,,,1,1,1,2,1,2,,,,,,,2,,,,,,,,,,,,,2,,,,,2,2,,2,,1,10,1,10,2,,2,,2,,2,,2,,2,,2,,2,,1,10,1,1,1,3,2,99,1,10,5,2,2,2,5,1,996,2,1,3,11,1,Aguascalientes,2,758,1433,1,8.784300906
110101,1,11,HGZ 1 Aguascalientes,1,7,2016,12,43,12,51,55,1,1,6,3,2,1,20,22,1,,7,6,1,2,3,4,6,,2,2,2,6,1,1,2,2,1,1,1,1,1,1,2,2,,,,2,,,,,,,2,,,,,,,,,,,,,2,,,,,2,1,9,1,10,1,9,1,9,2,,2,,2,,2,,2,,1,10,1,1,2,,2,,1,1,1,1,3,1,1,9,2,2,2,11,10,26,5,2,1,3,11,1,Aguascalientes,2,758,1433,1,8.784300906
110103,1,11,HGZ 1 Aguascalientes,1,7,2016,13,19,13,28,19,1,1,2041,1,2,1,2,28,1,,1,5,2,3,4,1,6,,2,4,4,2,1,1,2,2,1,3,1,2,,,1,1,1,1,,1,2,1,1,1,1,1,2,,,,,,,,,,,,,2,,,,,2,2,,2,,2,,2,,2,,2,,2,,2,,2,,2,,2,,2,,2,,2,2,1,2,1,1,1,10,2,6,,12,,,996,2,1,8,11,1,Aguascalientes,2,758,1433,1,10.28590391
110105,1,11,HGZ 1 Aguascalientes,1,7,2016,15,12,15,19,60,1,1,2,2,2,2,,,,,,,,,,,,,,,,,,,,1,2,,,1,6,1,2,2,,,,2,,,,,,,2,,,,,,,,,,,,,2,,,,,2,2,,1,9,2,,2,,2,,2,,1,10,2,,2,,2,,2,,2,,2,,1,1,1,4,2,1,1,10,2,6,,6,8,,996,2,2,5,11,1,Aguascalientes,2,758,1433,1,10.41941472
110107,1,11,HGZ 1 Aguascalientes,1,7,2016,16,45,16,51,62,1,1,2,2,2,2,,,,,,,,,,,,,,,,,,,,2,2,,,2,,,1,2,,,,2,,,,,,,2,,,,,,,,,,,,,2,,,,,2,1,8,2,,1,10,2,,2,,1,10,2,,2,,2,,2,,2,,2,,2,,99,1,1,4,2,1,1,10,2,6,,1,81,,996,2,2,3,11,1,Aguascalientes,2,758,1433,1,10.41941472
110108,1,11,HGZ 1 Aguascalientes,1,7,2016,17,17,17,27,32,1,1,5,2,1,2,,,,,,,,,,,,,,,,,,,,1,1,7,1,2,,,2,2,,,,1,14,2,6,4,5,5,2,,,,,,,,,,,,,1,1,,2,1,2,1,10,2,,2,,2,,2,,1,10,1,10,2,,2,,2,,1,1,2,,2,,1,1,1,1,2,1,1,10,5,5,2,1,5,,1,2,1,5,11,1,Aguascalientes,2,758,1433,1,9.399923761
110110,1,11,HGZ 1 Aguascalientes,1,7,2016,18,1,18,15,67,1,1,6,2,2,1,26,17,1,,2,6,1,2,4,3,5,6,2,2,2,3,1,1,1,2,1,2,1,1,2,1,2,2,,,,2,,,,,,,2,,,,,,,,,,,,,2,,,,,2,1,5,1,7,1,10,2,,2,,1,7,1,10,2,,2,,2,,1,5,2,,2,,1,1,1,1,1,1,1,7,3,4,2,1,,,69,2,1,2,11,1,Aguascalientes,2,758,1433,1,7.686550997
120001,1,12,HGZ 2 Aguascalientes,6,7,2016,8,31,8,39,35,2,1,9888,2,2,2,,,,,,,,,,,,,,,,,,,,1,1,2,1,2,,,2,2,,,,2,,,,,,,2,,,,,,,,,,,,,2,,,,,3,2,,1,10,2,,2,,2,,1,10,2,,2,,2,,2,,2,,2,,2,,1,1,1,97,,1,1,10,2,2,1,1,,,996,2,2,7,12,1,Aguascalientes,2,577,1435,1,6.742739941
120002,1,12,HGZ 2 Aguascalientes,6,7,2016,8,46,8,55,47,1,1,1,2,2,2,,,,,,,,,,,,,,,,,,,,1,1,7,1,2,,,2,2,,,,2,,,,,,,2,,,,,,,,,,,,,2,,,,,1,2,,1,10,2,,2,,2,,1,8,2,,2,,2,,2,,2,,2,,2,,1,1,1,3,2,1,99,9,1,2,99,7,8,12,40,2,2,5,12,1,Aguascalientes,2,577,1435,1,7.77854316
120003,1,12,HGZ 2 Aguascalientes,6,7,2016,9,1,9,9,83,1,1,3,2,2,2,,,,,,,,,,,,,,,,,,,,1,1,7,1,2,,,2,2,,,,2,,,,,,,2,,,,,,,,,,,,,2,,,,,2,2,,1,9,2,,2,,2,,1,8,2,,2,,2,,2,,2,,2,,2,,1,1,1,5,2,1,1,8,2,2,1,12,,,3,2,1,1,12,1,Aguascalientes,2,577,1435,1,4.505353223
120005,1,12,HGZ 2 Aguascalientes,6,7,2016,9,38,9,45,55,1,1,8,2,2,1,14,12,2,4,,,,,,,,,,,,1,1,1,2,1,1,7,1,2,,,1,1,1,1,,2,,,,,,,2,,,,,,,,,,,,,2,,,,,2,2,,1,9,1,9,1,10,2,,2,,2,,2,,2,,2,,2,,2,,2,,1,1,1,1,2,1,1,10,1,2,1,1,,,996,2,2,3,12,1,Aguascalientes,2,577,1435,1,6.10717911
120006,1,12,HGZ 2 Aguascalientes,6,7,2016,10,30,10,38,65,1,1,1,2,1,2,,,,,,,,,,,,,,,,,,,,2,1,7,1,2,,,2,2,,,,2,,,,,,,2,,,,,,,,,,,,,99,,,,,1,2,,1,10,99,,2,,2,,1,10,2,,2,,2,,2,,2,,2,,2,,1,1,1,2,2,1,1,10,2,3,1,27,,,996,2,1,5,12,1,Aguascalientes,2,577,1435,1,4.505353223
120008,1,12,HGZ 2 Aguascalientes,6,7,2016,11,2,11,14,76,1,1,1,2,2,1,35,4,1,,1,5,1,2,3,4,,,2,2,3,4,1,1,2,1,2,,,1,6,1,2,2,,,,2,,,,,,,2,,,,,,,,,,,,,2,,,,,1,1,9,2,,1,10,2,,2,,1,10,2,,2,,2,,2,,2,,2,,2,,1,1,1,2,2,1,1,10,2,99,,1,,,996,2,2,5,12,1,Aguascalientes,2,577,1435,1,5.343981744
120009,1,12,HGZ 2 Aguascalientes,6,7,2016,11,28,11,41,55,1,1,1,4,2,1,16,16,1,,1,1,1,2,3,4,,,2,2,2,3,1,1,1,1,2,,,2,,,2,2,,,,2,,,,,,,2,,,,,,,,,,,,,2,,,,,1,1,9,1,9,1,9,2,,2,,2,,2,,2,,2,,2,,2,,2,,2,,1,1,1,5,1,99,1,8,2,6,,1,9,3,996,2,2,6,12,1,Aguascalientes,2,577,1435,1,6.10717911