Folio,Deleg,Unidmed,Id_Unid,Fecha_D,Fecha_M,Fecha_A,Hr_Ini,Min_Ini,Hr_Fin,Min_Fin,Edad,Sexo,Edocivi,Escolar,Ocupa,Tel�Fono,Sat1,Retro,Prospe,Unidad1,Mot_Cons2,Filtroch,Consulta,Preosad,Tmsalud,Mhclinco,Expclaa_A,Expclaa_B,Expclaa_C,Expclaa_D,Expclab_A,Expclab_B,Expclab_C,Expclab_D,Mopin,Explora,Cexplora,Mexapriv,Prevenf_A,Prevenf_B,Prevenf_C,Prevenf_D,Prevmed,Filtrourg,Tespurg_Hrs,Tespurg_Min,Calteurg,Mottesp,Servurg,Tobscama_Min,Tobscama_Hrs,Tobscama_Dias,Pregurg,Expurg,Clarurg,Infofamur,Califurg,Filtrocir,Progciru,Topera_Min,Topera_Hrs,Topera_Dias,Fechaop,Suspop1,Suspop3,Motoper,Infofam,Oportiff,Calciru,Filtrohos,Nochesh,Frecrevm,Asisenf,Infamho,Opinfhos,Horarioh,Acchosp_A,Acchosp_B,Acchosp_C,Acchosp_D,Acchosp_E,Acchosp_F,Acchosp_G,Calhosp,Filtroaux,Temsad_D,Temsad_S,Temsad_M,Saduni,Privalrx,Faltamat,Satlarx,Btratou,Calfatna_A,Calfatna_B,Calfatna_C,Calfatna_D,Calfatna_E,Calfatna_F,Calfatna_G,Calfatna_H,Calfatna_I,Calfatna_J,Calfatna_K,Calfatna_L,Calfatna_M,Calfatna_N,Calfatna_O,Calfatnb_A,Calfatnb_B,Calfatnb_C,Calfatnb_D,Calfatnb_E,Calfatnb_F,Calfatnb_G,Calfatnb_H,Calfatnb_I,Calfatnb_J,Calfatnb_K,Calfatnb_L,Calfatnb_M,Calfatnb_N,Calfatnb_O,Infimss,Finfimss,Continf,Cartel,Atn1fam,Calfinma_A,Calfinma_B,Calfinma_C,Calfinma_D,Calfinma_E,Calfinmb_A1,Calfinmb_B1,Calfinmb_B2,Calfinmb_B3,Calfinmb_C1,Calfinmb_C2,Calfinmb_D1,Calfinmb_E1,Calfinmb_F,Calfinmb_G,Calfinmb_H,Calfinmb_I,Calfinmb_J,Ordylim1,Ordylim2,Ordylim3,Recomuni,Norecom,Corrup,Caqod,Sat2,Filtrofarm,Tfarsurt_M,Tfarsurt_H,Tfarsurt_D,Totmed,Acnomed,Versurt,Versurt2,Id_Unidad,Delegacion,Cvedelegaci�N,Unidad,Consul_Diario09_10,Nivel,Estrato,Moscondia,Fe_Finalnr,Fecha,Entidad
49,7,HGZMF 16 Torre�n,277,30,11,10,10,21,10,33,29,2,2,4,1,2,2,2,2,2,1,1,2,1,1,1,1,1,1,1,2,2,2,2,2,1,2,1,2,2,2,2,1,2,,,,,,,,,,,,,,2,,,,,,,,,,,,2,,,,,,,,,,,,,,,1,0,0,1,1,2,2,2,1,2,1,2,1,2,1,1,2,2,2,2,2,2,2,1,,2,,4,,2,2,,,,,,,,2,2,,,1,2,1,1,1,1,1,2,4,5,4,2,2,2,2,3,2,2,1,2,1,1,1,1,,2,1,2,1,40,0,0,1,,1,1,277,Coahuila,7,HGZMF 16 Torre�n,771,2,1,0.35205479452054800000,13.93635252034380000000,2010-11-30,5
423,9,HGZ 24 Insurgentes,364,29,11,2010,11,32,11,43,48,2,2,4,1,2,2,2,2,2,1,1,2,2,2,2,1,2,2,1,2,,,2,2,2,,,2,2,2,2,1,2,,,,,,,,,,,,,,2,,,,,,,,,,,,2,,,,,,,,,,,,,,,1,0,0,1,2,2,2,2,1,2,1,2,1,2,2,2,2,1,1,2,1,2,2,2,,2,,2,,,,,99,3,,3,,,,2,,,2,1,1,2,1,2,2,5,,,,2,2,,,3,3,3,99,99,2,2,2,1,,2,2,3,2,,,,,,,,364,D.F. Norte,9,HGZ 24 Insurgentes,770,2,1,0.19968879668049800000,29.36349139357280000000,2010-11-29,9
2523,13,HGZ 58 Las Margaritas,611,30,11,2010,11,24,11,35,64,2,2,2,1,1,4,3,2,2,1,1,2,2,1,1,1,1,1,1,2,2,2,2,2,2,,,2,2,2,2,1,2,,,,,,,,,,,,,,2,,,,,,,,,,,,2,,,,,,,,,,,,,,,1,15,0,0,1,2,2,2,1,2,1,2,2,2,2,2,2,2,2,2,1,2,2,1,,2,,,,,,,,,,2,,,2,2,,,2,2,1,1,1,2,2,3,4,4,4,2,2,,,3,3,3,3,99,2,2,2,1,,2,2,2,1,10,0,0,2,1,1,2,611,M�xico Poniente,13,HGZ 58 Las Margaritas,539,2,2,0.39257101238164600000,17.38429140449230000000,2010-11-30,15
31,14,HGZMF 21 Le�n,665,26,11,10,13,22,13,34,65,2,2,2,1,2,2,1,1,2,1,1,1,2,1,1,1,2,1,2,2,,2,,2,1,2,1,1,1,1,1,1,2,,,,,,,,,,,,,,2,,,,,,,,,,,,2,,,,,,,,,,,,,,,1,0,2,0,1,2,2,2,1,2,2,2,1,2,2,2,2,2,2,2,2,2,2,1,,,,2,,,,,,,,,,,2,2,,,2,99,1,2,1,2,2,2,,,,2,3,,,3,3,2,2,3,1,1,1,1,,2,1,2,1,10,0,0,1,,1,1,665,Guanajuato,14,HGZMF 21 Le�n,680,2,1,0.38636363636363600000,8.50262874085955000000,2010-11-26,11
9,17,HGR 45 Guadalajara,860,30,11,10,16,41,16,59,30,2,1,4,1,2,2,1,1,1,1,1,1,1,1,1,1,2,1,1,2,,2,2,1,1,2,1,2,2,2,2,1,2,,,,,,,,,,,,,,2,,,,,,,,,,,,2,,,,,,,,,,,,,,,1,1,0,0,2,2,2,2,1,1,1,2,2,1,2,2,2,2,2,1,1,2,2,1,2,2,,,2,,,,,,2,2,,,2,2,,,2,2,1,2,2,2,2,2,,,,,,,,2,4,2,2,2,,,,1,,2,98,2,1,10,0,0,1,,1,1,860,Jalisco,17,HGR 45 Guadalajara,1095,2,1,0.21188080495356000000,127.28253648402400000000,2010-11-30,14
58,18,HGR 1 Charo,944,26,11,10,10,39,10,52,58,2,2,5,1,2,1,2,2,2,1,1,2,1,1,1,1,1,1,1,2,2,2,2,1,1,1,1,1,1,1,1,1,1,1,0,3,,2,,,,1,1,1,1,1,2,,,,,,,,,,,,2,,,,,,,,,,,,,,,1,0,0,1,2,2,2,1,1,1,1,2,1,2,2,2,2,2,2,2,2,2,2,2,2,2,,1,,,,,,,,,,,,2,,,2,2,1,1,1,2,2,1,1,4,4,2,2,,,2,2,2,2,2,2,1,2,1,,2,1,1,2,,,,,,,,944,Michoac�n,18,HGR 1 Charo,944,2,1,1.00000000000000000000,14.45906221305110000000,2010-11-26,16
46,25,HGR 17 Canc�n,1246,29,11,10,13,25,13,41,45,1,2,3,1,2,3,1,99,2,1,1,2,1,1,2,1,98,1,1,2,,2,2,2,1,4,1,2,2,2,2,2,2,,,,,,,,,,,,,,2,,,,,,,,,,,,2,,,,,,,,,,,,,,,1,0,0,1,1,2,2,2,1,1,1,2,1,2,2,2,2,2,2,2,1,2,2,1,2,2,,2,,,,,,,,2,,,2,2,,,2,1,1,1,1,2,2,2,5,5,5,2,2,,,2,2,2,2,2,2,1,2,1,,2,3,2,1,5,0,0,1,,1,1,1246,Quintana Roo,25,HGR 17 Canc�n,389,2,1,0.31937602627257800000,4.26781665912201000000,2010-11-29,23
16,27,HGZMF 3 Mazatl�n,1348,30,11,10,17,33,17,46,47,2,2,6,1,1,1,4,99,1,1,1,1,1,1,1,1,1,1,1,1,2,1,1,2,1,1,1,1,1,1,2,1,2,,,,,,,,,,,,,,2,,,,,,,,,,,,2,,,,,,,,,,,,,,,2,,,,,,,,1,2,1,2,1,2,1,1,2,2,2,2,1,1,2,2,,1,,2,,2,2,,,,,4,4,,,2,,,2,99,1,1,1,2,2,5,5,5,5,4,4,,,5,2,2,2,2,,,,1,,2,99,99,2,,,,,,,,1348,Sinaloa,27,HGZMF 3 Mazatl�n,652,2,1,0.20790816326530600000,12.27020656818650000000,2010-11-30,25
60,28,HGZ 2 Hermosillo,1427,26,11,10,13,10,13,30,30,2,2,3,1,2,5,2,3,1,1,1,1,1,1,1,1,1,1,1,2,2,2,2,2,1,1,1,2,2,2,2,1,2,,,,,,,,,,,,,,2,,,,,,,,,,,,2,,,,,,,,,,,,,,,1,0,0,1,2,2,2,5,1,2,1,1,1,2,1,2,2,2,2,2,2,2,2,1,,2,2,2,,2,,,,,,,,,2,2,,,2,1,1,1,1,2,2,2,3,5,5,2,3,,,3,2,2,99,99,,,,99,,2,99,5,1,20,0,0,2,1,2,,1427,Sonora,28,HGZ 2 Hermosillo,520,2,1,0.26915113871635600000,11.67789955553130000000,2010-11-26,26
79,28,HGZ 2 Hermosillo,1427,26,11,10,17,15,17,38,35,2,3,4,1,1,2,2,2,1,1,1,1,2,1,1,1,2,1,1,2,,3,2,2,1,1,1,2,2,2,2,1,2,,,,,,,,,,,,,,2,,,,,,,,,,,,1,8,2,2,2,2,2,2,2,2,2,2,2,2,1,2,,,,,,,,2,2,2,1,1,2,1,2,2,2,2,2,2,2,2,2,,,3,5,,2,,,,,,,,,,2,,,2,1,1,1,1,2,2,2,3,4,3,4,5,,,3,2,5,3,4,,,,99,,2,98,3,2,,,,,,,,1427,Sonora,28,HGZ 2 Hermosillo,520,2,1,0.26915113871635600000,9.92179746529322000000,2010-11-26,26
10,28,HGZ 4 Guaymas,1428,30,11,10,13,0,13,19,51,2,2,4,1,2,2,1,1,2,1,1,2,1,1,1,1,2,1,2,2,,2,,1,1,1,1,1,1,1,1,1,1,0,30,2,,2,,,,1,1,1,1,1,2,,,,,,,,,,,,1,3,4,1,2,2,2,2,2,2,2,2,2,2,2,2,,,,,,,,1,2,1,2,1,2,2,2,2,2,2,2,2,2,2,1,,2,,2,,,,,,,,,,,2,2,,,2,1,1,1,1,2,2,2,3,2,2,3,2,,,2,2,2,2,2,1,2,2,1,,2,2,2,1,10,0,0,1,,1,1,1428,Sonora,28,HGZ 4 Guaymas,327,2,1,0.16925465838509300000,16.37545781359530000000,2010-11-30,26
14,28,HGZ 4 Guaymas,1428,30,11,10,15,42,16,0,35,2,2,4,1,1,1,1,1,2,1,1,1,1,1,1,1,2,1,2,2,,2,,1,1,1,1,1,1,1,1,1,2,,,,,,,,,,,,,,2,,,,,,,,,,,,2,,,,,,,,,,,,,,,2,,,,,,,,1,2,1,2,1,2,2,2,2,2,2,2,2,2,2,1,,2,,2,,,,,,,,,,,2,2,,,2,1,1,1,1,2,2,2,3,2,2,2,2,,,2,2,2,2,2,1,2,2,1,,2,2,2,1,10,0,0,1,,1,1,1428,Sonora,28,HGZ 4 Guaymas,327,2,1,0.16925465838509300000,15.35070551234050000000,2010-11-30,26
40,28,HGZ 4 Guaymas,1428,30,11,10,20,0,20,18,43,2,2,2,1,1,2,1,1,2,1,1,2,1,1,1,1,1,1,2,1,1,2,,1,1,1,1,1,2,1,2,1,1,1,10,3,,2,,,,1,1,2,1,2,2,,,,,,,,,,,,1,1,4,2,2,2,2,2,2,2,2,1,2,2,2,1,1,0,0,1,2,99,2,1,2,1,1,1,2,1,2,2,2,2,2,2,2,2,1,,2,2,2,,2,,,,,,,,,1,2,,,2,1,1,2,1,1,2,2,,,,2,3,3,,2,2,2,4,3,1,1,99,1,,2,1,2,1,18,0,0,1,,1,1,1428,Sonora,28,HGZ 4 Guaymas,327,2,1,0.16925465838509300000,15.35070551234050000000,2010-11-30,26
26,29,HGSMF 4 Tenosique,1484,30,11,10,16,0,16,19,75,2,2,3,1,2,2,2,2,2,1,2,,,,,,,,,,,,,,,,,,,,,,1,0,20,3,,2,,,,1,1,2,1,2,2,,,,,,,,,,,,2,,,,,,,,,,,,,,,2,,,,,,,,1,2,1,1,2,2,2,2,2,2,2,2,2,2,2,1,,2,3,,,,,,,,,,,,3,2,,,2,2,1,2,2,2,1,2,,,,,,,2,1,2,1,1,1,2,1,1,1,,2,2,3,1,20,0,0,1,,1,1,1484,Tabasco,29,HGSMF 4 Tenosique,44,2,3,1.00000000000000000000,1.22272291003415000000,2010-11-30,27
38,30,HGR 6 Ciudad Madero,1529,29,11,10,17,0,17,20,61,2,3,2,1,2,2,2,2,2,1,1,1,1,1,1,1,2,1,1,2,,2,2,3,2,,,2,2,2,2,1,2,,,,,,,,,,,,,,2,,,,,,,,,,,,2,,,,,,,,,,,,,,,2,,,,,,,,1,2,1,2,2,2,2,2,2,2,2,2,2,2,2,1,,2,,,,,,,,,,,,,2,2,,,2,2,1,2,1,2,2,2,,,,2,2,,,2,2,2,2,2,1,1,99,1,,2,1,2,1,2,0,0,1,,1,1,1529,Tamaulipas,30,HGR 6 Ciudad Madero,950,2,1,0.30139593908629400000,12.30027756800930000000,2010-11-29,28
43,30,HGZ-UMAA 15 Ciudad Reynosa,1530,30,11,10,16,27,16,43,85,2,2,2,1,2,3,2,2,2,1,1,2,2,1,1,1,2,2,1,1,,,1,2,1,2,1,2,2,2,2,1,2,,,,,,,,,,,,,,2,,,,,,,,,,,,2,,,,,,,,,,,,,,,2,,,,,,,,1,2,1,2,2,2,2,2,2,2,2,2,2,2,2,1,,2,,,,,,,,,,,,,2,2,,,2,2,1,2,1,2,2,2,,,,2,2,,,2,2,2,2,2,2,2,2,1,,2,2,2,2,,,,,,,,1530,Tamaulipas,30,HGZ-UMAA 15 Ciudad Reynosa,516,2,1,0.16370558375634500000,15.79947733503980000000,2010-11-30,28
35,31,HGZ 1 Tlaxcala,1568,29,11,10,10,35,10,47,50,1,2,3,1,1,2,1,1,2,1,1,2,1,3,1,1,1,1,1,1,2,2,2,1,2,,,2,2,2,2,1,2,,,,,,,,,,,,,,2,,,,,,,,,,,,2,,,,,,,,,,,,,,,1,0,3,0,2,2,2,2,1,1,1,1,2,2,2,2,2,2,2,2,1,2,2,2,4,2,2,,,,,,,,,4,,,,2,,,1,2,1,1,1,2,2,2,2,2,4,2,2,,,2,2,2,2,2,1,1,1,1,,2,1,2,1,5,0,0,1,,1,1,1568,Tlaxcala,31,HGZ 1 Tlaxcala,427,2,1,1.00000000000000000000,5.91146698722894000000,2010-11-29,29
47,31,HGZ 1 Tlaxcala,1568,29,11,10,17,45,18,8,56,2,2,4,1,1,1,1,3,2,1,1,2,1,1,1,1,2,1,1,1,,1,2,1,1,1,1,1,1,1,2,1,2,,,,,,,,,,,,,,2,,,,,,,,,,,,2,,,,,,,,,,,,,,,2,,,,,,,,1,2,1,2,2,2,2,2,2,2,2,2,2,2,2,2,,1,,,,,,,,,,,,,,2,,,2,2,1,2,1,2,2,1,,,,1,2,,,2,2,5,2,2,1,1,2,1,,1,1,1,1,5,0,0,1,,1,1,1568,Tlaxcala,31,HGZ 1 Tlaxcala,427,2,1,1.00000000000000000000,4.73306616394706000000,2010-11-29,29
18,33,HGZ 36 Coatzacoalos,1712,29,11,10,9,11,9,23,59,1,1,2,1,1,2,1,2,2,1,2,,,,,,,,,,,,,,,,,,,,,,1,1,0,2,,2,,,,1,1,2,99,2,2,,,,,,,,,,,,2,,,,,,,,,,,,,,,1,0,3,0,1,2,2,2,1,2,2,2,2,2,1,2,2,2,2,2,1,2,2,2,,,,,,2,,,,,,2,,,,2,,,2,2,2,2,1,1,2,,,,,2,3,3,,2,2,2,2,99,2,1,99,1,,2,99,2,2,,,,,,,,1712,Veracruz Sur,33,HGZ 36 Coatzacoalos,533,2,1,0.23646850044365600000,8.74054683267956000000,2010-11-29,30
14,35,HGZ 1 Zacatecas,1806,30,11,10,15,12,15,27,37,2,2,4,1,2,3,2,2,2,1,1,2,1,1,1,1,1,1,1,2,2,1,1,1,1,2,1,1,2,1,1,1,2,,,,,,,,,,,,,,2,,,,,,,,,,,,2,,,,,,,,,,,,,,,2,,,,,,,,1,2,1,2,1,2,2,2,2,2,2,2,2,2,2,1,,2,,2,,,,,,,,,,,2,2,,,2,99,1,2,1,2,2,2,,,,2,3,,,2,2,2,3,2,3,99,99,1,,2,2,2,1,10,0,0,1,,1,1,1806,Zacatecas,35,HGZ 1 Zacatecas,611,2,1,1.00000000000000000000,9.79383831839825000000,2010-11-30,32
34,1,HGZ 2 Aguascalientes,12,26,11,10,17,14,17,33,47,1,2,3,2,1,3,2,2,2,1,1,2,1,1,1,1,1,1,2,3,2,2,,1,1,2,1,1,1,1,2,2,2,,,,,,,,,,,,,,2,,,,,,,,,,,,2,,,,,,,,,,,,,,,2,,,,,,,,1,1,1,2,1,2,1,1,2,2,2,1,1,1,2,1,2,2,,2,,2,2,,,,2,2,2,,2,2,,,2,2,1,2,1,2,2,2,,,,2,2,,,2,3,2,99,4,2,2,99,1,,2,3,3,1,5,0,0,1,,1,1,12,Aguascalientes,1,HGZ 2 Aguascalientes,656,2,2,1.00000000000000000000,13.30980019051140000000,2010-11-26,1
37,1,HGZ 2 Aguascalientes,12,26,11,10,19,26,19,40,35,1,2,4,2,2,1,1,2,2,1,1,2,1,1,1,1,1,1,1,1,1,1,1,1,2,,,1,1,1,1,1,2,,,,,,,,,,,,,,2,,,,,,,,,,,,2,,,,,,,,,,,,,,,1,0,1,0,1,1,2,2,1,2,1,2,1,2,2,2,2,2,2,2,2,2,2,1,,1,,1,,,,,,,,,,,2,2,,,2,2,1,2,1,2,2,2,,,,1,1,,,2,2,2,2,2,1,1,1,1,,2,1,1,1,5,0,0,2,3,1,2,12,Aguascalientes,1,HGZ 2 Aguascalientes,656,2,2,1.00000000000000000000,27.43097044448020000000,2010-11-26,1
31,1,HGZ 2 Aguascalientes,12,26,11,10,15,22,15,45,62,2,2,2,2,2,3,2,2,2,1,1,1,4,,2,1,98,2,2,3,,,,1,2,,,2,2,2,2,1,2,,,,,,,,,,,,,,2,,,,,,,,,,,,2,,,,,,,,,,,,,,,1,1,0,0,1,2,2,2,1,2,1,2,1,2,2,2,2,2,2,2,2,2,2,2,,2,,3,,,,,,,,,,,,2,,,2,2,1,1,1,2,2,2,2,2,2,2,2,,,2,2,2,2,2,1,2,2,1,,2,1,2,2,,,,,,,,12,Aguascalientes,1,HGZ 2 Aguascalientes,656,2,2,1.00000000000000000000,17.60437519092590000000,2010-11-26,1
26,1,HGZ 2 Aguascalientes,12,26,11,10,12,54,13,7,30,2,2,4,2,2,2,2,1,2,1,1,2,1,1,1,1,1,1,1,1,1,1,1,1,1,2,1,1,1,1,2,1,2,,,,,,,,,,,,,,2,,,,,,,,,,,,2,,,,,,,,,,,,,,,2,,,,,,,,1,2,1,2,1,2,2,2,2,2,2,2,2,2,2,2,,1,,1,,,,,,,,,,,,2,,,1,2,1,1,1,2,2,2,2,2,2,2,2,,,2,2,2,2,2,1,1,1,1,,2,1,2,2,,,,,,,,12,Aguascalientes,1,HGZ 2 Aguascalientes,656,2,2,1.00000000000000000000,61.44292133772210000000,2010-11-26,1
8,1,UMAA 1 Aguascalientes (Aut),1900,25,11,10,14,48,15,8,24,2,2,4,2,2,4,2,3,1,1,1,1,1,1,1,1,98,1,1,2,,2,2,1,1,2,1,2,2,2,2,1,2,,,,,,,,,,,,,,2,,,,,,,,,,,,2,,,,,,,,,,,,,,,1,4,0,0,2,2,2,2,1,2,1,2,1,2,2,2,2,2,2,2,1,2,2,2,,1,,1,,,,,,,,1,,,,2,,,2,1,2,2,2,2,2,,,,,,,,,2,2,2,2,2,,,,1,,2,3,4,2,,,,,,,,1900,Aguascalientes,1,UMAA 1 Aguascalientes (Aut),95,2,3,1.00000000000000000000,5.04241217919635000000,2010-11-25,1
65,6,HGR 1 Chihuahua,201,30,11,10,14,53,15,12,70,2,2,2,2,1,2,1,1,2,1,1,2,1,1,1,1,1,1,1,1,1,1,1,1,1,1,1,1,1,1,2,1,2,,,,,,,,,,,,,,2,,,,,,,,,,,,2,,,,,,,,,,,,,,,2,,,,,,,,1,2,1,2,1,2,1,2,2,2,2,2,2,2,2,2,,1,,1,,1,,,,,,,,,,2,,,2,2,1,2,1,2,2,1,,,,1,1,,,1,1,1,1,1,1,1,99,1,,2,1,1,1,97,,,,,,,201,Chihuahua,6,HGR 1 Chihuahua,956,2,1,0.37126213592233000000,13.30877682968810000000,2010-11-30,8
99,7,HGZMF 16 Torre�n,277,30,11,10,13,7,13,23,37,1,2,5,2,2,2,4,2,1,1,1,1,1,1,1,1,2,2,1,2,,,2,2,2,,,2,2,2,2,1,2,,,,,,,,,,,,,,2,,,,,,,,,,,,2,,,,,,,,,,,,,,,2,,,,,,,,2,1,1,2,2,2,2,2,2,2,2,2,2,2,2,2,2,2,,,,,,,,,,,,,,2,,,2,2,1,2,1,1,2,2,,,,2,2,2,,3,2,2,2,2,,,,1,,2,98,1,2,,,,,,,,277,Coahuila,7,HGZMF 16 Torre�n,771,2,1,0.35205479452054800000,9.70655923690008000000,2010-11-30,5
410,9,HGZ 24 Insurgentes,364,29,11,2010,12,0,12,9,61,1,4,5,2,2,1,1,1,2,1,1,2,1,1,1,1,2,1,1,1,,1,1,1,1,2,1,1,1,1,1,1,2,,,,,,,,,,,,,,2,,,,,,,,,,,,2,,,,,,,,,,,,,,,2,,,,,,,,1,1,1,2,2,2,2,2,2,2,1,2,2,2,2,1,1,1,,,,,,,,1,,,,,1,2,,,2,1,1,2,1,2,2,2,,,,2,2,,,3,3,3,3,3,2,1,1,1,,2,1,1,1,10,0,0,1,,1,1,364,D.F. Norte,9,HGZ 24 Insurgentes,770,2,1,0.19968879668049800000,22.50963778949650000000,2010-11-29,9
418,9,HGZ 24 Insurgentes,364,29,11,2010,15,8,15,18,43,1,3,4,2,1,2,2,2,2,1,1,2,1,2,2,1,2,2,2,3,,,,2,1,2,1,1,1,1,1,1,2,,,,,,,,,,,,,,2,,,,,,,,,,,,2,,,,,,,,,,,,,,,2,,,,,,,,1,2,1,1,2,1,2,2,2,2,2,2,2,2,2,2,,3,3,,3,,,,,,,,,,,2,,,2,2,1,2,1,2,2,2,,,,2,2,,,2,2,3,3,3,3,2,2,1,,2,2,2,1,15,0,0,1,,1,1,364,D.F. Norte,9,HGZ 24 Insurgentes,770,2,1,0.19968879668049800000,29.38662643019690000000,2010-11-29,9
992,10,HGZ 30 Iztacalco,417,30,11,2010,17,9,17,22,51,1,2,4,2,1,3,2,1,2,1,1,2,1,1,2,1,98,1,1,2,,2,2,1,1,2,99,1,1,2,2,1,2,,,,,,,,,,,,,,2,,,,,,,,,,,,2,,,,,,,,,,,,,,,1,0,0,3,2,2,2,2,1,2,1,2,1,2,2,2,2,2,2,2,2,2,2,1,,2,,2,,,,,,,,,,,2,2,,,2,99,1,1,1,2,2,2,5,4,5,2,2,,,3,2,4,2,2,2,2,2,1,,2,3,3,1,1,0,0,1,,1,1,417,D.F. Sur,10,HGZ 30 Iztacalco,621,2,2,0.24545454545454500000,39.15837235091440000000,2010-11-30,9
1946,12,HGZMF 76 Xalostoc,541,25,11,2010,15,30,15,43,36,2,1,5,2,1,2,99,1,2,1,1,1,1,1,2,1,1,1,2,2,1,1,,1,1,2,1,2,2,2,2,1,2,,,,,,,,,,,,,,2,,,,,,,,,,,,2,,,,,,,,,,,,,,,1,99,99,99,2,5,1,1,1,1,1,2,2,2,2,2,2,2,2,2,2,1,2,1,2,2,,,,,,,,,,,2,,2,2,,,2,99,2,2,2,2,2,,,,,,,,,2,2,2,99,99,1,1,99,1,,2,99,2,1,30,0,0,1,,1,1,541,M�xico Oriente,12,HGZMF 76 Xalostoc,687,2,1,0.22495088408644400000,68.12968476207180000000,2010-11-25,15
2012,12,HGZ 197 Texcoco,545,29,11,2010,15,5,15,21,40,1,2,3,2,1,3,2,3,2,1,1,2,2,2,2,1,1,2,2,2,2,,,2,1,2,1,2,2,2,2,1,2,,,,,,,,,,,,,,2,,,,,,,,,,,,2,,,,,,,,,,,,,,,2,,,,,,,,1,2,1,2,1,2,2,2,2,2,2,1,2,2,2,2,,2,,2,,,,,,,2,,,,,2,,,2,2,1,1,1,2,2,1,2,2,2,2,3,,,2,2,2,2,2,2,2,2,1,,2,2,3,2,,,,,,,,545,M�xico Oriente,12,HGZ 197 Texcoco,517,2,2,0.20000000000000000000,53.16810980318130000000,2010-11-29,15
3754,12,HGZ 197 Texcoco,545,29,11,2010,18,42,19,10,44,2,2,4,2,2,1,1,1,1,1,1,2,1,1,1,1,1,2,1,2,2,,2,1,2,,,2,2,2,2,1,2,,,,,,,,,,,,,,2,,,,,,,,,,,,2,,,,,,,,,,,,,,,1,0,3,0,1,2,2,2,1,1,2,2,1,2,2,2,2,2,2,1,2,2,2,2,1,,,2,,,,,,,2,,,,,2,,,2,99,1,1,1,2,2,2,2,2,2,2,2,,,2,2,2,2,2,,,,1,,2,1,2,2,,,,,,,,545,M�xico Oriente,12,HGZ 197 Texcoco,517,2,2,0.20000000000000000000,59.26893417620210000000,2010-11-29,15
2434,13,HGR 220 Toluca,610,29,11,2010,9,55,10,8,51,1,1,3,2,1,2,1,1,2,1,1,2,1,1,1,1,1,1,1,2,2,2,2,1,2,,,2,2,1,2,1,2,,,,,,,,,,,,,,2,,,,,,,,,,,,2,,,,,,,,,,,,,,,1,0,2,2,1,2,2,2,1,2,1,2,1,2,2,2,2,2,2,2,1,2,2,1,,2,,2,,,,,,,,2,,,2,2,,,2,1,1,2,1,2,2,2,,,,2,2,,,2,2,2,2,2,1,1,1,1,,2,2,2,1,10,0,0,2,99,1,2,610,M�xico Poniente,13,HGR 220 Toluca,891,2,1,1.00000000000000000000,12.16332529236270000000,2010-11-29,15
2438,13,HGR 220 Toluca,610,29,11,2010,12,5,12,18,53,2,2,4,2,2,4,3,2,2,1,1,2,4,,2,1,98,98,2,2,,,,4,1,4,1,2,2,2,2,2,1,0,40,3,,4,,,,1,1,2,1,2,2,,,,,,,,,,,,2,,,,,,,,,,,,,,,2,,,,,,,,1,1,2,1,2,2,2,2,2,2,2,2,2,2,2,1,3,,2,,,,,,,,,,,,2,2,,,2,99,1,2,1,2,2,2,,,,2,2,,,3,2,3,99,2,2,1,1,1,,2,2,4,1,2,0,0,1,,1,1,610,M�xico Poniente,13,HGR 220 Toluca,891,2,1,1.00000000000000000000,15.32143241681750000000,2010-11-29,15
2454,13,HGR 220 Toluca,610,29,11,2010,19,0,19,12,41,2,2,5,2,2,2,1,1,2,1,1,2,1,1,1,1,98,1,2,2,,2,,2,1,2,1,1,1,1,2,1,2,,,,,,,,,,,,,,2,,,,,,,,,,,,2,,,,,,,,,,,,,,,2,,,,,,,,1,1,1,2,1,2,2,2,2,2,2,2,2,2,2,1,2,2,,2,,,,,,,,,,,2,2,,,2,99,1,2,1,2,2,2,,,,4,4,,,2,4,4,99,2,2,2,2,1,,2,1,2,1,1,0,0,1,,1,1,610,M�xico Poniente,13,HGR 220 Toluca,891,2,1,1.00000000000000000000,13.90895730313980000000,2010-11-29,15
24,14,HGZMF 21 Le�n,665,26,11,10,10,40,10,52,44,1,3,4,2,2,5,3,99,2,1,1,1,2,3,2,2,1,1,98,,3,3,,1,2,,,2,2,2,2,1,2,,,,,,,,,,,,,,2,,,,,,,,,,,,2,,,,,,,,,,,,,,,1,0,0,2,1,3,2,3,2,2,2,2,1,2,2,2,2,2,2,2,2,2,2,2,,,,2,,,,,,,,,,,,2,,,1,2,1,2,1,2,2,2,,,,4,5,,,3,3,3,5,3,2,2,2,1,,2,3,5,2,,,,,,,,665,Guanajuato,14,HGZMF 21 Le�n,680,2,1,0.38636363636363600000,13.20313259638460000000,2010-11-26,11
3,17,HGR 45 Guadalajara,860,30,11,10,10,25,10,46,51,1,2,5,2,1,2,2,1,2,1,1,2,1,1,1,1,1,1,1,2,2,2,2,1,1,1,1,1,1,2,1,1,1,0,15,2,,4,,,,1,1,1,2,2,2,,,,,,,,,,,,2,,,,,,,,,,,,,,,1,1,0,0,2,2,2,2,1,2,1,1,2,2,2,2,2,2,2,2,2,2,2,1,,1,1,,,,,,,,,,,,2,2,,,2,2,1,2,1,2,2,2,,,,2,2,,,2,2,2,2,2,2,2,2,1,,2,1,2,1,20,0,0,1,,1,1,860,Jalisco,17,HGR 45 Guadalajara,1095,2,1,0.21188080495356000000,79.58428857396560000000,2010-11-30,14
44,21,HGZ 17 Monterrey,1085,30,11,10,12,48,13,4,43,2,2,5,2,1,2,2,1,2,1,1,2,4,,1,1,1,1,1,4,4,4,4,2,2,,,2,2,1,2,2,2,,,,,,,,,,,,,,2,,,,,,,,,,,,2,,,,,,,,,,,,,,,1,0,0,2,1,2,2,2,2,1,2,1,1,2,1,2,2,1,2,2,2,2,2,1,5,,4,2,,2,,,2,,,,,,2,2,,,2,1,1,1,1,1,2,4,5,2,4,4,2,2,,5,2,2,2,2,2,1,2,1,,2,3,2,1,5,0,0,1,,1,1,1085,Nuevo Le�n,21,HGZ 17 Monterrey,508,2,1,0.13744588744588700000,37.17109864751410000000,2010-11-30,19
38,23,HGR-UMAA 36 San Alejandro,1183,24,11,10,12,33,12,42,28,2,1,5,2,2,2,2,3,2,1,1,2,4,,2,1,1,1,1,2,2,2,2,1,2,,,1,1,2,2,1,2,,,,,,,,,,,,,,2,,,,,,,,,,,,2,,,,,,,,,,,,,,,1,0,0,1,1,2,2,2,1,2,2,1,1,2,2,2,2,2,2,2,1,2,2,1,,,1,2,,,,,,,,2,,,2,2,,,2,1,1,1,1,2,2,2,5,5,5,4,4,,,3,4,4,4,4,2,2,2,1,,2,3,3,1,5,0,0,1,,2,,1183,Puebla,23,HGR-UMAA 36 San Alejandro,1429,2,1,1.00000000000000000000,27.53003572180820000000,2010-11-24,21
17,23,HGZ 5 Metepec,1190,25,11,10,12,50,13,9,32,2,2,5,2,2,2,2,2,1,1,1,1,1,1,1,1,1,1,1,2,2,2,2,1,1,2,1,2,2,2,2,1,2,,,,,,,,,,,,,,2,,,,,,,,,,,,2,,,,,,,,,,,,,,,1,1,0,0,1,2,2,2,1,2,1,2,2,2,2,1,2,2,2,2,2,2,2,2,,2,,,,,2,,,,,,,,,2,,,2,1,1,2,1,2,1,2,,,,2,2,,2,2,2,2,2,2,,,,1,,2,2,3,1,2,0,0,1,,1,1,1190,Puebla,23,HGZ 5 Metepec,149,2,2,0.15783898305084700000,19.91842899103260000000,2010-11-25,21
23,25,HGP 7 Puerto Ju�rez,1242,30,11,10,9,36,9,50,23,1,2,5,2,2,2,1,1,2,1,2,,,,,,,,,,,,,,,,,,,,,,1,0,10,2,,1,0,1,0,1,1,2,1,2,2,,,,,,,,,,,,2,,,,,,,,,,,,,,,2,,,,,,,,1,2,1,2,1,2,2,2,2,2,2,2,2,2,2,2,,2,,2,,,,,,,,,,,,2,,,2,1,1,1,1,2,2,2,4,4,5,4,5,,,4,2,4,4,99,2,2,2,1,,2,2,2,2,,,,,,,,1242,Quintana Roo,25,HGP 7 Puerto Ju�rez,143,2,1,0.11740558292282400000,7.20051361478527000000,2010-11-30,23
33,25,HGP 7 Puerto Ju�rez,1242,30,11,10,17,8,17,21,27,1,2,6,2,2,2,1,2,1,1,1,1,1,1,1,1,1,1,1,2,2,2,2,1,1,1,2,1,1,1,2,1,2,,,,,,,,,,,,,,2,,,,,,,,,,,,2,,,,,,,,,,,,,,,1,15,0,0,2,2,2,2,1,2,1,2,1,2,2,2,2,2,2,2,2,2,2,2,,2,,1,,,,,,,,,,,,2,,,1,1,1,1,1,2,2,2,5,5,5,2,2,,,2,2,2,2,2,,,,1,,2,98,2,2,,,,,,,,1242,Quintana Roo,25,HGP 7 Puerto Ju�rez,143,2,1,0.11740558292282400000,10.74213134621440000000,2010-11-30,23
2,25,HGR 17 Canc�n,1246,29,11,10,8,12,8,24,48,1,2,4,2,2,2,1,1,1,1,1,1,1,1,1,1,2,1,1,2,,2,2,2,1,2,1,2,2,2,2,1,2,,,,,,,,,,,,,,2,,,,,,,,,,,,2,,,,,,,,,,,,,,,2,,,,,,,,1,2,1,2,1,2,2,2,2,2,2,1,1,2,2,1,,1,,1,,,,,,,1,1,,,1,2,,,2,2,1,2,1,2,2,2,,,,1,1,,,2,2,2,99,99,,,,1,,2,98,1,1,4,0,0,1,,2,,1246,Quintana Roo,25,HGR 17 Canc�n,389,2,1,0.31937602627257800000,4.26781665912201000000,2010-11-29,23
17,25,HGR 17 Canc�n,1246,29,11,10,10,31,10,42,63,2,2,2,2,2,1,2,2,1,1,1,1,1,1,2,1,1,1,1,2,2,2,2,1,1,2,1,1,1,1,1,1,2,,,,,,,,,,,,,,2,,,,,,,,,,,,2,,,,,,,,,,,,,,,2,,,,,,,,1,2,1,2,1,2,2,2,2,2,2,2,2,2,2,1,,1,,2,,,,,,,,,,,2,2,,,2,2,1,2,1,2,2,2,,,,2,2,,,2,2,2,2,2,,,,1,,2,98,2,1,7,0,0,1,,1,1,1246,Quintana Roo,25,HGR 17 Canc�n,389,2,1,0.31937602627257800000,6.46580574333091000000,2010-11-29,23
34,26,HGZ 50 Tangamanga,1287,30,11,10,16,23,16,35,45,1,2,5,2,2,2,3,1,1,1,1,1,2,1,1,1,2,2,2,2,,,,99,1,2,2,2,2,2,2,1,2,,,,,,,,,,,,,,2,,,,,,,,,,,,2,,,,,,,,,,,,,,,2,,,,,,,,1,1,1,2,1,2,1,2,2,2,2,1,1,2,2,2,2,2,,2,,2,,,,,2,2,,,,2,,,1,1,1,2,1,1,2,1,,,,2,2,2,,1,1,1,1,1,,,,1,,2,2,2,2,,,,,,,,1287,San Luis Potos�,26,HGZ 50 Tangamanga,518,2,1,0.23481414324569400000,11.70845137250530000000,2010-11-30,24
40,28,HGZ 2 Hermosillo,1427,26,11,10,13,12,13,35,35,2,2,3,2,1,2,1,1,2,1,1,2,1,1,2,1,1,1,1,2,2,2,2,1,1,2,1,1,1,1,1,1,2,,,,,,,,,,,,,,2,,,,,,,,,,,,2,,,,,,,,,,,,,,,1,0,0,3,1,2,2,1,1,2,1,2,1,2,2,2,2,1,2,1,2,2,2,1,,2,,2,,,,,2,,2,,,,2,2,,,2,2,1,1,1,2,2,2,3,3,3,2,2,,,2,2,2,2,2,1,1,2,1,,2,2,2,1,10,0,0,2,3,1,2,1427,Sonora,28,HGZ 2 Hermosillo,520,2,1,0.26915113871635600000,9.92179746529322000000,2010-11-26,26
62,28,HGZ 2 Hermosillo,1427,26,11,10,14,50,15,15,41,2,2,4,2,2,2,1,1,2,1,1,2,1,1,1,1,1,1,1,2,2,2,2,2,1,2,1,2,2,1,2,1,1,0,10,3,,6,,,,1,1,1,2,2,2,,,,,,,,,,,,2,,,,,,,,,,,,,,,1,15,0,0,1,1,1,1,1,2,1,1,1,2,1,1,2,2,2,2,2,2,2,1,,2,2,2,,2,2,,,,,,,,2,2,,,2,1,1,1,1,1,1,2,2,2,4,2,2,2,2,3,2,2,99,99,1,1,1,1,,2,1,2,2,,,,,,,,1427,Sonora,28,HGZ 2 Hermosillo,520,2,1,0.26915113871635600000,9.92179746529322000000,2010-11-26,26
18,28,HGZ 4 Guaymas,1428,30,11,10,18,15,18,30,47,2,2,4,2,2,2,1,1,1,1,1,1,1,1,1,1,2,1,2,2,,2,,1,1,1,1,1,1,1,1,1,2,,,,,,,,,,,,,,2,,,,,,,,,,,,2,,,,,,,,,,,,,,,2,,,,,,,,1,2,1,2,1,2,2,2,2,2,2,2,2,2,2,1,,2,,2,,,,,,,,,,,2,2,,,2,1,1,1,1,2,2,2,3,2,2,2,2,,,2,2,2,2,2,,,,1,,2,2,2,1,10,0,0,1,,1,1,1428,Sonora,28,HGZ 4 Guaymas,327,2,1,0.16925465838509300000,16.37545781359530000000,2010-11-30,26
18,30,HGR 6 Ciudad Madero,1529,29,11,10,17,25,17,40,40,2,2,4,2,2,2,4,99,1,1,1,2,1,1,1,1,1,1,2,1,1,2,,1,1,2,1,1,1,1,1,1,2,,,,,,,,,,,,,,2,,,,,,,,,,,,2,,,,,,,,,,,,,,,1,0,0,2,1,2,2,2,1,1,1,2,1,2,1,2,2,2,2,2,1,2,2,1,2,2,,2,,1,,,,,,2,,,2,2,,,2,2,1,1,1,1,2,2,2,2,99,2,2,2,,2,2,2,2,99,,,,1,,2,1,2,1,5,0,0,2,3,1,2,1529,Tamaulipas,30,HGR 6 Ciudad Madero,950,2,1,0.30139593908629400000,13.27278077805860000000,2010-11-29,28
82,30,HGR 6 Ciudad Madero,1529,29,11,10,18,59,19,16,30,2,2,4,2,1,2,1,1,2,1,1,2,1,1,1,1,2,1,2,2,,2,,1,2,,,2,2,2,2,1,2,,,,,,,,,,,,,,2,,,,,,,,,,,,2,,,,,,,,,,,,,,,1,10,0,0,1,2,2,2,1,2,1,2,2,2,2,2,2,2,2,2,2,2,2,1,,2,,,,,,,,,,,,,2,2,,,2,1,1,1,1,2,2,3,4,4,4,3,3,,,3,3,3,3,3,1,99,99,1,,2,2,2,1,5,0,0,1,,1,1,1529,Tamaulipas,30,HGR 6 Ciudad Madero,950,2,1,0.30139593908629400000,18.38330902824530000000,2010-11-29,28
27,30,HGZ-UMAA 15 Ciudad Reynosa,1530,30,11,10,8,37,8,53,39,2,2,2,2,2,1,2,2,2,1,1,2,1,1,1,1,2,1,1,2,,2,2,1,2,,,2,2,2,2,1,2,,,,,,,,,,,,,,2,,,,,,,,,,,,2,,,,,,,,,,,,,,,2,,,,,,,,1,1,1,2,2,2,2,2,2,1,2,1,2,2,2,1,2,2,,,,,,,3,,2,,,,2,2,,,2,1,1,2,1,2,2,2,,,,2,2,,,3,3,3,3,3,1,1,99,1,,2,1,2,1,99,,,1,,1,1,1530,Tamaulipas,30,HGZ-UMAA 15 Ciudad Reynosa,516,2,1,0.16370558375634500000,22.03281609157730000000,2010-11-30,28
35,30,HGZ-UMAA 15 Ciudad Reynosa,1530,30,11,10,12,11,12,27,40,2,2,5,2,1,1,2,2,2,1,1,2,1,1,1,1,2,1,1,2,,2,2,1,1,1,1,2,2,1,2,1,2,,,,,,,,,,,,,,2,,,,,,,,,,,,2,,,,,,,,,,,,,,,1,1,0,0,1,2,2,2,1,2,1,1,2,2,2,1,2,1,2,1,2,2,2,1,,2,1,,,,2,,3,,3,,,,2,2,,,2,1,1,1,1,2,1,2,3,3,3,3,2,,2,2,2,2,2,2,2,2,2,1,,2,2,2,1,5,0,0,2,3,1,2,1530,Tamaulipas,30,HGZ-UMAA 15 Ciudad Reynosa,516,2,1,0.16370558375634500000,22.03281609157730000000,2010-11-30,28
49,30,HGZ-UMAA 15 Ciudad Reynosa,1530,30,11,10,19,15,19,33,48,1,5,3,2,2,2,1,1,1,1,2,,,,,,,,,,,,,,,,,,,,,,2,,,,,,,,,,,,,,2,,,,,,,,,,,,2,,,,,,,,,,,,,,,1,0,0,1,1,2,2,1,1,2,2,1,1,2,1,1,2,1,1,1,2,1,1,1,,,1,2,,2,2,,3,1,3,,2,2,2,2,,,2,1,1,1,1,1,1,2,3,3,4,2,3,3,2,2,2,2,1,2,,,,1,,2,2,2,2,,,,,,,,1530,Tamaulipas,30,HGZ-UMAA 15 Ciudad Reynosa,516,2,1,0.16370558375634500000,21.04937185526370000000,2010-11-30,28
50,30,HGZ-UMAA 15 Ciudad Reynosa,1530,30,11,10,19,42,19,57,52,1,2,4,2,1,2,2,2,2,1,1,2,1,1,1,1,2,1,2,1,,1,,2,2,,,2,2,2,2,1,2,,,,,,,,,,,,,,2,,,,,,,,,,,,2,,,,,,,,,,,,,,,2,,,,,,,,1,1,1,1,2,2,2,2,2,1,2,2,2,1,2,1,2,2,2,,,,,,3,,,,3,,2,2,,,2,1,1,1,1,2,2,3,3,4,4,3,3,,,3,3,3,3,3,1,1,1,1,,2,2,2,1,99,,,1,,1,1,1530,Tamaulipas,30,HGZ-UMAA 15 Ciudad Reynosa,516,2,1,0.16370558375634500000,21.04937185526370000000,2010-11-30,28