folio,deleg,id_unid,unidmed,fecha_d,fecha_m,fecha_a,hr_ini_h,hr_ini_m,hr_fin_h,hr_fin_m,edad,tipopac,sat1,sat3,filtroch,probsal,totorpase,tiem_esp2,tmedreg2,prevasis_e,preosad,tratocomf,preven3,filtrosaux1,temsad1,temsad1a,filtrosaux2,temsad2,temsad2a,filtrofarm2,tfarsurt,totmed,motnosurt,resurt1,filtrourg,probsal_urg,mot_urg,turgtriag,tram_urg,calteurg,califurg,filtrocir,fechaop,suspop3,calciru,filtrohos,tobscama,razontesp,infprealta,calhosp,btratou,calfatna_a,calfatna_b,calfatna_c,calfatna_e,calfatna_f,calfatna_g,calfatna_h,calfatna_i,calfatna_j,calfatna_k,calfatna_l,calfatna_m,calfatna_n,calfatnb_a,calfatnb_b,calfatnb_c,calfatnb_e,calfatnb_f,calfatnb_g,calfatnb_h,calfatnb_i,calfatnb_j,calfatnb_k,calfatnb_l,calfatnb_m,calfatnb_n,calfinmb_f,limp1,limp2,recomej_a,recomej_b,recomej_c,recomuni,sugeren,sexo,local,escolar,delegacin,nivel,promedio_diario2014,estrato,moscondia,fe_finalnr,feeds_flatstore_entry_id,timestamp,feeds_entity_id
1,1,11,HGZ 1 Aaguascalientes,30,7,15,8,24,8,34,52,1,2,2,2,,,,,,,,2,1,3,1,2,,,2,,,,3,2,,,,,,,2,,,,2,,,,,1,2,2,2,2,2,1,2,2,2,2,2,2,2,,,,,,1,,,,,,,,2,2,2,5,,,1,996,1,1,2,Aguascalientes,2,839,1,1,8.21,1,1455133925,316
3,1,11,HGZ 1 Aaguascalientes,30,7,15,8,34,8,41,72,1,1,1,2,,,,,,,,1,1,3,1,1,3,2,2,,,,1,2,,,,,,,2,,,,2,,,,,2,2,2,2,2,2,1,2,2,2,2,2,2,2,,,,,,2,,,,,,,,2,2,1,1,4,,1,996,1,2,1,Aguascalientes,2,839,1,1,8.12,2,1455133925,316
4,1,11,HGZ 1 Aaguascalientes,30,7,15,9,5,9,13,69,1,1,2,2,,,,,,,,2,1,1,1,1,1,1,2,,,,3,1,48,4,6,2,2,1,2,,,,1,1,,1,2,1,2,2,2,2,2,1,2,2,2,2,2,2,2,,,,,,2,,,,,,,,2,2,1,12,,,1,996,1,2,3,Aguascalientes,2,839,1,1,8.12,3,1455133925,316
5,1,11,HGZ 1 Aaguascalientes,30,7,15,9,28,9,34,40,1,2,2,1,59,5,5,3,1,1,2,1,2,,,2,,,1,1,1,,3,2,,,,,,,2,,,,2,,,,,1,1,2,1,1,1,2,2,2,2,2,2,2,1,2,,2,2,2,,,,,,,,2,2,6,,12,,,1,996,1,2,8,Aguascalientes,2,839,1,1,8.92,4,1455133925,316
6,1,11,HGZ 1 Aaguascalientes,30,7,15,9,43,9,49,49,1,2,2,1,4,3,3,2,2,1,2,2,1,2,1,1,4,1,2,,,,3,2,,,,,,,2,,,,2,,,,,1,2,2,1,2,1,2,1,2,2,2,2,2,2,,,1,,2,,2,,,,,,,2,2,1,12,,,1,15,1,1,3,Aguascalientes,2,839,1,1,8.21,5,1455133925,316
7,1,11,HGZ 1 Aaguascalientes,30,7,15,10,0,10,8,49,1,2,2,1,39,2,7,1,1,1,2,1,1,1,2,2,,,1,1,1,,3,2,,,,,,,2,,,,2,,,,,2,1,2,1,1,2,2,1,2,2,2,2,2,1,2,,1,2,,,2,,,,,,2,99,6,,6,5,9,1,25,1,2,5,Aguascalientes,2,839,1,1,8.21,6,1455133925,316
8,1,11,HGZ 1 Aaguascalientes,30,7,15,10,11,10,20,62,1,2,2,2,,,,,,,,1,1,1,1,1,1,1,2,,,,1,2,,,,,,,2,,,,2,,,,,1,2,2,2,2,2,2,1,2,2,2,1,2,2,,,,,,,1,,,,1,,,2,6,,4,2,3,1,996,1,2,3,Aguascalientes,2,839,1,1,8.41,7,1455133925,316
9,1,11,HGZ 1 Aaguascalientes,30,7,15,10,21,10,30,65,1,2,2,2,,,,,,,,2,1,3,1,1,3,1,2,,,,1,2,,,,,,,2,,,,2,,,,,2,2,2,2,2,2,2,1,2,2,2,2,2,2,,,,,,,2,,,,,,,2,2,1,5,10,11,1,1,1,2,7,Aguascalientes,2,839,1,1,8.12,8,1455133925,316
10,1,11,HGZ 1 Aaguascalientes,30,7,15,10,36,10,45,34,1,1,1,2,,,,,,,,1,2,,,1,2,1,2,,,,3,2,,,,,,,2,,,,2,,,,,1,2,2,2,2,2,2,1,2,2,1,2,2,2,,,,,,,1,,,1,,,,1,2,1,12,,,1,996,1,1,5,Aguascalientes,2,839,1,1,8.08,9,1455133925,316
11,1,11,HGZ 1 Aaguascalientes,30,7,15,10,56,11,5,70,1,1,1,1,18,2,1,1,2,1,2,1,1,1,1,1,1,1,1,1,1,,3,1,42,4,3,2,2,2,1,2,13,2,1,1,,1,2,1,1,2,1,2,1,2,2,2,2,2,2,1,1,2,,1,,2,,,,,,,1,2,1,6,,12,,,1,996,1,2,7,Aguascalientes,2,839,1,1,8.12,10,1455133925,316
12,1,11,HGZ 1 Aaguascalientes,30,7,15,11,14,11,22,39,2,2,2,1,46,2,1,1,2,1,2,2,2,,,2,,,2,,,,3,1,4,2,2,2,2,2,1,2,1,2,2,,,,,2,2,2,1,1,2,2,2,2,2,2,2,2,2,,,2,2,,,,,,,,,,2,2,1,6,11,,1,25,1,2,9,Aguascalientes,2,839,1,1,8.92,11,1455133925,316
13,1,11,HGZ 1 Aaguascalientes,30,7,15,12,27,12,37,78,1,4,2,1,45,5,4,4,2,1,2,2,1,2,2,1,1,1,2,,,,3,2,,,,,,,2,,,,2,,,,,2,1,1,1,2,2,1,1,2,2,2,2,2,2,2,2,2,,,2,2,,,,,,,2,2,1,4,7,10,2,21,2,1,2,Aguascalientes,2,839,1,1,8.27,12,1455133925,316
15,1,11,HGZ 1 Aaguascalientes,30,7,15,14,35,14,45,52,1,5,5,1,45,3,2,2,2,1,2,1,1,2,1,1,2,1,2,,,,3,2,,,,,,,2,,,,2,,,,,5,2,1,1,2,2,1,2,2,2,2,2,2,2,,4,2,,,2,,,,,,,,2,2,1,11,,,2,15,1,2,6,Aguascalientes,2,839,1,1,8.21,13,1455133925,316
16,1,11,HGZ 1 Aaguascalientes,30,7,15,15,1,15,7,49,1,4,4,1,45,3,5,5,2,2,1,2,1,3,1,1,3,1,2,,,,3,2,,,,,,,2,,,,2,,,,,4,1,1,2,2,2,2,2,2,2,2,2,2,2,2,4,,,,,,,,,,,,2,2,1,4,7,,3,5,2,2,6,Aguascalientes,2,839,1,1,8.35,14,1455133925,316
17,1,11,HGZ 1 Aaguascalientes,30,7,15,15,17,15,28,51,1,2,2,1,13,3,3,2,2,1,2,1,1,3,1,1,2,1,1,1,1,,3,2,,,,,,,2,,,,2,,,,,1,1,1,1,2,2,2,2,2,2,2,2,1,1,2,2,1,,,,,,,,,2,2,2,2,1,1,4,,1,9,1,2,9,Aguascalientes,2,839,1,1,8.21,15,1455133925,316
18,1,11,HGZ 1 Aaguascalientes,30,7,15,16,55,17,4,34,1,1,1,1,9,2,4,1,1,1,2,1,1,2,1,2,,,2,,,,2,2,,,,,,,2,,,,2,,,,,2,1,2,1,2,2,2,2,2,2,2,2,2,2,2,,2,,,,,,,,,,,2,2,1,4,3,5,1,996,1,2,5,Aguascalientes,2,839,1,1,8.08,16,1455133925,316
19,1,11,HGZ 1 Aaguascalientes,30,7,15,17,15,17,25,30,1,4,4,2,,,,,,,,2,2,,,1,2,1,2,,,,3,2,,,,,,,2,,,,2,,,,,4,2,2,2,2,2,2,1,2,2,2,2,2,2,,,,,,,4,,,,,,,2,2,2,11,,,2,13,1,2,7,Aguascalientes,2,839,1,1,8.08,17,1455133925,316
20,1,11,HGZ 1 Aaguascalientes,30,7,15,18,6,18,15,63,1,2,2,2,,,,,,,,1,1,2,1,1,1,1,1,1,1,,1,2,,,,,,,2,,,,2,,,,,2,2,2,2,2,2,2,1,2,2,2,2,2,1,,,,,,,2,,,,,,2,2,6,,9,4,,1,996,2,2,9,Aguascalientes,2,839,1,1,8.56,18,1455133925,316
21,1,11,HGZ 1 Aaguascalientes,30,7,15,18,38,18,48,55,1,2,2,2,,,,,,,,1,1,2,1,1,1,1,1,1,1,,3,2,,,,,,,2,,,,2,,,,,2,2,2,2,2,2,1,1,2,2,2,2,2,1,,,,,,2,2,,,,,,2,2,2,1,1,7,10,2,7,1,2,4,Aguascalientes,2,839,1,1,8.41,19,1455133925,316
"2,572",1,11,HGZ 1 Aaguascalientes,30,7,15,8,57,9,3,56,1,3,3,2,,,,,,,,2,1,2,1,2,,,2,,,,2,2,,,,,,,2,,,,2,,,,,2,2,2,2,1,2,1,2,2,2,2,2,2,2,,,,2,,2,,,,,,,,2,2,99,2,1,,1,996,1,1,2,Aguascalientes,2,839,1,1,8.41,20,1455133925,316
"2,708",1,11,HGZ 1 Aaguascalientes,30,7,15,13,6,13,14,35,1,1,2,2,,,,,,,,1,2,,,1,2,1,1,1,2,1,3,2,,,,,,,2,,,,2,,,,,1,1,2,2,2,1,1,1,2,2,2,2,2,1,1,,,,1,1,1,,,,,,2,1,1,1,2,9,,2,996,1,2,5,Aguascalientes,2,839,1,1,8.92,21,1455133925,316
"247,019",1,11,HGZ 1 Aaguascalientes,30,7,15,16,1,16,10,43,1,3,3,1,15,6,5,4,1,2,1,2,2,,,2,,,2,,,,3,2,,,,,,,2,,,,2,,,,,2,2,1,1,2,1,1,2,2,2,2,2,2,2,,2,1,,2,2,,,,,,,,2,2,1,1,7,,4,1,1,2,4,Aguascalientes,2,839,1,1,8.92,22,1455133925,316
"257,001",1,11,HGZ 1 Aaguascalientes,30,7,15,8,17,8,27,47,1,2,2,2,,,,,,,,1,1,5,1,1,5,1,2,,,,3,1,4,5,3,3,2,3,1,2,5,3,1,6,1,2,2,2,2,2,2,1,2,2,2,2,2,2,2,2,2,,,,2,,,,,,,,,,2,6,,998,,,2,996,1,2,5,Aguascalientes,2,839,1,1,8.21,23,1455133925,316
"257,002",1,11,HGZ 1 Aaguascalientes,30,7,15,8,28,8,36,53,1,4,4,2,,,,,,,,2,2,,,2,,,2,,,,3,1,66,5,1,4,2,4,2,,,,1,99,,2,4,2,2,2,2,2,2,1,2,2,1,2,1,2,2,,,,,,2,,,2,,4,,,2,2,1,1,6,4,4,996,1,99,3,Aguascalientes,2,839,1,1,8.21,24,1455133925,316
"257,003",1,11,HGZ 1 Aaguascalientes,30,7,15,8,41,8,50,71,1,2,2,2,,,,,,,,2,1,5,1,2,,,2,,,,3,2,,,,,,,2,,,,2,,,,,2,2,1,2,2,2,1,2,2,2,2,1,2,2,,2,,,,2,,,,,2,,,2,2,2,4,,,2,996,2,2,2,Aguascalientes,2,839,1,1,8.27,25,1455133925,316
"257,004",1,11,HGZ 1 Aaguascalientes,30,7,15,8,54,9,2,51,1,2,2,2,,,,,,,,1,1,1,1,1,2,1,2,,,,3,1,103,4,2,3,2,2,2,,,,1,2,,2,2,2,2,2,2,2,2,1,1,2,2,2,2,2,2,,,,,,2,2,,,,,,,2,2,1,4,1,,2,996,1,2,2,Aguascalientes,2,839,1,1,8.21,26,1455133925,316
"257,005",1,11,HGZ 1 Aaguascalientes,30,7,15,9,7,9,14,57,1,4,4,2,,,,,,,,2,1,5,1,1,5,1,2,,,,3,2,,,,,,,2,,,,2,,,,,2,2,2,2,2,2,1,1,2,2,2,2,2,2,,,,,,3,3,,,,,,,3,2,2,6,1,4,4,25,2,2,3,Aguascalientes,2,839,1,1,8.56,27,1455133925,316
"257,006",1,11,HGZ 1 Aaguascalientes,30,7,15,9,24,9,33,61,1,3,4,2,,,,,,,,1,1,2,1,1,2,1,2,,,,3,2,,,,,,,2,,,,2,,,,,2,2,2,2,2,2,1,1,2,2,2,1,2,2,,,,,,2,2,,,,3,,,2,2,1,1,7,,4,14,1,2,3,Aguascalientes,2,839,1,1,8.41,28,1455133925,316
"257,007",1,11,HGZ 1 Aaguascalientes,30,7,15,9,37,9,46,59,1,2,2,2,,,,,,,,2,1,4,1,1,4,1,2,,,,3,2,,,,,,,2,,,,2,,,,,2,2,2,2,2,2,1,1,2,2,2,1,2,2,,,,,,2,2,,,,3,,,2,6,,4,9,,2,996,2,2,9,Aguascalientes,2,839,1,1,8.56,29,1455133925,316
"257,008",1,11,HGZ 1 Aaguascalientes,30,7,15,9,52,10,1,54,1,2,3,2,,,,,,,,1,1,1,1,1,1,1,2,,,,3,2,,,,,,,2,,,,2,,,,,2,2,2,2,2,2,1,1,2,2,2,1,2,2,,,,,,2,2,,,,2,,,2,2,1,6,,,1,996,1,2,3,Aguascalientes,2,839,1,1,8.21,30,1455133925,316
"257,009",1,11,HGZ 1 Aaguascalientes,30,7,15,10,10,10,17,61,1,4,2,2,,,,,,,,1,1,1,1,1,1,1,2,,,,3,2,,,,,,,2,,,,2,,,,,2,2,2,2,2,2,1,1,2,2,2,1,2,2,,,,,,2,2,,,,2,,,2,3,1,1,11,,2,996,1,1,9,Aguascalientes,2,839,1,1,8.41,31,1455133925,316
"257,010",1,11,HGZ 1 Aaguascalientes,30,7,15,10,28,10,34,27,1,2,2,1,9,6,5,2,2,1,2,1,1,2,1,2,,,1,1,2,1,3,1,21,5,6,3,5,3,2,,,,2,,,,,2,1,2,1,2,2,2,2,2,2,2,1,2,1,2,,2,,,,,,,,3,,2,3,5,2,5,4,,2,996,1,2,5,Aguascalientes,2,839,1,1,8.08,32,1455133925,316
"257,011",1,11,HGZ 1 Aaguascalientes,30,7,15,10,48,10,55,31,1,2,3,1,35,6,5,4,1,1,2,1,2,,,2,,,1,1,1,,3,2,,,,,,,2,,,,2,,,,,2,1,2,1,1,2,2,2,2,2,2,1,2,1,2,,2,2,,,,,,,3,,2,2,2,1,4,7,9,1,996,2,2,5,Aguascalientes,2,839,1,1,8.22,33,1455133925,316
"257,013",1,11,HGZ 1 Aaguascalientes,30,7,15,11,44,11,52,78,1,2,3,1,16,3,2,4,1,1,2,1,1,2,1,1,8,1,1,1,2,1,3,1,4,5,6,3,3,2,2,,,,2,,,,,2,1,2,1,2,2,2,2,2,2,2,1,1,1,2,,2,,,,,,,,3,3,2,2,6,,1,2,,2,996,1,2,1,Aguascalientes,2,839,1,1,8.12,34,1455133925,316
"257,014",1,11,HGZ 1 Aaguascalientes,30,7,15,12,25,12,33,66,1,2,2,2,,,,,,,,1,1,2,1,2,,,2,,,,3,2,,,,,,,2,,,,2,,,,,2,2,2,2,2,2,1,1,2,2,2,2,2,2,,,,,,2,2,,,,,,,2,6,,12,,,1,996,2,2,2,Aguascalientes,2,839,1,1,8.27,35,1455133925,316
"257,015",1,11,HGZ 1 Aaguascalientes,30,7,15,13,1,13,10,59,1,2,2,1,23,3,2,3,1,1,1,1,1,1,1,1,1,1,2,,,,3,2,,,,,,,2,,,,2,,,,,2,2,2,1,2,2,1,1,2,2,2,1,2,2,,,2,,,2,2,,,,2,,,2,2,2,4,1,10,2,1,1,2,1,Aguascalientes,2,839,1,1,8.41,36,1455133925,316
"257,016",1,11,HGZ 1 Aaguascalientes,30,7,15,13,52,14,0,52,1,3,2,1,18,4,4,4,1,1,2,1,1,1,1,2,,,1,1,2,1,3,1,18,4,3,3,3,3,1,2,5,3,1,6,1,1,2,2,1,2,1,2,2,2,2,2,2,2,1,2,1,2,,2,,,,,,,,4,,2,2,2,1,7,3,6,1,996,2,2,1,Aguascalientes,2,839,1,1,8.35,37,1455133925,316
"257,017",1,11,HGZ 1 Aaguascalientes,30,7,15,14,30,14,37,48,1,3,3,1,15,2,1,4,1,1,1,1,1,9,1,2,,,2,,,,3,1,34,5,2,3,2,1,1,1,,2,1,1,,2,2,2,2,2,1,1,2,2,2,2,2,1,2,1,2,,,2,2,,,,,,2,,2,,2,2,1,1,,,2,996,1,2,5,Aguascalientes,2,839,1,1,8.21,38,1455133925,316
"257,018",1,11,HGZ 1 Aaguascalientes,30,7,15,15,17,15,26,67,1,2,2,2,,,,,,,,1,1,1,1,1,1,1,2,,,,3,2,,,,,,,2,,,,2,,,,,2,2,2,2,2,2,1,1,2,2,2,2,2,2,,,,,,2,2,,,,,,,2,2,2,2,,,2,996,1,2,5,Aguascalientes,2,839,1,1,8.12,39,1455133925,316
"257,020",1,11,HGZ 1 Aaguascalientes,30,7,15,16,58,17,8,77,1,2,2,1,23,2,2,3,1,1,2,1,1,1,1,1,1,1,1,1,1,,3,2,,,,,,,2,,,,2,,,,,2,1,2,1,2,2,1,1,2,2,2,2,2,1,2,,2,,,2,2,,,,,,2,2,2,1,10,,,1,996,2,2,5,Aguascalientes,2,839,1,1,8.27,40,1455133925,316
"257,021",1,11,HGZ 1 Aaguascalientes,30,7,15,18,0,18,10,30,1,3,3,1,12,5,2,6,1,1,2,2,2,,,2,,,1,1,1,,3,2,,,,,,,2,,,,2,,,,,2,1,1,1,2,2,2,2,2,2,2,2,2,1,2,2,2,,,,,,,,,,2,2,2,2,4,6,11,1,996,2,2,9,Aguascalientes,2,839,1,1,8.22,41,1455133925,316
"257,022",1,11,HGZ 1 Aaguascalientes,30,7,15,18,32,18,40,50,1,4,4,2,,,,,,,,1,1,4,1,1,4,1,2,,,,3,2,,,,,,,1,1,,3,1,1,,2,2,5,1,2,2,2,2,2,2,2,2,2,2,1,2,5,,,,,,,,,,,2,,3,4,2,1,5,9,1,1,1,2,9,Aguascalientes,2,839,1,1,8.21,42,1455133925,316
"257,204",1,11,HGZ 1 Aaguascalientes,30,7,15,8,45,8,52,86,1,3,3,2,,,,,,,,2,1,5,1,2,,,2,,,,3,2,,,,,,,2,,,,2,,,,,2,2,1,2,2,2,1,2,2,2,2,2,2,2,,2,,,,2,,,,,,,,2,3,99,1,4,,1,3,2,2,1,Aguascalientes,2,839,1,1,8.27,43,1455133925,316
"257,205",1,11,HGZ 1 Aaguascalientes,30,7,15,9,8,9,16,46,1,2,2,2,,,,,,,,1,2,,,2,,,2,,,,3,2,,,,,,,2,,,,2,,,,,2,2,1,2,2,1,2,2,2,2,2,1,2,2,,2,,,2,,,,,,2,,,4,2,2,1,5,4,1,1,1,2,5,Aguascalientes,2,839,1,1,8.21,44,1455133925,316
"257,206",1,11,HGZ 1 Aaguascalientes,30,7,15,9,24,9,35,30,1,2,2,1,4,5,7,3,1,1,2,1,1,6,1,1,6,2,2,,,,3,1,4,2,6,2,5,2,2,,,,1,99,,2,5,2,2,1,2,1,2,2,1,2,2,2,1,2,2,,2,,2,,,2,,,,2,,,3,5,2,1,4,6,1,1,1,2,9,Aguascalientes,2,839,1,1,8.08,45,1455133925,316
"257,207",1,11,HGZ 1 Aaguascalientes,30,7,15,9,50,10,3,28,1,2,2,1,64,6,6,4,2,1,2,1,1,5,1,1,6,1,1,1,1,,1,1,4,2,6,2,3,2,2,,,,2,,,,,2,1,2,1,1,1,2,2,2,2,2,2,2,1,2,,1,1,2,,,,,,,,2,2,2,99,9,4,,1,996,2,2,9,Aguascalientes,2,839,1,1,8.22,46,1455133925,316
"257,208",1,11,HGZ 1 Aaguascalientes,30,7,15,12,7,12,16,55,1,1,1,2,,,,,,,,2,1,1,1,1,1,1,2,,,,3,2,,,,,,,2,,,,2,,,,,2,1,2,2,2,2,1,1,2,2,2,2,2,2,2,,,,,2,2,,,,,,,2,3,1,6,5,7,2,996,2,1,2,Aguascalientes,2,839,1,1,8.56,47,1455133925,316
"257,209",1,11,HGZ 1 Aaguascalientes,30,7,15,12,50,12,59,29,1,1,3,1,4,4,3,4,1,99,1,2,1,1,1,1,1,1,2,,,,3,2,,,,,,,2,,,,2,,,,,2,1,2,1,1,1,2,2,2,2,2,2,2,1,2,,2,2,2,,,,,,,,2,2,2,1,2,6,8,1,996,2,1,4,Aguascalientes,2,839,1,1,8.22,48,1455133925,316
"257,210",1,11,HGZ 1 Aaguascalientes,30,7,15,14,1,14,9,63,1,2,2,2,,,,,,,,1,1,3,1,1,1,1,1,1,1,,1,2,,,,,,,2,,,,2,,,,,2,1,2,1,2,2,2,1,2,2,2,2,2,1,2,,1,,,,2,,,,,,2,2,2,2,4,1,,1,996,2,2,9,Aguascalientes,2,839,1,1,8.56,49,1455133925,316
"257,211",1,11,HGZ 1 Aaguascalientes,30,7,15,14,45,14,54,62,1,2,2,1,12,6,5,6,1,1,2,1,1,7,1,1,7,1,1,1,1,,3,2,,,,,,,2,,,,2,,,,,3,2,2,1,1,2,2,2,2,2,2,2,2,1,,,1,2,,,,,,,,,2,2,2,1,4,6,8,1,19,2,2,9,Aguascalientes,2,839,1,1,8.56,50,1455133925,316
"257,212",1,11,HGZ 1 Aaguascalientes,30,7,15,15,27,15,36,74,1,2,3,1,4,5,4,6,1,1,2,2,1,3,1,1,7,1,1,1,1,,3,2,,,,,,,2,,,,2,,,,,2,1,2,1,1,2,2,2,2,2,2,2,2,1,2,,2,2,,,,,,,,,2,2,4,2,7,10,3,2,1,1,2,2,Aguascalientes,2,839,1,1,8.12,51,1455133981,316
"257,213",1,11,HGZ 1 Aaguascalientes,30,7,15,15,52,16,4,63,1,2,2,1,16,5,4,6,2,2,1,1,1,3,1,1,3,1,2,,,,3,2,,,,,,,2,,,,2,,,,,2,2,2,2,1,2,2,2,2,2,2,2,2,2,,,,2,,,,,,,,,,2,2,99,1,4,7,1,996,1,2,3,Aguascalientes,2,839,1,1,8.41,52,1455133981,316
"257,215",1,11,HGZ 1 Aaguascalientes,30,7,15,17,41,17,52,59,1,1,1,1,4,1,1,3,1,1,2,1,2,,,1,1,1,2,,,,3,2,,,,,,,2,,,,2,,,,,1,1,2,2,1,2,2,2,2,2,2,2,2,2,1,,,1,,,,,,,,,,2,2,1,3,6,,1,996,1,2,7,Aguascalientes,2,839,1,1,8.41,53,1455133981,316
"257,216",1,11,HGZ 1 Aaguascalientes,30,7,15,18,18,18,26,37,1,2,2,1,4,6,6,4,2,1,2,1,1,3,1,2,,,2,,,,3,2,,,,,,,2,,,,2,,,,,2,1,2,1,1,2,1,2,2,2,2,2,2,2,2,,1,1,,2,,,,,,,,3,2,1,1,3,4,1,996,1,2,7,Aguascalientes,2,839,1,1,8.92,54,1455133981,316
"257,217",1,11,HGZ 1 Aaguascalientes,30,7,15,18,59,19,7,42,1,4,2,1,4,6,6,1,1,1,2,2,1,6,1,2,,,1,1,1,,1,2,,,,,,,2,,,,2,,,,,1,2,2,1,1,1,2,2,2,2,2,2,2,1,,,1,1,2,,,,,,,,2,2,6,,1,4,6,1,996,2,2,9,Aguascalientes,2,839,1,1,9.08,55,1455133981,316
"257,218",1,11,HGZ 1 Aaguascalientes,30,7,15,19,27,19,35,67,1,1,2,1,12,4,4,3,2,1,1,1,1,1,1,1,2,1,2,,,,3,2,,,,,,,2,,,,2,,,,,2,2,2,1,2,2,2,2,2,2,2,2,1,2,,,1,,,,,,,,,1,,4,4,1,6,4,,1,996,2,2,3,Aguascalientes,2,839,1,1,8.27,56,1455133981,316
"257,301",1,11,HGZ 1 Aaguascalientes,30,7,15,8,20,8,26,28,2,2,2,1,8,2,2,2,1,1,2,2,1,2,1,1,1,1,2,,,,3,1,22,4,6,1,5,2,2,,,,2,,,,,1,2,2,2,2,2,1,1,2,2,2,2,2,2,,,,,,2,1,,,,,,,2,6,,4,,,1,996,1,1,5,Aguascalientes,2,839,1,1,8.08,57,1455133981,316
"257,302",1,11,HGZ 1 Aaguascalientes,30,7,15,8,27,8,37,65,1,2,2,2,,,,,,,,1,1,2,1,1,3,1,2,,,,1,2,,,,,,,2,,,,2,,,,,2,1,1,1,1,2,1,1,2,2,2,2,2,2,2,2,2,2,,2,2,,,,,,,3,6,,12,,,1,996,1,2,3,Aguascalientes,2,839,1,1,8.12,58,1455133981,316
"257,303",1,11,HGZ 1 Aaguascalientes,30,7,15,8,48,8,54,65,1,2,2,2,,,,,,,,1,1,3,1,1,3,2,2,,,,1,1,23,3,4,2,3,2,2,,,,2,,,,,2,2,2,2,2,2,1,2,2,2,2,1,2,2,,,,,,1,,,,,2,,,4,3,2,5,6,,2,996,1,2,5,Aguascalientes,2,839,1,1,8.12,59,1455133981,316
"257,304",1,11,HGZ 1 Aaguascalientes,30,7,15,8,58,9,11,77,1,1,1,2,,,,,,,,2,2,,,2,,,2,,,,3,2,,,,,,,2,,,,2,,,,,1,2,1,2,1,2,1,2,2,2,2,2,2,2,,2,,2,,1,,,,,,,,2,6,,4,,,1,996,1,2,9,Aguascalientes,2,839,1,1,8.12,60,1455133981,316
"257,305",1,11,HGZ 1 Aaguascalientes,30,7,15,9,16,9,22,35,1,2,2,2,,,,,,,,1,2,,,2,,,1,1,1,,3,2,,,,,,,2,,,,2,,,,,2,1,1,2,2,1,2,2,2,2,2,2,2,1,2,2,,,2,,,,,,,,2,2,2,1,4,9,,2,996,1,2,9,Aguascalientes,2,839,1,1,8.92,61,1455133981,316
"257,306",1,11,HGZ 1 Aaguascalientes,30,7,15,9,48,9,58,35,1,2,2,1,20,1,1,1,1,1,2,1,2,,,1,3,1,2,,,,3,2,,,,,,,2,,,,2,,,,,2,2,2,2,2,2,2,1,2,2,2,2,2,2,,,,,,,1,,,,,,,2,2,2,5,,,1,996,1,2,7,Aguascalientes,2,839,1,1,8.92,62,1455133981,316
"257,307",1,11,HGZ 1 Aaguascalientes,30,7,15,10,4,10,13,25,1,2,2,1,3,1,1,2,2,1,2,1,1,1,2,1,1,1,2,,,,1,2,,,,,,,2,,,,2,,,,,1,1,2,1,2,2,2,2,2,2,2,2,2,2,2,,2,,,,,,,,,,,2,4,2,5,,,2,996,1,2,3,Aguascalientes,2,839,1,1,8.99,63,1455133981,316
"257,308",1,11,HGZ 1 Aaguascalientes,30,7,15,10,19,10,28,40,1,1,1,1,43,1,1,1,1,1,2,1,1,4,1,2,,,2,,,,1,2,,,,,,,2,,,,2,,,,,2,1,1,1,2,2,2,2,2,2,2,2,2,2,2,2,1,,,,,,,,,,,1,2,1,12,,,1,996,1,2,5,Aguascalientes,2,839,1,1,8.92,64,1455133981,316
"257,309",1,11,HGZ 1 Aaguascalientes,30,7,15,10,35,10,43,44,2,2,2,2,,,,,,,,1,1,3,1,1,3,1,2,,,,1,97,,,,,,,2,,,,2,,,,,2,2,2,2,2,2,1,1,2,2,2,2,2,2,,,,,,2,2,,,,,,,3,3,2,5,,,1,996,1,2,5,Aguascalientes,2,839,1,1,8.92,65,1455133981,316
"257,310",1,11,HGZ 1 Aaguascalientes,30,7,15,10,50,10,59,38,1,3,3,1,6,5,6,4,1,1,2,2,2,,,2,,,2,,,,3,2,,,,,,,2,,,,2,,,,,1,1,2,2,2,2,2,2,2,2,2,2,2,2,1,,,,,,,,,,,,,2,2,2,5,,,2,996,1,2,7,Aguascalientes,2,839,1,1,8.92,66,1455133981,316
"257,311",1,11,HGZ 1 Aaguascalientes,30,7,15,11,10,11,19,56,1,2,2,2,,,,,,,,1,2,,,1,2,1,2,,,,1,2,,,,,,,1,1,,1,1,1,,1,2,2,1,2,99,2,2,2,2,2,2,2,2,2,2,2,,,,,,,,,,,,,3,6,,5,7,,2,996,1,2,7,Aguascalientes,2,839,1,1,8.41,67,1455133981,316
"257,312",1,11,HGZ 1 Aaguascalientes,30,7,15,11,54,12,0,50,1,3,3,1,20,3,1,5,1,1,2,1,1,1,2,1,3,1,1,1,1,,3,2,,,,,,,2,,,,2,,,,,2,1,2,1,2,2,2,2,2,2,2,2,2,2,2,,2,,,,,,,,,,,3,1,1,1,,,2,996,1,2,3,Aguascalientes,2,839,1,1,8.21,68,1455133981,316
"257,313",1,11,HGZ 1 Aaguascalientes,30,7,15,12,32,12,38,51,1,3,3,1,7,6,6,4,1,1,2,1,1,3,1,1,4,1,1,1,1,,3,2,,,,,,,2,,,,2,,,,,2,1,1,1,2,2,1,1,2,2,2,2,2,2,2,2,2,,,2,2,,,,,,,2,3,2,5,6,,1,996,1,2,7,Aguascalientes,2,839,1,1,8.21,69,1455133981,316
"257,314",1,11,HGZ 1 Aaguascalientes,30,7,15,13,18,13,29,82,1,1,1,2,,,,,,,,2,1,1,1,1,1,1,1,1,1,,3,2,,,,,,,2,,,,2,,,,,1,1,2,1,2,2,2,1,2,2,2,2,2,1,1,,1,,,,1,,,,,,1,5,6,,3,9,998,1,996,2,2,3,Aguascalientes,2,839,1,1,8.27,70,1455133981,316
"257,315",1,11,HGZ 1 Aaguascalientes,30,7,15,14,21,14,30,61,1,2,2,1,17,6,6,5,2,2,2,1,2,,,2,,,2,,,,3,2,,,,,,,2,,,,2,,,,,2,1,2,2,2,2,2,2,2,2,2,2,2,2,2,,,,,,,,,,,,,2,4,2,5,4,,1,996,1,2,6,Aguascalientes,2,839,1,1,8.41,71,1455133981,316
"257,316",1,11,HGZ 1 Aaguascalientes,30,7,15,15,0,15,7,70,1,2,2,1,4,6,6,3,1,1,2,1,1,1,1,1,2,1,2,,,,3,2,,,,,,,2,,,,2,,,,,2,2,2,1,2,2,2,2,2,2,2,2,2,2,,,2,,,,,,,,,,,2,2,1,5,,,2,3,2,2,3,Aguascalientes,2,839,1,1,8.27,72,1455133981,316
"257,317",1,11,HGZ 1 Aaguascalientes,30,7,15,16,17,16,23,35,1,4,3,1,1,1,2,2,1,2,1,1,1,4,1,1,3,1,1,1,1,,3,1,1,2,2,1,1,3,2,,,,2,,,,,2,1,2,1,2,2,1,1,2,2,2,2,1,1,2,,2,,,1,4,,,,,5,1,2,3,2,5,4,1,4,996,1,2,3,Aguascalientes,2,839,1,1,8.92,73,1455133981,316
"257,318",1,11,HGZ 1 Aaguascalientes,30,7,15,17,48,17,57,52,1,1,1,1,4,6,4,4,2,1,2,1,2,,,2,,,1,1,1,,1,1,4,5,6,2,3,1,2,,,,2,,,,,2,1,2,1,1,2,2,2,2,2,2,2,2,1,2,,1,2,,,,,,,,,2,2,2,1,3,8,4,2,996,1,2,5,Aguascalientes,2,839,1,1,8.21,74,1455133981,316
"257,319",1,11,HGZ 1 Aaguascalientes,30,7,15,15,42,15,50,74,1,1,1,2,,,,,,,,1,1,2,1,1,2,1,1,1,1,,3,2,,,,,,,2,,,,2,,,,,1,1,1,1,2,2,2,2,2,2,2,2,2,2,1,1,1,,,,,,,,,,,2,5,2,5,,,1,996,1,2,7,Aguascalientes,2,839,1,1,8.12,75,1455133981,316
"257,320",1,11,HGZ 1 Aaguascalientes,30,7,15,18,21,18,31,30,1,2,2,1,9,6,6,4,1,1,2,1,1,6,1,2,,,2,,,,3,1,22,1,2,2,2,2,2,,,,2,,,,,2,1,1,1,2,2,1,2,2,2,2,2,2,2,2,2,1,,,2,,,,,,,,2,6,,4,9,,1,996,1,2,5,Aguascalientes,2,839,1,1,8.08,76,1455133981,316
"270,801",1,11,HGZ 1 Aaguascalientes,30,7,15,8,21,8,28,37,1,2,2,1,4,8,,1,2,2,2,1,1,4,1,1,8,1,2,,,,3,2,,,,,,,2,,,,2,,,,,2,2,2,1,2,2,1,1,2,2,2,2,2,2,,,1,,,2,2,,,,,,,2,6,,8,6,1,1,996,1,2,9,Aguascalientes,2,839,1,1,8.92,77,1455133981,316
"270,802",1,11,HGZ 1 Aaguascalientes,30,7,15,8,30,8,39,18,2,1,1,2,,,,,,,,2,1,2,1,2,,,2,,,,3,2,,,,,,,2,,,,2,,,,,1,2,2,1,2,1,1,2,2,2,2,2,2,2,,,1,,1,1,,,,,,,,2,2,1,10,2,4,1,996,1,2,7,Aguascalientes,2,839,1,1,8.99,78,1455133981,316
"270,803",1,11,HGZ 1 Aaguascalientes,30,7,15,8,36,8,45,22,2,2,1,2,,,,,,,,1,1,3,1,2,,,2,,,,3,2,,,,,,,2,,,,2,,,,,2,1,2,2,1,2,1,2,2,2,2,2,2,2,2,,,2,,2,,,,,,,,2,3,2,5,4,8,1,996,1,2,5,Aguascalientes,2,839,1,1,8.99,79,1455133981,316
"270,804",1,11,HGZ 1 Aaguascalientes,30,7,15,8,51,9,1,72,1,2,2,2,,,,,,,,2,2,,,1,2,1,2,,,,3,2,,,,,,,2,,,,2,,,,,2,2,2,2,2,2,1,1,2,2,2,2,2,2,,,,,,2,2,,,,,,,2,6,,6,4,8,1,996,1,2,1,Aguascalientes,2,839,1,1,8.12,80,1455133981,316
"270,805",1,11,HGZ 1 Aaguascalientes,30,7,15,9,0,9,7,48,1,2,2,1,6,1,1,5,2,2,2,1,1,1,1,1,1,1,2,,,,1,2,,,,,,,2,,,,2,,,,,2,2,2,1,2,2,2,1,2,2,2,2,2,2,,,1,,,,5,,,,,,,3,3,2,1,6,5,2,996,1,1,3,Aguascalientes,2,839,1,1,8.21,81,1455133981,316
"270,806",1,11,HGZ 1 Aaguascalientes,30,7,15,9,17,9,27,53,1,2,2,2,,,,,,,,2,1,1,1,1,1,1,2,,,,3,2,,,,,,,2,,,,1,1,,1,2,1,2,2,1,1,2,2,1,1,2,2,2,2,2,,,2,1,,,1,1,,,,,,2,2,1,12,,,1,996,1,2,2,Aguascalientes,2,839,1,1,8.21,82,1455133981,316
"270,807",1,11,HGZ 1 Aaguascalientes,30,7,15,9,44,9,54,47,2,1,1,1,35,4,2,2,1,1,2,1,1,5,1,2,,,2,,,,3,2,,,,,,,2,,,,2,,,,,1,1,2,1,2,2,2,2,2,2,2,2,2,2,1,,1,,,,,,,,,,,2,6,,4,,,1,996,1,2,9,Aguascalientes,2,839,1,1,8.21,83,1455133981,316
"270,808",1,11,HGZ 1 Aaguascalientes,30,7,15,10,0,10,9,60,2,1,2,1,7,4,4,4,1,1,2,1,2,,,2,,,1,1,1,,3,2,,,,,,,2,,,,2,,,,,2,2,2,1,2,2,2,1,2,2,2,2,2,1,,,1,,,,1,,,,,,1,3,6,,5,6,4,2,996,1,2,3,Aguascalientes,2,839,1,1,8.41,84,1455133981,316
"270,809",1,11,HGZ 1 Aaguascalientes,30,7,15,10,15,10,21,59,1,2,2,2,,,,,,,,2,1,3,1,1,3,1,2,,,,3,2,,,,,,,2,,,,2,,,,,1,2,2,1,1,2,1,1,2,2,2,1,2,2,,,1,1,,1,1,,,,1,,,3,5,2,6,10,2,1,996,1,1,7,Aguascalientes,2,839,1,1,8.41,85,1455133981,316
"270,810",1,11,HGZ 1 Aaguascalientes,30,7,15,10,30,10,36,26,1,2,2,1,4,1,1,6,1,1,2,2,2,,,1,4,1,2,,,,3,2,,,,,,,2,,,,2,,,,,2,1,2,1,1,2,2,1,2,2,2,2,2,2,2,,1,1,,,1,,,,,,,2,2,2,4,6,998,2,996,2,2,7,Aguascalientes,2,839,1,1,8.22,86,1455133981,316
"270,811",1,11,HGZ 1 Aaguascalientes,30,7,15,10,45,10,55,20,1,1,1,2,,,,,,,,2,2,,,1,2,1,2,,,,3,1,15,3,6,3,3,1,2,,,,2,,,,,1,1,2,1,2,2,1,1,2,2,2,1,2,2,1,,1,,,1,1,,,,1,,,1,1,1,12,,,1,996,1,1,7,Aguascalientes,2,839,1,1,8.99,87,1455133981,316
"270,812",1,11,HGZ 1 Aaguascalientes,30,7,15,11,4,11,13,60,1,1,1,2,,,,,,,,1,2,,,1,1,1,2,,,,3,2,,,,,,,2,,,,2,,,,,1,2,2,2,2,2,2,1,2,2,2,2,2,2,,,,,,,1,,,,,,,1,6,,12,,,1,996,1,1,2,Aguascalientes,2,839,1,1,8.41,88,1455133981,316
"270,813",1,11,HGZ 1 Aaguascalientes,30,7,15,11,36,11,46,41,1,1,1,1,43,1,7,3,2,1,2,1,2,,,1,7,1,2,,,,1,2,,,,,,,2,,,,2,,,,,2,2,2,1,2,2,2,1,2,2,2,2,2,2,,,1,,,,1,,,,,,,2,2,2,998,5,6,1,996,1,2,2,Aguascalientes,2,839,1,1,8.92,89,1455133981,316
"270,814",1,11,HGZ 1 Aaguascalientes,30,7,15,12,22,12,28,45,1,1,1,1,43,2,1,2,2,1,1,2,2,,,1,1,1,2,,,,3,1,4,4,1,1,2,1,2,,,,2,,,,,1,1,2,1,2,2,2,1,2,2,2,2,2,2,1,,1,,,,1,,,,,,,2,6,,12,,,1,996,1,2,3,Aguascalientes,2,839,1,1,8.21,90,1455133981,316
"270,816",1,11,HGZ 1 Aaguascalientes,30,7,15,13,45,13,51,34,1,3,3,1,7,2,2,2,1,1,2,2,1,4,1,1,3,1,2,,,,3,2,,,,,,,2,,,,2,,,,,1,1,2,1,1,2,1,1,2,2,2,2,2,2,1,,1,2,,1,1,,,,,,,2,2,2,9,5,6,2,996,1,2,5,Aguascalientes,2,839,1,1,8.08,91,1455133981,316
"270,817",1,11,HGZ 1 Aaguascalientes,30,7,15,15,8,15,18,31,1,3,2,1,11,5,5,6,1,1,2,1,1,7,1,1,7,1,1,1,1,,1,1,11,5,99,99,99,1,2,,,,2,,,,,1,2,2,1,1,1,1,1,2,2,2,2,2,1,,,1,3,2,2,2,,,,,,2,4,5,2,10,5,2,1,996,1,2,3,Aguascalientes,2,839,1,1,8.08,92,1455133981,316
"270,818",1,11,HGZ 1 Aaguascalientes,30,7,15,15,45,15,51,61,1,1,1,1,4,2,2,4,2,1,2,1,2,,,1,1,1,2,,,,3,2,,,,,,,2,,,,2,,,,,2,2,2,1,1,2,1,1,2,2,2,2,2,2,,,1,1,,1,1,,,,,,,3,3,2,5,1,,1,996,1,2,1,Aguascalientes,2,839,1,1,8.41,93,1455133981,316
"270,819",1,11,HGZ 1 Aaguascalientes,30,7,15,16,25,16,32,34,1,2,2,2,,,,,,,,1,1,1,1,2,,,1,1,1,,3,1,9,2,1,2,3,2,2,,,,2,,,,,2,1,2,1,2,2,1,2,2,2,2,1,2,1,1,,1,,,1,,,,,2,,1,2,6,,4,1,,1,996,1,1,9,Aguascalientes,2,839,1,1,8.08,94,1455133981,316
"270,820",1,11,HGZ 1 Aaguascalientes,30,7,15,17,26,17,33,52,1,4,4,2,,,,,,,,1,1,3,1,1,5,1,2,,,,3,1,20,3,6,1,5,5,2,,,,2,,,,,5,2,1,1,2,2,1,1,2,2,2,2,2,2,,1,2,,,2,2,,,,,,,3,5,2,998,5,4,4,3,1,2,9,Aguascalientes,2,839,1,1,8.21,95,1455133981,316
"270,821",1,11,HGZ 1 Aaguascalientes,30,7,15,18,16,18,26,47,1,1,4,1,8,6,5,3,2,1,2,1,1,3,1,1,4,1,2,,,,1,2,,,,,,,2,,,,2,,,,,1,2,1,2,2,2,2,2,2,2,2,2,2,2,,1,,,,,,,,,,,,2,3,2,9,1,5,1,996,2,2,7,Aguascalientes,2,839,1,1,8.35,96,1455133981,316
"270,824",1,11,HGZ 1 Aaguascalientes,30,7,15,18,49,18,58,71,1,1,2,1,1,1,2,2,1,1,2,1,1,2,1,2,,,1,1,1,,1,2,,,,,,,2,,,,2,,,,,1,1,2,1,2,1,1,2,2,2,2,1,2,1,1,,1,,1,1,,,,,2,,1,2,3,2,5,8,4,1,25,2,2,8,Aguascalientes,2,839,1,1,8.27,97,1455133981,316
"4,000,001",1,11,HGZ 1 Aaguascalientes,30,7,15,8,17,8,30,52,1,1,1,1,1,6,7,1,2,2,2,2,1,1,1,1,1,1,2,,,,1,1,21,1,6,4,5,1,2,,,,1,3,1,1,2,2,2,2,2,1,2,1,2,2,2,2,2,2,2,,,,1,,1,,,,,,,,3,3,99,1,4,,1,996,1,2,4,Aguascalientes,2,839,1,1,8.21,98,1455133981,316