Folio,Deleg,Unidmed,Id_Unid,Fecha_Dia,Fecha_Mes,Fecha_Ano,Hr_Ini,Min_Ini,Hr_Fin,Min_Fin,Edad,Sexo,Edocivi,Recado,Escolar,Ingreso,Ocupa,Reli_A,Relig_B,Telefono,Sat1,Retro,Prospe,Confi1_A,Confi1_B,Confi1_C,Confi1_D,Confi1_E,Confi1_F,Confi1_G,Retroi,Prosi,Cons_Mf,Mot_Cons1,Probsal,Frecmf,Tmedico,Citapre,Hrcita,Tdifcons,Citatel,Nocitatel,Ordcit,Tesptot_Hr,Tesptot_Mi,Tesptot,Btratou,Preosad,Tmsalud,Mhclinco,Expclaa_A,Expclaa_B,Expclaa_C,Expclaa_D,Expclab_A,Expclab_B,Expclab_C,Expclab_D,Mopin,Explora,Cexplora,Mexapriv,Conimpa_A,Conimpa_B,Conimpa_C,Conimpa_D,Conimpa_E,Conimpa_F,Conimpa_G,Conimpa_H,Conimpa_I,Conimpa_J,Conimpa_K,Prevasis_A,Prevasis_B,Prevasis_C,Prevmed_A,Prevmed_B,Dpconf,Calfatna_A,Calfatna_B,Calfatna_C,Calfatna_D,Calfatna_E,Calfatna_F,Calfatna_G,Calfatna_H,Calfatna_I,Calfatna_J,Calfatna_K,Calfatna_L,Calfatna_M,Calfatna_N,Calfatna_O,Calfatnb_A,Calfatnb_B,Calfatnb_C,Calfatnb_D,Calfatnb_E,Calfatnb_F,Calfatnb_G,Calfatnb_H,Calfatnb_I,Calfatnb_J,Calfatnb_K,Calfatnb_L,Calfatnb_M,Calfatnb_N,Calfatnb_O,Calfatnbes,Infimss,Finfimss,Continf,Atn1fam,Filtrosaux,Temsad,Calftest,Saduni,Privalrx,Faltamat,Satlarx,Calfinma_A,Calfinmab1,Calfinmac1,Calfinma_D,Calfinma_E,Calfinmb_A,Calfinmb_B,Calfinmb_2,Calfinmb_3,Calfinmb_C,Calfinmbc2,Calfinmb_D,Calfinmb_E,Calfinmb_F,Calfinmb_G,Calfinmb_H,Calfinmb_I,Calfinmb_J,Segur1,Segur2,Filtrofarm,Totmed,Acnomed,Tfarsurt,Calftmed,Recomuni,Norecom,Corrup,Kilos,Torta,Confi2,Sat2,Id_Unidad,Cvedelegacion,Delegacion,Nivel,Unidad,Condiarpromjun08_May09,Estrato,Deleg1,Sat1_X,Fe_Finalnr,Mot_Cons1_X,Probsal_X,Continf_X,Norecom_X,Ocupa_X,Relig_B_X,Fecha,Entidad
78,1,UMF 8 Aguascalientes,1,17,11,9,9,35,10,0,57,2,2,1,2,3,2,1,1,2,3,3,2,4,4,4,3,4,3,4,3,2,2,3,76,4,1,1,1,,2,21,1,0,30,0,2,2,3,3,1,1,1,1,4,2,2,4,4,1,2,1,4,4,1,1,1,1,1,1,1,1,1,1,1,0,1,1,1,1,1,0,0,0,1,1,1,0,0,0,0,0,0,0,2,5,,,,5,5,2,,,,,,,,,2,,,1,2,,,,,,,1,0,1,1,1,2,,,,2,2,99,99,1,1,1,1,1,2,2,1,2,1,1,1,1,,2,1,1,2,2,1,1,Aguascalientes,1,UMF 8 Aguascalientes,953,1,1,2,7.33602114639799000000,3,21,,,2,1,2009-11-17,1
117,1,UMF 8 Aguascalientes,1,17,11,9,12,9,12,30,51,1,2,1,5,3,10,1,1,1,2,1,1,4,4,5,3,4,5,5,2,2,2,4,2,2,1,1,1,,1,,1,0,15,0,1,1,1,1,1,0,1,0,2,,2,,2,1,2,1,2,2,2,2,1,2,2,2,1,1,1,1,1,0,1,1,2,1,1,0,0,0,0,0,1,0,0,0,0,0,0,0,1,1,,,,,,2,,,,,,,,,2,,,2,2,,,,,,,1,0,1,0,0,1,,,,1,1,,,2,2,2,2,2,2,3,1,1,,1,2,1,,2,1,1,2,2,1,1,Aguascalientes,1,UMF 8 Aguascalientes,953,1,1,1,6.00181385694341000000,4,2,,,10,1,2009-11-17,1
187,1,UMF 8 Aguascalientes,1,17,11,9,12,15,12,40,50,1,2,1,3,3,5,1,1,1,2,1,1,1,1,2,1,1,2,2,2,1,2,4,20,2,2,1,1,,2,2,1,0,15,0,1,1,1,1,1,0,0,0,2,,,,1,1,2,1,1,1,1,1,1,1,1,1,1,1,1,1,1,0,1,0,1,1,1,0,1,0,0,0,1,0,0,0,0,0,0,0,2,2,,2,,,,2,,,,,,,,,1,7,3,2,1,2,3,2,2,2,1,1,1,1,1,1,2,2,3,3,2,2,2,2,2,2,2,2,2,1,1,1,1,,1,2,1,,2,1,1,1,1,1,1,Aguascalientes,1,UMF 8 Aguascalientes,953,1,1,1,6.00181385694341000000,4,20,3,,5,1,2009-11-17,1
192,1,UMF 8 Aguascalientes,1,17,11,9,15,10,15,37,31,1,4,1,3,2,10,1,1,1,2,1,1,1,1,2,5,1,1,2,3,2,2,2,13,6,1,1,2,3,2,7,1,1,0,0,1,1,1,3,0,0,1,0,,,2,,1,1,1,1,1,1,1,1,1,1,1,1,1,1,1,0,0,0,0,1,1,1,0,1,0,0,0,0,1,0,0,0,0,0,0,0,2,,2,,,,,2,,,,,,,,,1,2,9,2,1,1,2,1,2,2,3,1,0,1,0,0,2,,,,2,2,,,3,3,2,4,4,3,3,1,1,,1,2,1,,2,1,2,1,1,1,1,Aguascalientes,1,UMF 8 Aguascalientes,953,1,1,1,6.06437279195545000000,2,13,9,,10,1,2009-11-17,1
199,1,UMF 8 Aguascalientes,1,17,11,9,18,36,19,0,67,2,2,1,6,3,9,1,5,1,1,1,1,1,3,3,1,1,3,3,2,2,2,4,1,2,1,1,1,,2,10,1,0,15,0,1,1,1,1,1,0,1,1,2,,2,2,1,1,1,1,1,1,1,1,1,1,1,1,1,1,1,1,1,0,1,1,1,1,1,0,0,0,0,0,1,0,0,0,0,0,0,0,2,2,,,,,,2,,,,,,,,,1,2,1,2,2,,,,,,,1,1,1,0,0,2,4,4,4,2,2,,,2,2,2,2,2,1,1,1,2,3,1,1,1,,2,1,2,1,1,1,1,Aguascalientes,1,UMF 8 Aguascalientes,953,1,1,1,6.21877854622495000000,4,1,1,,9,2,2009-11-17,1
94,1,UMF 8 Aguascalientes,1,17,11,9,9,53,10,20,35,1,2,1,5,3,4,1,1,2,1,1,3,1,1,4,1,2,5,5,1,1,2,1,25,2,1,2,,,,,1,0,30,0,1,1,1,3,1,1,1,1,1,1,1,1,2,1,1,1,1,1,1,1,1,1,1,1,1,1,1,1,1,0,1,1,1,1,0,1,0,0,0,0,1,0,0,0,0,0,0,0,1,,1,,,,,2,,,,,,,,,1,1,1,1,1,1,2,1,1,2,1,1,0,1,0,0,3,,,,3,2,,,4,2,2,2,2,2,2,1,2,3,1,3,1,,2,1,1,1,1,1,1,Aguascalientes,1,UMF 8 Aguascalientes,953,1,1,1,6.06437279195545000000,1,21,1,,4,1,2009-11-17,1
96,1,UMF 8 Aguascalientes,1,17,11,9,11,52,12,15,47,1,2,1,5,3,5,1,1,1,2,1,2,1,2,2,2,1,2,2,3,1,2,4,4,6,1,1,1,,1,,1,0,10,0,1,1,3,1,1,1,1,0,1,1,4,,2,2,,1,1,1,1,1,1,1,1,1,1,1,1,1,1,0,0,1,1,1,1,0,0,0,0,0,1,0,0,0,0,0,0,0,2,2,,,,,,2,,,,,,,,,1,1,1,2,1,1,1,1,1,2,1,1,0,1,0,0,2,,,,2,2,,,2,2,2,2,2,2,99,1,1,,1,2,1,,2,1,2,2,2,1,1,Aguascalientes,1,UMF 8 Aguascalientes,953,1,1,1,6.00181385694341000000,4,4,1,,5,1,2009-11-17,1
97,1,UMF 8 Aguascalientes,1,17,11,9,12,25,12,50,70,2,2,1,2,2,8,1,1,1,1,2,2,1,3,2,1,1,3,4,2,1,2,4,4,2,1,1,1,,1,,1,0,25,0,2,1,1,1,1,0,1,1,2,,2,2,1,1,2,1,1,1,1,1,1,1,1,1,1,1,1,0,0,0,1,1,1,1,1,0,0,0,0,0,1,0,0,0,0,0,0,0,2,2,,,,,,2,,,,,,,,,2,,,2,2,,,,,,,1,0,1,0,0,2,,,,2,2,,,2,2,2,2,2,2,2,1,1,,1,2,1,,2,2,2,1,1,1,1,Aguascalientes,1,UMF 8 Aguascalientes,953,1,1,1,6.21877854622495000000,4,4,,,8,1,2009-11-17,1
98,1,UMF 8 Aguascalientes,1,17,11,9,13,1,13,25,65,1,2,1,2,1,5,1,1,1,3,1,1,2,5,5,1,1,5,5,3,3,2,4,1,2,2,1,2,3,1,,2,0,30,0,2,1,1,1,1,1,1,1,2,2,2,2,1,1,1,1,1,1,1,1,1,1,1,1,1,1,1,1,1,0,1,1,1,1,1,0,0,0,0,0,1,0,0,0,0,0,0,0,3,2,,,,,,2,,,,,,,,,2,,,1,1,3,3,1,2,2,1,1,0,1,0,0,2,,,,2,2,,,3,2,2,3,4,2,3,1,2,3,1,2,1,,2,2,2,1,1,1,1,Aguascalientes,1,UMF 8 Aguascalientes,953,1,1,2,5.08776494875856000000,4,1,,,5,1,2009-11-17,1
107,1,UMF 8 Aguascalientes,1,17,11,9,17,46,18,4,61,1,2,1,3,2,5,1,1,1,1,1,1,1,99,5,1,1,3,5,1,1,2,4,2,2,1,1,1,,1,,1,0,10,0,1,1,1,1,1,1,1,0,2,2,2,,1,1,2,1,1,1,1,1,1,1,1,1,1,1,1,1,1,0,1,1,1,1,1,0,0,0,0,0,1,0,0,0,0,0,0,0,2,2,,,,,,2,,,,,,,,,2,,,2,2,,,,,,,1,0,1,0,0,3,,,,3,3,,,2,2,2,2,2,2,1,1,1,,1,3,1,,2,1,1,1,1,1,1,Aguascalientes,1,UMF 8 Aguascalientes,953,1,1,1,5.08776494875856000000,4,2,,,5,1,2009-11-17,1
50,1,UMF 8 Aguascalientes,1,17,11,9,9,45,10,15,73,1,3,1,3,2,5,1,1,1,1,1,2,4,5,5,1,1,4,5,3,3,2,3,2,2,1,1,1,,2,2,1,0,30,0,1,1,1,1,1,1,1,1,2,2,2,2,1,1,1,1,1,1,1,1,1,1,1,1,1,1,1,1,1,0,1,1,1,1,1,0,0,0,1,1,1,0,0,0,0,0,0,0,2,2,,,,1,1,1,,,,,,,,,1,5,7,2,1,3,3,1,2,2,1,1,1,1,1,1,2,4,4,4,2,2,2,2,2,2,2,2,4,2,2,1,1,,1,2,1,,2,2,2,1,1,1,1,Aguascalientes,1,UMF 8 Aguascalientes,953,1,1,1,5.08776494875856000000,3,2,7,,5,1,2009-11-17,1
56,1,UMF 8 Aguascalientes,1,17,11,9,15,10,15,32,63,1,2,1,4,3,5,1,1,1,2,2,2,2,2,2,2,1,2,5,3,3,2,4,1,2,1,1,1,,2,2,1,0,30,0,1,1,1,1,1,1,1,1,2,2,2,2,2,1,4,1,1,1,1,1,1,1,1,1,1,1,1,1,0,0,1,1,1,1,1,0,0,0,1,0,1,0,0,0,0,0,0,0,2,2,,,,2,,2,,,,,,,,,1,5,7,2,1,3,4,1,2,2,2,1,0,1,1,0,2,,,,2,2,2,,2,2,2,2,5,2,2,1,2,3,1,1,1,,2,2,2,2,2,1,1,Aguascalientes,1,UMF 8 Aguascalientes,953,1,1,1,5.08776494875856000000,4,1,7,,5,1,2009-11-17,1
157,1,UMF 8 Aguascalientes,1,17,11,9,10,58,11,20,52,1,2,1,3,2,5,1,1,2,1,2,3,4,2,5,1,1,3,3,1,2,2,4,4,2,1,2,,,,,1,0,30,0,1,1,1,1,1,0,1,1,1,,1,1,1,1,1,1,1,1,1,1,1,1,1,1,1,1,1,1,1,1,1,1,1,1,1,0,0,0,0,0,1,0,0,0,0,0,0,0,1,1,,,,,,1,,,,,,,,,1,2,7,1,2,,,,,,,1,0,1,0,0,2,,,,2,2,,,3,2,2,2,2,1,1,1,2,3,1,3,1,,2,1,1,1,1,1,1,Aguascalientes,1,UMF 8 Aguascalientes,953,1,1,1,6.00181385694341000000,4,4,7,,5,1,2009-11-17,1
165,1,UMF 8 Aguascalientes,1,17,11,9,15,55,16,17,30,1,2,1,4,3,5,2,,2,1,2,2,2,4,4,2,2,4,4,3,2,2,4,3,2,1,1,1,,2,2,1,0,5,0,1,1,1,1,1,0,1,1,2,,2,2,1,1,2,1,1,1,1,1,1,1,1,1,1,1,1,1,1,1,1,1,1,1,1,0,0,0,0,0,1,0,0,0,0,0,0,0,2,2,,,,,,2,,,,,,,,,1,2,1,1,2,,,,,,,1,0,1,0,0,2,,,,2,2,,,2,2,2,2,2,3,3,1,2,1,1,2,1,,2,1,2,3,3,1,1,Aguascalientes,1,UMF 8 Aguascalientes,953,1,1,1,6.06437279195545000000,4,3,1,,5,,2009-11-17,1
171,1,UMF 8 Aguascalientes,1,17,11,9,19,7,19,30,19,1,2,1,5,5,2,1,1,2,1,2,2,3,3,3,1,1,3,3,1,2,2,4,3,2,1,1,2,2,2,2,1,0,20,0,1,1,1,1,1,0,1,0,2,,2,,2,1,2,1,1,1,1,1,1,1,1,1,1,1,1,1,1,0,0,0,1,1,1,0,0,0,0,0,1,0,0,0,0,0,0,0,2,3,,,,,,2,,,,,,,,,1,5,1,1,2,,,,,,,1,0,1,0,0,3,,,,2,2,,,2,2,2,2,2,1,1,1,1,,1,1,2,1,99,2,1,2,2,1,1,Aguascalientes,1,UMF 8 Aguascalientes,953,1,1,1,5.44581830246484000000,4,3,1,1,2,1,2009-11-17,1
16,1,UMF 8 Aguascalientes,1,17,11,9,8,0,8,23,24,1,2,1,5,4,5,1,1,1,5,2,2,1,5,5,4,5,1,5,1,3,2,1,4,6,1,1,1,,1,,1,0,23,0,1,1,1,1,1,0,1,1,1,,2,2,1,1,1,1,3,3,1,1,1,1,1,1,1,1,1,1,1,0,1,1,1,1,1,0,0,0,0,0,1,0,0,0,1,0,0,0,1,1,,,,,,2,,,,2,,,,,2,,,1,2,,,,,,,1,0,1,0,0,2,,,,2,3,,,2,2,3,2,2,2,99,1,1,,1,3,1,,2,2,2,1,1,1,1,Aguascalientes,1,UMF 8 Aguascalientes,953,1,1,3,5.44581830246484000000,1,4,,,5,1,2009-11-17,1
18,1,UMF 8 Aguascalientes,1,17,11,9,9,24,9,44,22,1,1,1,6,4,7,1,1,1,3,2,2,2,2,4,4,2,4,5,1,3,2,1,47,3,3,2,,,,,1,1,30,0,1,1,1,3,1,0,1,1,1,,2,2,1,2,,2,1,1,1,1,1,1,1,1,1,1,1,1,1,0,0,0,1,1,1,0,1,0,0,0,1,0,1,0,0,0,0,0,2,2,,2,,,,2,,2,,,,,,,2,,,1,2,,,,,,,1,1,1,0,0,2,4,4,4,2,2,,,2,4,4,4,2,4,4,1,1,,1,1,2,2,2,1,2,4,2,1,1,Aguascalientes,1,UMF 8 Aguascalientes,953,1,1,2,5.44581830246484000000,1,21,,2,7,1,2009-11-17,1
29,1,UMF 8 Aguascalientes,1,17,11,9,18,10,18,34,69,1,2,1,5,3,5,1,2,1,1,1,1,1,2,1,1,1,2,2,1,1,2,4,1,2,1,1,1,,1,,1,0,5,0,1,1,1,1,1,1,1,1,1,1,1,1,1,1,1,1,1,1,1,1,1,1,1,1,1,1,1,1,1,0,0,1,1,1,1,0,0,0,0,0,1,0,0,0,0,0,0,0,1,1,,,,,,1,,,,,,,,,1,2,8,2,1,3,3,1,2,2,1,1,0,1,0,0,1,,,,1,1,,,3,3,4,3,3,1,2,1,1,,1,3,1,,2,2,2,1,1,1,1,Aguascalientes,1,UMF 8 Aguascalientes,953,1,1,1,5.08776494875856000000,4,1,8,,5,2,2009-11-17,1
62,1,UMF 8 Aguascalientes,1,17,11,9,11,49,12,10,61,1,4,1,5,5,9,1,5,2,1,1,3,4,4,4,1,3,3,5,3,1,2,4,2,2,1,1,2,2,2,2,1,0,30,0,1,1,1,3,1,1,1,0,3,1,1,,1,2,,1,1,1,1,1,1,1,1,1,1,1,1,1,0,0,1,1,1,1,1,0,1,0,1,0,1,0,1,1,0,1,0,0,1,1,,1,,1,,1,,1,1,,1,,,,1,7,99,1,1,4,5,1,2,2,1,1,0,1,1,0,1,,,,1,1,1,,2,1,1,5,5,1,3,1,2,1,2,4,1,,2,1,2,1,1,1,1,Aguascalientes,1,UMF 8 Aguascalientes,953,1,1,1,5.08776494875856000000,4,2,99,,9,2,2009-11-17,1
3,1,UMF 8 Aguascalientes,1,17,11,9,8,53,9,20,70,1,4,1,3,2,1,1,1,1,2,2,2,2,5,5,4,1,5,5,3,1,2,3,2,2,1,2,,,,,1,0,1,0,1,2,2,1,1,0,1,1,4,,3,2,1,1,1,1,1,1,1,1,1,1,1,1,1,1,1,1,0,0,1,1,1,1,1,0,0,0,1,0,1,0,0,0,0,0,0,0,2,4,,,,1,,1,,,,,,,,,2,,,99,1,1,2,1,1,2,2,1,1,1,1,0,2,4,4,4,4,4,2,,3,4,4,4,4,2,99,1,1,,1,1,1,,2,1,1,2,3,1,1,Aguascalientes,1,UMF 8 Aguascalientes,953,1,1,1,5.08776494875856000000,3,2,,,1,1,2009-11-17,1
5,1,UMF 8 Aguascalientes,1,17,11,9,10,12,10,33,70,1,4,1,5,99,5,1,1,1,3,2,2,3,4,5,4,2,5,5,3,2,2,3,1,2,1,1,1,,1,,1,0,30,0,1,1,2,1,1,1,1,1,2,2,2,2,2,2,,1,1,1,1,1,1,1,1,1,1,1,1,1,1,0,1,1,1,1,1,0,0,0,0,0,1,0,0,0,0,0,0,0,2,2,,,,,,2,,,,,,,,,1,5,7,99,1,2,3,1,1,2,2,1,0,1,0,0,2,,,,2,2,,,3,3,3,3,3,2,2,1,1,,2,2,1,,2,1,2,1,1,1,1,Aguascalientes,1,UMF 8 Aguascalientes,953,1,1,2,5.08776494875856000000,3,1,7,,5,1,2009-11-17,1
12,1,UMF 8 Aguascalientes,1,17,11,9,14,30,14,55,45,2,2,1,3,2,8,1,3,1,2,2,1,2,5,5,5,5,5,5,2,2,2,4,8,2,1,1,1,,2,2,1,99,99,0,2,2,3,1,1,1,1,1,4,4,4,4,2,1,4,1,1,1,1,1,1,1,1,1,1,2,2,1,1,0,1,0,1,1,1,0,0,0,0,0,1,0,0,0,0,0,0,0,2,2,,,,,,4,,,,,,,,,2,,,1,2,,,,,,,1,1,1,0,0,4,5,5,5,3,3,,,3,3,3,3,3,4,4,1,2,1,1,1,2,3,2,1,2,4,4,1,1,Aguascalientes,1,UMF 8 Aguascalientes,953,1,1,1,7.33602114639799000000,4,8,,3,8,3,2009-11-17,1
141,1,UMF 8 Aguascalientes,1,17,11,9,10,30,11,0,54,2,2,1,4,4,2,1,1,1,1,1,1,2,2,4,1,1,5,4,2,2,2,2,11,4,1,1,1,,2,2,1,0,10,0,1,1,1,2,1,1,1,1,1,1,1,1,1,1,1,1,1,1,1,1,1,1,1,1,1,1,1,0,0,0,1,1,1,1,1,0,0,0,0,1,1,0,0,0,0,0,0,0,1,1,,,,,1,1,,,,,,,,,1,5,7,2,1,1,1,2,1,2,1,1,0,1,1,0,2,,,,2,2,2,,2,2,2,2,2,2,2,1,2,3,1,1,1,,2,2,2,2,1,1,1,Aguascalientes,1,UMF 8 Aguascalientes,953,1,1,1,7.33602114639799000000,2,11,7,,2,1,2009-11-17,1
144,1,UMF 8 Aguascalientes,1,17,11,9,13,40,14,5,55,1,2,1,4,3,5,1,99,1,1,2,2,4,4,5,2,1,5,5,3,3,2,4,2,2,1,1,1,,1,,1,0,30,0,1,3,,2,1,0,1,1,2,,2,2,2,1,4,1,1,2,1,1,1,1,1,1,1,1,1,1,0,0,1,1,1,1,1,0,0,0,0,0,1,0,0,0,0,0,0,0,2,2,,,,,,2,,,,,,,,,1,7,33,1,2,,,,,,,1,0,1,0,0,3,,,,4,4,,,2,4,4,4,2,2,4,1,1,,1,1,1,,2,1,2,2,2,1,1,Aguascalientes,1,UMF 8 Aguascalientes,953,1,1,1,6.00181385694341000000,4,2,13,,5,99,2009-11-17,1
151,1,UMF 8 Aguascalientes,1,17,11,9,18,15,18,50,54,1,2,1,5,3,5,1,1,1,1,2,1,1,1,2,2,1,2,2,2,1,2,1,65,1,1,2,,,,,1,0,30,0,1,1,1,1,1,0,1,1,1,,2,2,1,1,2,1,1,2,1,1,1,1,1,1,1,1,1,0,0,0,1,1,1,1,1,0,0,0,0,0,1,0,0,0,0,0,0,0,1,2,,,,,,2,,,,,,,,,2,,,1,2,,,,,,,1,1,1,0,0,2,4,4,4,3,3,,,4,4,4,4,4,3,3,1,2,3,1,1,1,,2,1,1,2,1,1,1,Aguascalientes,1,UMF 8 Aguascalientes,953,1,1,1,6.00181385694341000000,1,20,,,5,1,2009-11-17,1
33,1,UMF 8 Aguascalientes,1,17,11,9,10,6,10,30,41,1,2,1,6,3,1,1,1,1,1,1,1,5,4,5,2,2,2,4,1,1,2,4,1,2,1,1,1,,2,2,2,0,30,0,1,1,1,1,1,1,1,1,2,1,1,1,1,1,3,1,2,1,1,1,1,1,1,1,1,1,1,1,1,0,1,1,1,1,0,0,0,0,1,0,1,0,0,0,0,0,0,0,1,,,,,2,,2,,,,,,,,,2,,,1,1,1,4,1,1,2,1,1,0,0,1,0,2,,,,,,1,,2,4,2,2,99,1,2,1,2,1,4,3,1,,2,1,1,2,2,1,1,Aguascalientes,1,UMF 8 Aguascalientes,953,1,1,1,6.06437279195545000000,4,1,,,1,1,2009-11-17,1
40,1,UMF 8 Aguascalientes,1,17,11,9,14,33,15,1,18,2,1,1,5,4,6,1,1,2,1,1,1,1,2,2,1,1,1,5,3,1,2,2,65,6,1,2,,,,,1,0,15,0,1,2,1,2,1,0,1,0,2,,1,,1,2,,1,1,1,3,1,1,1,1,1,1,1,1,1,1,0,0,1,1,1,0,0,0,0,0,0,0,0,0,0,0,1,0,0,1,,,,,,,,,,,,1,,,,1,2,7,2,2,,,,,,,1,0,1,0,0,1,,,,2,2,,,2,2,2,2,2,2,2,2,,,,,1,,2,1,1,1,1,1,1,Aguascalientes,1,UMF 8 Aguascalientes,953,1,1,1,6.65642740320994000000,2,20,7,,6,1,2009-11-17,1
41,1,UMF 8 Aguascalientes,1,17,11,9,15,6,15,34,25,1,1,1,6,4,2,1,1,1,1,1,1,2,3,4,1,1,3,5,1,1,2,4,3,1,1,1,2,2,2,10,1,0,30,0,1,1,2,1,1,0,1,1,1,,1,1,1,1,2,1,1,1,1,1,1,1,1,1,1,1,1,1,1,0,1,1,1,1,1,0,0,0,0,0,1,0,0,0,0,0,0,0,1,1,,,,,,1,,,,,,,,,1,2,1,1,1,2,5,1,2,2,2,1,1,1,0,0,1,99,99,99,1,1,,,2,2,1,2,3,1,2,1,1,,1,2,1,,2,1,1,1,1,1,1,Aguascalientes,1,UMF 8 Aguascalientes,953,1,1,1,5.44581830246484000000,4,3,1,,2,1,2009-11-17,1
45,1,UMF 8 Aguascalientes,1,17,11,9,17,27,17,57,62,1,2,1,3,2,5,1,1,1,1,2,3,1,5,5,4,1,3,5,2,1,2,4,1,2,1,1,1,,2,2,2,0,20,0,1,4,,3,1,0,1,0,2,,2,,4,2,,99,1,1,1,1,1,1,1,1,1,1,1,0,0,0,0,0,1,0,1,0,0,0,0,0,1,0,0,0,0,0,0,0,,4,,,,,,1,,,,,,,,,1,1,8,99,1,2,2,1,1,2,1,1,0,1,0,0,2,,,,1,2,,,1,1,1,1,99,2,1,1,2,5,1,2,1,,2,1,1,2,2,1,1,Aguascalientes,1,UMF 8 Aguascalientes,953,1,1,1,5.08776494875856000000,4,1,8,,5,1,2009-11-17,1
115,1,UMF 10 Aguascalientes,3,18,11,9,9,35,9,57,45,1,2,1,5,3,5,1,1,1,1,1,1,1,2,1,1,1,1,1,3,3,1,4,2,2,1,2,,,,,1,0,5,0,1,1,1,1,1,0,1,1,2,,2,2,1,1,1,1,1,1,1,1,1,1,1,1,1,1,1,1,1,1,1,1,1,1,1,1,0,0,0,0,1,0,0,0,0,0,0,0,1,1,1,,,,,1,,,,,,,,,1,7,8,2,2,,,,,,,1,0,1,0,0,1,,,,1,1,,,1,1,1,1,1,2,2,1,1,,1,2,1,,2,1,1,1,1,3,1,Aguascalientes,1,UMF 10 Aguascalientes,938,1,1,1,6.29067120834711000000,4,2,8,,5,1,2009-11-18,1
120,1,UMF 10 Aguascalientes,3,18,11,9,12,13,12,36,33,2,2,1,4,3,3,2,,1,1,2,2,1,2,2,1,1,2,4,2,1,2,2,11,5,1,1,2,1,2,1,1,0,5,0,1,1,1,1,1,1,1,0,3,2,2,,1,1,2,1,1,1,1,1,1,1,1,1,1,1,1,1,1,0,0,0,1,1,0,1,0,0,1,1,1,0,1,0,0,0,0,0,1,,2,,,2,2,2,,1,,,,,,,1,1,1,2,2,,,,,,,1,1,1,1,1,1,1,1,1,1,1,1,1,1,1,1,1,1,1,1,1,1,,1,2,1,,2,1,2,1,1,3,1,Aguascalientes,1,UMF 10 Aguascalientes,938,1,1,1,7.76923768510677000000,2,11,1,,3,,2009-11-18,1
3,1,UMF 10 Aguascalientes,3,18,11,9,11,12,11,40,20,1,1,1,6,4,6,1,1,1,2,2,1,3,1,5,1,1,3,3,2,1,2,2,5,3,1,1,1,,2,13,1,0,40,0,1,3,,2,1,1,1,1,2,2,2,2,1,1,1,1,1,1,1,1,1,1,1,1,1,1,1,1,1,0,1,1,1,1,1,0,0,0,0,1,1,0,0,0,0,0,0,0,1,1,,,,,2,1,,,,,,,,,2,,,2,1,1,1,2,2,2,1,1,0,1,0,1,2,,,,1,1,,2,1,1,1,99,1,2,3,1,1,,1,2,1,,2,1,2,2,1,3,1,Aguascalientes,1,UMF 10 Aguascalientes,938,1,1,1,5.70791650953534000000,2,5,,,6,1,2009-11-18,1
5,1,UMF 10 Aguascalientes,3,18,11,9,12,30,12,54,34,1,2,1,4,2,5,1,1,1,1,1,1,1,1,5,1,1,3,5,2,2,2,1,50,6,1,2,,,,,1,1,30,0,1,1,1,3,0,0,1,1,,,1,1,1,2,,1,2,1,1,1,1,1,1,1,1,1,1,1,1,0,1,1,1,1,0,0,0,0,0,1,0,0,0,0,0,0,0,0,1,,,,,,1,,,,,,,,,,1,2,2,2,2,,,,,,,1,0,1,0,0,1,,,,1,1,,,1,1,1,1,1,1,1,1,1,,1,2,1,,2,1,2,1,1,3,1,Aguascalientes,1,UMF 10 Aguascalientes,938,1,1,1,6.35624100119395000000,1,21,2,,5,1,2009-11-18,1
21,1,UMF 10 Aguascalientes,3,18,11,9,13,0,13,30,27,2,1,1,6,5,6,1,1,1,1,1,99,2,4,4,1,2,4,4,2,1,2,3,146,2,1,1,1,,2,2,1,0,30,0,1,1,1,1,1,0,1,1,1,,2,2,1,2,,1,1,1,1,1,1,1,1,1,1,1,1,0,0,0,0,1,1,1,1,0,0,0,0,0,1,0,0,0,0,0,0,0,2,1,,,,,,2,,,,,,,,,1,2,68,2,1,2,3,1,2,2,1,1,0,1,0,0,2,,,,2,2,,,2,2,2,99,3,2,2,2,,,,,1,,2,1,2,1,1,3,1,Aguascalientes,1,UMF 10 Aguascalientes,938,1,1,1,6.97679021940721000000,3,21,12,,6,1,2009-11-18,1
27,1,UMF 10 Aguascalientes,3,18,11,9,17,45,18,5,27,1,2,1,5,99,5,2,,2,4,2,2,1,4,4,2,2,4,4,3,1,2,2,2,3,1,1,2,2,1,,1,0,25,0,1,1,1,3,1,0,1,0,3,,2,,2,1,2,2,1,3,1,1,1,1,1,1,1,1,1,0,0,0,1,1,2,1,1,1,0,0,0,0,1,0,0,0,0,0,0,0,2,2,1,,,,,2,,,,,,,,,2,,,99,1,4,4,1,2,2,1,1,0,1,0,0,2,,,,2,2,,,2,4,2,99,2,2,2,1,1,,1,1,1,,2,1,1,2,2,3,1,Aguascalientes,1,UMF 10 Aguascalientes,938,1,1,3,5.70791650953534000000,2,2,,,5,,2009-11-18,1
37,1,UMF 10 Aguascalientes,3,18,11,9,11,51,12,16,56,1,2,1,2,2,5,1,1,1,1,1,1,3,3,3,1,1,3,3,3,1,2,4,2,2,1,1,1,,1,,1,0,20,0,1,1,1,1,1,1,1,1,2,2,2,2,1,1,1,1,1,1,1,1,1,1,1,1,1,1,1,1,1,1,1,1,1,1,1,0,0,0,0,0,1,0,0,0,0,0,0,0,2,2,,,,,,2,,,,,,,,,1,2,1,2,1,2,2,1,2,2,1,1,1,1,0,1,2,2,99,4,3,3,,2,2,2,2,2,2,2,2,1,1,,1,2,1,,2,2,2,1,1,3,1,Aguascalientes,1,UMF 10 Aguascalientes,938,1,1,1,6.29067120834711000000,4,2,1,,5,1,2009-11-18,1
38,1,UMF 10 Aguascalientes,3,18,11,9,12,30,12,52,37,2,2,1,4,2,10,1,1,1,2,2,2,1,1,3,3,3,3,3,2,2,2,1,43,6,2,1,2,3,1,,2,1,0,0,1,1,1,1,1,0,1,1,2,,2,2,2,2,,2,1,1,1,1,1,1,1,1,1,1,1,1,1,0,0,0,1,1,1,0,0,0,0,0,1,0,0,0,0,0,0,0,2,2,,,,,,2,,,,,,,,,2,,,1,1,4,5,1,2,2,2,1,0,1,0,0,2,,,,2,2,,,2,2,2,3,4,3,3,1,1,,1,1,1,,2,1,2,3,3,3,1,Aguascalientes,1,UMF 10 Aguascalientes,938,1,1,1,7.76923768510677000000,1,21,,,10,1,2009-11-18,1
39,1,UMF 10 Aguascalientes,3,18,11,9,13,20,13,44,55,1,4,1,3,2,5,1,1,1,1,2,2,1,3,5,1,1,2,5,3,2,2,1,1,2,1,1,1,,1,,1,0,10,0,1,1,1,1,1,1,1,1,2,2,2,2,1,1,1,1,1,1,1,1,1,1,1,1,1,1,1,1,1,1,1,1,1,1,1,0,0,0,0,0,1,0,0,0,0,0,0,0,2,2,,,,,,2,,,,,,,,,1,2,7,2,1,4,2,1,2,2,1,1,0,1,1,0,2,,,,2,2,2,,2,2,2,2,2,1,1,1,1,,1,2,1,,2,1,1,1,1,3,1,Aguascalientes,1,UMF 10 Aguascalientes,938,1,1,1,6.29067120834711000000,1,1,7,,5,1,2009-11-18,1
42,1,UMF 10 Aguascalientes,3,18,11,9,15,35,15,58,41,1,2,1,3,2,5,1,1,1,1,1,2,4,1,4,1,1,3,3,3,3,2,4,13,2,1,1,1,,1,,1,0,10,0,1,1,1,1,1,0,1,1,2,,2,2,1,1,1,1,1,1,1,1,1,1,1,1,1,1,1,1,1,0,0,1,1,1,1,0,0,0,0,0,1,0,0,0,0,0,0,0,2,2,,,,,,2,,,,,,,,,1,4,9,2,2,,,,,,,1,1,1,0,0,2,4,99,99,2,99,,,3,2,2,2,2,1,1,1,1,,1,2,1,,2,1,2,1,1,3,1,Aguascalientes,1,UMF 10 Aguascalientes,938,1,1,1,6.35624100119395000000,4,13,9,,5,1,2009-11-18,1
45,1,UMF 10 Aguascalientes,3,18,11,9,17,22,17,47,50,1,2,1,3,3,5,1,1,1,1,1,1,2,3,3,1,1,4,5,2,1,2,4,1,2,1,1,1,,1,,1,0,30,0,1,1,1,1,1,1,1,1,2,2,2,2,1,1,1,1,1,1,1,1,1,1,1,1,1,1,1,1,1,0,1,1,1,1,1,0,0,0,1,0,1,0,0,0,0,0,0,0,2,2,,,,2,,2,,,,,,,,,1,5,7,2,1,3,3,1,1,2,2,1,1,1,1,0,2,3,3,4,2,99,2,,2,2,2,2,2,2,2,1,1,,1,1,1,,2,1,1,2,2,3,1,Aguascalientes,1,UMF 10 Aguascalientes,938,1,1,1,6.29067120834711000000,4,1,7,,5,1,2009-11-18,1
76,1,UMF 10 Aguascalientes,3,18,11,9,8,10,8,33,40,1,2,1,3,1,1,1,1,1,1,3,1,1,3,3,1,1,4,4,3,1,2,4,7,2,1,2,,,,,1,0,15,0,1,1,1,1,1,0,1,1,1,,1,1,1,1,3,1,1,1,1,1,1,1,1,1,1,1,1,1,1,1,1,1,1,1,1,0,0,0,0,0,1,0,0,0,0,0,0,0,1,1,,,,,,1,,,,,,,,,2,,,1,2,,,,,,,1,0,1,0,0,2,,,,2,2,,,2,2,2,2,2,1,1,1,1,,1,1,1,,2,1,1,1,1,3,1,Aguascalientes,1,UMF 10 Aguascalientes,938,1,1,1,6.35624100119395000000,4,7,,,1,1,2009-11-18,1
82,1,UMF 10 Aguascalientes,3,18,11,9,11,11,11,38,39,2,1,1,2,3,2,1,1,2,1,2,2,4,5,5,5,5,5,5,3,3,2,4,66,5,1,2,,,,,1,1,0,0,1,1,1,3,1,0,1,1,2,,2,2,1,1,1,1,1,1,1,1,1,1,1,1,1,1,1,1,1,1,1,1,99,1,1,0,0,0,0,0,1,0,0,0,0,0,0,0,2,2,,,,,,2,,,,,,,,,1,5,7,2,2,,,,,,,1,1,1,0,0,2,4,4,4,2,2,,,2,2,2,2,2,99,99,1,1,,1,2,2,99,2,1,1,3,3,3,1,Aguascalientes,1,UMF 10 Aguascalientes,938,1,1,1,7.76923768510677000000,4,21,7,99,2,1,2009-11-18,1
90,1,UMF 10 Aguascalientes,3,18,11,9,17,0,17,29,32,1,2,1,4,2,5,1,1,1,1,1,1,3,3,5,1,1,3,5,3,2,2,1,4,3,1,2,,,,,1,2,30,0,1,1,1,1,1,0,1,0,2,,2,,1,2,,1,1,1,1,1,1,1,1,1,1,1,1,1,1,0,1,1,1,1,1,0,0,0,0,0,1,0,0,0,0,0,0,0,2,2,,,,,,2,,,,,,,,,1,1,24,2,2,,,,,,,1,1,1,0,0,2,3,3,3,2,2,,,3,2,2,2,2,1,1,1,1,,1,2,1,,2,1,1,1,1,3,1,Aguascalientes,1,UMF 10 Aguascalientes,938,1,1,1,6.35624100119395000000,1,4,11,,5,1,2009-11-18,1
179,1,UMF 10 Aguascalientes,3,18,11,9,11,30,11,50,31,2,1,1,6,5,2,1,1,1,4,1,1,2,4,4,2,1,2,2,3,2,2,4,22,4,1,2,,,,,1,0,30,0,1,4,,3,0,0,1,1,,,1,4,2,1,4,1,1,1,1,1,1,1,2,1,2,1,2,0,0,0,0,1,1,1,1,0,0,0,0,0,1,0,0,0,0,0,0,0,1,2,,,,,,2,,,,,,,,,1,5,7,2,2,,,,,,,1,0,1,0,0,1,,,,1,1,,,2,2,2,2,2,2,2,1,1,,1,2,1,,2,2,2,2,2,3,1,Aguascalientes,1,UMF 10 Aguascalientes,938,1,1,3,7.76923768510677000000,4,21,7,,2,1,2009-11-18,1
180,1,UMF 10 Aguascalientes,3,18,11,9,11,55,12,19,36,2,2,1,4,3,2,1,2,1,1,1,1,1,4,5,1,5,5,5,3,3,2,4,22,2,1,1,1,,1,,1,0,20,0,1,1,1,1,1,1,1,1,1,1,1,1,1,1,1,1,1,1,1,1,1,1,1,1,1,1,1,1,1,1,1,1,1,1,1,0,0,0,0,0,1,0,0,0,0,0,0,0,2,2,,,,,,2,,,,,,,,,1,7,9,2,2,,,,,,,1,0,1,0,0,1,,,,1,1,,,2,2,2,2,2,1,2,1,1,,2,2,1,,2,1,1,1,1,3,1,Aguascalientes,1,UMF 10 Aguascalientes,938,1,1,1,7.76923768510677000000,4,21,9,,2,2,2009-11-18,1
181,1,UMF 10 Aguascalientes,3,18,11,9,12,29,12,50,46,1,3,1,2,99,5,1,1,1,3,2,2,1,1,2,2,1,2,2,2,2,2,4,53,4,1,1,1,,1,,1,0,15,0,1,1,1,3,0,0,1,1,,,1,1,1,2,,1,1,2,1,1,1,1,1,1,1,1,1,1,0,0,0,1,2,1,1,0,1,0,1,1,1,0,0,0,0,0,0,0,2,2,,2,,4,2,2,,,,,,,,,1,2,1,1,2,,,,,,,1,0,1,1,1,2,,,,2,2,2,2,2,2,2,5,2,2,99,1,1,,1,2,1,,2,1,1,2,3,3,1,Aguascalientes,1,UMF 10 Aguascalientes,938,1,1,2,6.29067120834711000000,4,21,1,,5,1,2009-11-18,1
186,1,UMF 10 Aguascalientes,3,18,11,9,16,47,17,10,37,1,1,1,6,4,7,1,1,1,1,2,2,1,4,4,1,1,4,4,1,1,2,4,2,2,1,1,1,,1,,1,0,2,0,1,1,1,1,1,0,1,1,1,,1,1,1,1,1,1,1,1,1,1,1,1,1,1,1,1,1,1,1,0,1,1,1,1,1,0,0,0,0,0,1,0,1,0,0,0,0,0,2,2,,,,,,1,,1,,,,,,,1,1,1,2,2,,,,,,,1,0,1,0,0,1,,,,2,1,,,2,3,2,2,2,2,2,1,1,,1,1,1,,2,2,2,1,1,3,1,Aguascalientes,1,UMF 10 Aguascalientes,938,1,1,1,6.35624100119395000000,4,2,1,,7,1,2009-11-18,1
67,1,UMF 10 Aguascalientes,3,18,11,9,17,58,18,19,49,1,2,1,3,1,5,1,1,2,1,2,1,1,1,3,1,1,5,5,3,1,2,4,2,2,4,2,,,,,1,3,0,0,1,1,1,1,1,0,1,1,1,,1,1,1,1,1,1,1,1,1,1,1,1,1,1,1,1,1,1,0,0,1,1,1,1,1,0,0,0,0,0,1,0,0,0,0,0,0,0,1,1,,,,,,1,,,,,,,,,1,7,8,2,1,2,1,1,3,2,1,1,0,1,0,0,1,,,,1,1,,,1,1,1,1,1,1,1,1,1,,1,1,1,,2,1,2,1,1,3,1,Aguascalientes,1,UMF 10 Aguascalientes,938,1,1,1,6.29067120834711000000,4,2,8,,5,1,2009-11-18,1
106,1,UMF 10 Aguascalientes,3,18,11,9,15,41,16,4,60,1,1,1,5,4,2,1,1,1,1,1,1,2,2,2,1,2,2,2,2,2,2,4,2,2,1,1,2,3,2,5,99,0,30,0,1,1,1,1,1,1,1,1,2,2,2,2,1,1,1,1,1,1,1,1,1,1,1,1,1,1,1,1,1,0,1,1,1,1,1,0,0,0,0,1,1,0,0,0,0,0,0,0,2,1,,,,,1,2,,,,,,,,,1,5,3,99,1,1,2,1,1,99,1,1,0,1,0,1,4,,,,3,3,,4,4,4,4,4,4,1,1,1,2,3,1,1,1,,2,2,2,1,1,3,1,Aguascalientes,1,UMF 10 Aguascalientes,938,1,1,1,6.29067120834711000000,4,2,3,,2,1,2009-11-18,1
107,1,UMF 10 Aguascalientes,3,18,11,9,16,10,16,31,48,2,2,1,1,2,4,2,,2,2,2,2,5,5,5,3,1,4,4,2,2,2,1,4,6,1,2,,,,,2,0,30,0,1,1,1,1,1,1,1,1,2,2,2,2,1,2,,99,1,1,1,1,1,1,1,1,1,1,99,1,1,1,1,1,1,1,1,0,0,0,0,0,1,0,0,0,0,0,0,0,2,2,,,,,,2,,,,,,,,,1,5,7,1,1,2,1,1,2,2,2,1,1,1,0,0,3,3,3,3,3,3,,,3,3,3,3,3,2,2,1,1,,1,1,1,,2,1,1,2,1,3,1,Aguascalientes,1,UMF 10 Aguascalientes,938,1,1,1,7.68909168285565000000,1,4,7,,4,,2009-11-18,1
155,1,UMF 10 Aguascalientes,3,18,11,9,8,40,9,5,54,1,2,1,4,3,10,1,1,1,1,1,1,4,2,5,1,1,2,5,3,2,2,3,1,1,1,2,,,,,1,0,30,0,1,1,1,1,1,1,1,0,2,1,2,,1,1,99,1,1,2,5,1,1,1,1,1,1,1,1,1,1,1,1,1,1,1,1,0,0,0,0,0,1,0,0,0,0,0,0,0,1,1,,,,,,1,,,,,,,,,1,1,8,2,1,1,1,1,2,2,1,1,0,1,0,1,2,,,,2,2,,2,2,2,3,2,2,1,1,1,1,,1,1,1,,2,1,1,1,1,3,1,Aguascalientes,1,UMF 10 Aguascalientes,938,1,1,1,6.29067120834711000000,3,1,8,,10,1,2009-11-18,1
158,1,UMF 10 Aguascalientes,3,18,11,9,10,20,10,45,30,2,2,1,4,3,4,1,1,2,1,3,3,1,4,4,2,1,5,5,3,3,2,3,22,3,2,1,1,,1,,1,2,0,0,1,1,1,1,1,1,1,0,2,2,2,,2,1,1,1,1,1,1,1,1,1,1,1,1,1,1,1,1,0,0,1,1,1,1,0,0,0,0,0,1,0,0,0,0,0,0,0,2,2,,,,,,2,,,,,,,,,1,5,7,1,1,3,5,1,4,2,5,1,0,1,1,0,2,,,,2,2,2,,2,2,2,2,2,2,2,1,1,,1,1,1,,2,1,1,2,1,3,1,Aguascalientes,1,UMF 10 Aguascalientes,938,1,1,1,7.76923768510677000000,3,21,7,,4,1,2009-11-18,1
160,1,UMF 10 Aguascalientes,3,18,11,9,11,30,12,0,59,2,2,1,3,2,1,1,2,1,1,3,1,2,4,5,1,3,4,5,3,3,2,3,14,1,1,1,1,,1,,1,0,1,0,1,1,1,1,0,0,1,1,,,1,1,1,1,2,2,2,2,1,1,1,1,1,1,1,1,1,1,1,0,1,1,1,1,1,0,0,0,0,0,1,0,0,0,0,0,0,0,2,2,,,,,,2,,,,,,,,,1,5,7,2,1,2,1,1,2,2,1,1,0,1,0,0,2,,,,2,2,,,2,2,2,2,2,5,2,1,1,,1,2,1,,2,1,1,1,1,3,1,Aguascalientes,1,UMF 10 Aguascalientes,938,1,1,1,7.68909168285565000000,3,14,7,,1,2,2009-11-18,1
163,1,UMF 10 Aguascalientes,3,18,11,9,13,25,13,58,41,2,2,1,5,3,4,1,1,1,1,1,1,4,2,4,2,1,4,3,3,2,2,4,5,1,1,1,1,,1,,1,0,15,0,1,1,2,1,1,1,1,1,2,2,2,2,1,1,1,1,1,1,1,1,1,1,1,1,1,1,1,1,1,1,1,1,1,1,1,0,0,0,0,0,1,0,0,0,0,0,0,0,2,2,,,,,,2,,,,,,,,,2,,,2,1,1,2,1,2,2,2,1,0,1,1,0,2,,,,2,2,2,,2,2,2,2,2,2,1,2,,,,,1,,2,1,1,2,1,3,1,Aguascalientes,1,UMF 10 Aguascalientes,938,1,1,1,7.76923768510677000000,4,5,,,4,1,2009-11-18,1