Folio,Deleg,Id_Unid,Unidmed,Fecha_D,Fecha_M,Fecha_A,Hr_Ini_H,Hr_Ini_M,Hr_Fin_H,Hr_Fin_M,Cve_Sup,Cve_Enc,Servatn,Sat1,Sat3,Probsal,Probsal_G,Lact1,Citapre,Comocita,Diascita,Hrcita,Tmedreg2,Prevasis_A,Prevasis_B,Durasis_A,Durasis_B,Tratocom_A,Tratocom_B,Tratocom_C,Tratocom_D,Tratocom_E,Tratocom_F,Preosad,Tratocomf,Preven3,Preven4,Preven1,Filtrosaux1,Temsad1,Filtrosaux2,Temsad2,Filtrofarm2,Comfarm,Tfarsurt,Totmed,Btratouf,Satmed,Resurt1,Resurt3,Btratou,Trato1,Tratom,Trato2m,Trato3m,Tratop,Trato2p,Trato3p,Limp1,Limp2,Limp3,Recomej_A,Recomej_B,Recomej_C,Calif,Recomuni,Sugeren,Turno,Tipodhu,Edad,Sexo,Escolar,Ingreso,Promedio_Diario2013,Est_Var,Code_Upm,Nivel,Fe_Finalnr,Fecha,Entidad
101465,1,2,UMF 1 Aguascalientes,2,10,2014,12,35,12,57,101,48001,1,2,2,4,1,,1,2,2,1,1,1,1,1,1,1,1,1,1,1,1,1,2,3,,2,1,4,2,,1,1,1,2,1,2,2,,2,10,2,1,1,996,,,2,2,2,11,,,8,1,996,1,5,60,1,1,99,1324,11,2,1,17.63776452653690000000,2014-10-02,1
101466,1,2,UMF 1 Aguascalientes,2,10,2014,12,26,12,33,101,48005,1,2,3,27,1,,1,1,,1,1,1,1,2,2,1,2,2,2,2,1,1,2,3,,1,1,3,2,,1,1,1,1,2,2,2,,2,7,2,1,1,1,2,2,4,2,2,1,6,,7,2,996,1,1,58,1,3,2,1324,11,2,1,17.63776452653690000000,2014-10-02,1
101467,1,2,UMF 1 Aguascalientes,2,10,2014,12,57,13,2,101,48001,2,2,2,4,1,,1,1,,1,1,1,1,1,1,1,1,1,1,1,1,1,2,3,,2,2,,2,,1,1,1,1,1,1,2,,2,10,2,1,1,996,,,2,2,2,11,,,10,1,996,1,1,55,1,3,2,1324,11,2,1,17.63776452653690000000,2014-10-02,1
101470,1,2,UMF 1 Aguascalientes,2,10,2014,12,5,12,10,101,48003,1,2,2,26,7,,1,3,2,4,3,1,2,1,2,1,2,1,1,1,1,1,2,3,,2,2,,2,,1,1,1,1,2,2,2,,2,8,2,1,1,996,,,6,,2,4,3,,8,1,996,1,5,32,1,5,99,1324,11,2,1,18.21985513968660000000,2014-10-02,1
101473,1,2,UMF 1 Aguascalientes,2,10,2014,12,23,12,29,101,48003,1,2,2,1,5,2,1,3,3,1,1,1,2,1,1,1,1,1,1,1,99,1,2,3,,2,2,,1,4,1,1,1,1,2,2,2,,2,9,996,,,996,,,6,,2,11,,,9,1,996,1,1,34,1,5,3,1324,11,2,1,18.21985513968660000000,2014-10-02,1
101477,1,2,UMF 1 Aguascalientes,26,9,2014,8,28,8,40,101,48001,1,2,2,9,1,,1,2,2,1,1,1,1,1,1,1,1,1,1,1,1,1,2,3,,1,2,,2,,1,1,1,1,2,2,2,,2,10,2,1,1,996,,,2,2,2,11,,,10,1,996,1,1,42,1,6,2,1324,11,2,1,18.52694274878500000000,2014-09-26,1
101480,1,2,UMF 1 Aguascalientes,26,9,2014,8,40,8,50,101,48001,1,2,2,26,7,,2,,,,1,1,1,1,1,1,1,1,1,1,1,1,2,3,,1,2,,2,,1,1,1,1,1,2,2,,2,9,2,1,1,996,,,6,,2,11,,,8,1,996,1,1,37,1,5,2,1324,11,2,1,18.52694274878500000000,2014-09-26,1
101483,1,2,UMF 1 Aguascalientes,26,9,2014,14,23,14,43,101,48005,1,4,4,27,1,,1,1,,3,2,1,1,1,1,1,2,1,1,1,2,1,2,3,,1,2,,2,,1,1,2,1,2,2,2,,2,9,2,1,1,996,,,6,,2,10,1,2,8,2,996,1,2,75,2,3,3,1324,11,2,1,17.59663126113620000000,2014-09-26,1
101484,1,2,UMF 1 Aguascalientes,26,9,2014,8,50,9,5,101,48001,1,2,2,4,1,,2,,,,2,1,1,1,1,1,1,1,1,1,1,1,2,3,,2,2,,2,,1,1,1,1,2,2,2,,2,10,2,1,1,1,2,2,2,1,2,1,1,6,8,1,1,1,1,52,1,3,3,1324,11,2,1,18.11329782995410000000,2014-09-26,1
101488,1,2,UMF 1 Aguascalientes,26,9,2014,14,43,14,53,101,48005,1,2,2,18,4,,2,,,,2,1,1,2,1,1,1,2,1,1,2,1,2,3,,1,2,,2,,1,1,1,1,2,2,2,,2,10,2,1,2,996,,,5,2,3,4,6,7,6,1,996,2,1,38,2,5,4,1324,11,2,1,19.14220673916310000000,2014-09-26,1
101493,1,2,UMF 1 Aguascalientes,26,9,2014,14,53,15,2,101,48005,1,2,2,30,1,,2,,,,4,1,1,1,1,1,2,1,1,1,1,1,2,3,,1,2,,2,,1,1,1,1,2,2,2,,2,8,1,1,1,996,,,5,2,2,998,11,,7,2,996,1,1,25,1,3,2,1324,11,2,1,17.52683581305740000000,2014-09-26,1
101494,1,2,UMF 1 Aguascalientes,26,9,2014,9,17,9,25,101,48001,1,2,2,23,1,,1,2,2,1,1,1,1,1,1,1,1,1,1,1,1,1,2,3,,1,2,,2,,1,1,1,1,1,1,2,,2,9,2,1,1,996,,,2,1,2,11,,,9,1,996,1,1,24,1,7,2,1324,11,2,1,17.52683581305740000000,2014-09-26,1
101540,1,2,UMF 1 Aguascalientes,26,9,2014,9,26,9,43,101,48001,1,2,2,39,6,,1,1,,1,1,1,1,1,1,1,2,1,1,1,1,1,2,3,,1,1,99,2,,1,1,1,1,2,2,2,,2,10,16,1,1,996,,,6,,2,11,,,9,1,996,1,5,60,1,7,99,1324,11,2,1,17.63776452653690000000,2014-09-26,1
101545,1,2,UMF 1 Aguascalientes,26,9,2014,9,45,10,13,101,48001,1,2,2,4,1,,1,1,,1,2,1,1,1,1,1,97,1,1,1,1,1,2,3,,2,1,3,2,,1,1,1,1,4,2,2,,2,9,2,1,1,9,2,2,6,,2,1,2,6,9,1,996,1,6,58,1,5,99,1324,11,2,1,17.63776452653690000000,2014-09-26,1
101557,1,2,UMF 1 Aguascalientes,26,9,2014,9,36,9,48,101,48003,1,3,2,26,7,,1,1,,1,1,1,2,2,2,1,2,1,1,1,1,1,2,3,,1,1,4,2,,1,2,1,1,2,2,2,,1,9,2,1,1,9,2,2,6,,3,1,11,,9,1,996,1,5,47,1,5,3,1324,11,2,1,18.11329782995410000000,2014-09-26,1
101559,1,2,UMF 1 Aguascalientes,26,9,2014,16,11,16,16,101,48005,1,2,2,20,4,,1,3,2,1,1,1,1,2,1,1,1,1,1,1,1,1,2,3,,1,1,3,2,,1,1,1,1,2,2,2,,2,8,2,1,1,996,,,2,1,2,11,,,9,2,996,2,1,24,1,7,3,1324,11,2,1,17.52683581305740000000,2014-09-26,1
101564,1,2,UMF 1 Aguascalientes,26,9,2014,16,16,16,29,101,48005,1,2,2,8,1,,2,,,,3,1,1,2,2,1,1,1,1,1,1,1,2,3,,1,2,,1,1,1,1,1,1,2,2,2,,2,9,2,1,1,9,2,2,4,1,2,11,,,8,2,996,2,1,35,1,5,3,1324,11,2,1,18.52694274878500000000,2014-09-26,1
101565,1,2,UMF 1 Aguascalientes,26,9,2014,10,44,10,56,101,48001,1,3,2,27,1,,1,2,4,1,1,1,2,2,1,1,2,1,2,2,2,2,2,3,,2,1,4,2,,1,1,1,1,2,3,2,,2,8,16,1,1,996,,,4,2,3,1,6,4,7,2,996,1,5,40,1,7,1,1324,11,2,1,18.52694274878500000000,2014-09-26,1
101571,1,2,UMF 1 Aguascalientes,26,9,2014,9,52,9,57,101,48002,1,2,2,4,1,,1,1,,1,1,1,2,2,1,1,1,1,1,1,1,1,2,3,,1,2,,1,1,1,1,2,1,2,2,2,,2,9,16,1,1,996,,,6,,2,11,,,9,1,996,1,5,53,1,1,3,1324,11,2,1,18.11329782995410000000,2014-09-26,1
101572,1,2,UMF 1 Aguascalientes,26,9,2014,10,12,10,19,101,48003,1,3,3,1,5,1,1,2,4,3,2,1,2,2,1,1,2,1,1,1,1,1,2,3,,1,1,2,2,,1,1,1,1,2,3,2,,2,8,2,1,1,1,2,2,6,,2,1,8,3,8,2,996,1,5,31,1,9,3,1324,11,2,1,18.21985513968660000000,2014-09-26,1
101577,1,2,UMF 1 Aguascalientes,26,9,2014,10,27,10,33,101,48003,1,2,2,6,4,,2,,,,1,1,1,2,2,1,1,1,1,1,2,1,2,3,,2,2,,2,,1,1,1,1,2,1,2,,1,10,2,1,2,996,,,2,2,3,11,,,10,1,996,1,5,19,1,7,3,1324,11,2,1,17.52683581305740000000,2014-09-26,1
101579,1,2,UMF 1 Aguascalientes,26,9,2014,17,9,17,18,101,48005,1,2,2,4,1,,1,1,,1,4,1,1,1,1,1,2,2,2,2,2,2,1,3,,1,2,,2,,1,2,1,2,2,3,2,,3,6,3,1,1,2,2,2,1,2,1,1,3,2,7,2,996,2,5,40,1,3,3,1324,11,2,1,18.52694274878500000000,2014-09-26,1
101581,1,2,UMF 1 Aguascalientes,26,9,2014,10,5,10,14,101,48002,1,2,2,27,1,,1,2,3,3,1,1,1,2,1,1,1,1,1,1,1,1,1,3,,2,1,2,2,,1,1,2,2,2,2,2,,2,10,1,1,1,996,,,6,,2,11,,,7,2,998,1,2,65,2,3,3,1324,11,2,1,17.59663126113620000000,2014-09-26,1
101585,1,2,UMF 1 Aguascalientes,26,9,2014,11,23,12,10,101,48001,1,2,2,27,1,,1,3,2,1,1,1,2,2,1,1,1,1,1,1,1,1,2,3,,1,2,,1,3,1,1,1,1,1,2,2,,2,9,16,1,1,996,,,6,,2,11,,,9,1,996,1,5,53,1,3,99,1324,11,2,1,18.11329782995410000000,2014-09-26,1
101587,1,2,UMF 1 Aguascalientes,26,9,2014,11,21,11,31,101,48003,1,2,1,18,4,,1,2,4,1,1,1,2,2,1,1,1,1,1,1,1,1,2,3,,2,1,2,1,2,1,1,1,1,2,2,2,,2,9,2,1,1,996,,,2,1,99,11,,,10,1,996,1,5,43,1,5,3,1324,11,2,1,18.52694274878500000000,2014-09-26,1
101588,1,2,UMF 1 Aguascalientes,26,9,2014,17,30,17,48,101,48004,1,4,4,4,1,,1,3,99,3,3,1,2,2,1,1,2,2,1,1,1,2,2,3,,2,1,5,2,,1,1,2,2,5,5,2,,3,7,996,,,9,2,2,3,2,3,1,3,8,5,4,996,2,2,68,2,2,99,1324,11,2,1,17.59663126113620000000,2014-09-26,1
101589,1,2,UMF 1 Aguascalientes,26,9,2014,17,53,18,12,101,48005,1,2,2,4,1,,1,1,,4,3,1,2,2,2,1,1,2,2,2,1,2,2,3,,1,2,,2,,1,1,1,1,2,2,2,,2,9,2,1,1,996,,,6,,2,1,6,,7,2,996,2,2,47,1,5,3,1324,11,2,1,18.11329782995410000000,2014-09-26,1
101594,1,2,UMF 1 Aguascalientes,26,9,2014,18,12,18,24,101,48005,1,2,2,27,1,,1,1,,1,1,1,2,2,2,1,2,1,1,1,1,1,2,3,,1,1,4,2,,1,1,1,1,2,2,2,,2,7,2,1,1,996,,,3,1,2,11,,,8,1,996,2,2,63,2,3,3,1324,11,2,1,18.07523648727020000000,2014-09-26,1
101597,1,2,UMF 1 Aguascalientes,26,9,2014,11,46,11,59,101,48003,1,2,2,8,1,,1,2,3,3,3,1,2,1,1,1,2,1,1,1,1,1,2,3,,1,2,,2,,1,1,1,1,2,2,2,,2,9,996,,,996,,,6,,2,5,6,,7,2,2,1,5,45,1,7,4,1324,11,2,1,18.11329782995410000000,2014-09-26,1
101601,1,2,UMF 1 Aguascalientes,26,9,2014,11,9,11,16,101,48002,1,2,2,19,7,,1,3,2,1,1,1,1,2,1,1,1,1,1,1,1,1,2,3,,1,2,,2,,1,1,1,1,3,3,2,,2,8,2,1,1,996,,,6,,2,9,8,3,9,2,996,1,1,37,2,7,5,1324,11,2,1,19.14220673916310000000,2014-09-26,1
101606,1,2,UMF 1 Aguascalientes,26,9,2014,11,23,11,32,101,48002,1,2,2,48,1,,1,2,2,1,1,1,2,2,1,1,1,1,2,2,1,1,1,3,,1,1,6,2,,1,1,1,1,2,2,2,,2,10,16,1,1,2,2,1,6,,2,8,3,9,10,2,996,1,5,37,1,5,5,1324,11,2,1,18.52694274878500000000,2014-09-26,1
101608,1,2,UMF 1 Aguascalientes,26,9,2014,18,24,18,43,101,48004,1,2,2,14,2,,1,3,2,1,4,1,1,2,2,1,1,1,1,1,1,1,2,3,,1,2,,2,,1,1,5,1,4,4,2,,2,7,16,1,1,996,,,6,,2,1,10,,7,1,996,2,1,59,2,3,1,1324,11,2,1,18.07523648727020000000,2014-09-26,1
101609,1,2,UMF 1 Aguascalientes,26,9,2014,19,15,19,31,101,48005,1,5,5,9,1,,1,1,,1,1,1,1,2,1,1,2,1,1,2,1,2,2,3,,1,1,4,2,,1,1,3,2,2,2,2,,2,2,1,1,1,996,,,5,2,2,1,2,4,0,4,998,2,1,47,1,9,4,1324,11,2,1,18.11329782995410000000,2014-09-26,1
101615,1,2,UMF 1 Aguascalientes,26,9,2014,13,1,13,14,101,48001,1,1,1,9,1,,1,3,2,1,1,1,1,1,1,1,1,1,1,1,1,1,2,3,,1,2,,2,,1,1,1,1,2,1,1,2,2,10,16,1,1,996,,,6,,2,11,,,9,1,5,1,5,54,1,7,5,1324,11,2,1,18.11329782995410000000,2014-09-26,1
101618,1,2,UMF 1 Aguascalientes,26,9,2014,18,45,18,57,101,48004,1,2,2,998,998,,1,2,3,1,1,1,1,2,2,1,1,1,1,1,1,1,2,3,,1,2,,2,,1,1,2,1,2,2,2,,2,7,1,1,1,998,2,2,5,2,2,4,1,6,8,2,998,2,5,29,1,5,99,1324,11,2,1,18.21985513968660000000,2014-09-26,1
101619,1,2,UMF 1 Aguascalientes,26,9,2014,19,35,19,48,101,48005,1,2,2,27,1,,1,1,,4,1,1,1,2,1,1,1,1,1,1,1,1,2,3,,1,1,3,2,,1,1,2,1,1,2,2,,1,10,2,1,1,996,,,6,,2,8,3,,9,2,996,2,2,83,1,5,2,1324,11,2,1,17.36993659782270000000,2014-09-26,1
101620,1,2,UMF 1 Aguascalientes,26,9,2014,13,17,13,28,101,48001,1,3,3,23,1,,2,,,,3,1,1,1,1,1,1,1,1,1,1,1,2,3,,2,2,,2,,2,,,,,,2,,2,6,2,1,1,9,1,1,2,2,2,11,,,8,2,996,1,1,22,1,6,2,1324,11,2,1,17.52683581305740000000,2014-09-26,1
101622,1,2,UMF 1 Aguascalientes,26,9,2014,14,5,14,14,101,48003,1,2,2,1,5,1,1,1,,1,1,1,2,1,1,1,1,1,1,1,1,1,2,3,,1,1,2,1,2,1,1,2,1,2,3,2,,2,9,996,,,996,,,6,,2,11,,,8,2,996,2,5,21,1,7,3,1324,11,2,1,17.52683581305740000000,2014-09-26,1
101628,1,2,UMF 1 Aguascalientes,26,9,2014,19,10,19,32,101,48004,1,2,2,3,1,,1,3,3,4,2,1,1,2,1,1,1,1,1,1,1,2,2,3,,1,2,,2,,1,1,1,2,2,2,2,,1,10,2,1,1,996,,,2,1,1,2,11,,10,1,996,2,2,66,2,3,3,1324,11,2,1,17.59663126113620000000,2014-09-26,1
101630,1,2,UMF 1 Aguascalientes,26,9,2014,13,29,13,46,101,48001,1,2,2,1,5,1,1,2,2,1,1,1,2,2,1,1,1,1,1,1,1,1,1,3,,1,1,2,2,,1,1,1,1,2,2,2,,1,10,2,1,1,996,,,6,,2,11,,,9,1,996,1,5,24,1,5,2,1324,11,2,1,17.52683581305740000000,2014-09-26,1
101634,1,2,UMF 1 Aguascalientes,26,9,2014,14,0,14,13,101,48005,1,3,3,18,4,,1,3,3,4,2,1,2,2,2,1,1,2,2,2,2,1,2,3,,1,2,,2,,1,1,1,1,2,2,2,,4,6,2,1,1,1,2,2,3,2,3,1,2,9,7,2,996,2,5,26,1,6,2,1324,11,2,1,18.21985513968660000000,2014-09-26,1
101637,1,2,UMF 1 Aguascalientes,26,9,2014,13,40,13,51,101,48003,1,2,2,4,1,,1,3,3,1,1,1,2,2,1,1,2,1,2,1,2,2,2,3,,2,2,,2,,1,2,1,1,2,2,1,1,2,9,16,1,1,996,,,6,,2,8,11,,9,1,996,1,5,60,1,3,99,1324,11,2,1,17.63776452653690000000,2014-09-26,1
101638,1,2,UMF 1 Aguascalientes,26,9,2014,19,47,19,59,101,48004,1,2,2,27,1,,1,3,2,3,2,1,1,1,1,1,2,1,1,1,2,1,1,3,,2,2,,2,,1,2,2,1,2,2,2,,2,8,996,,,2,2,2,4,2,2,1,1,,8,2,996,2,1,45,2,5,3,1324,11,2,1,18.75892154827240000000,2014-09-26,1
101639,1,2,UMF 1 Aguascalientes,26,9,2014,14,1,14,21,101,48001,1,2,2,22,1,,1,2,2,1,1,1,1,2,1,1,1,1,1,2,1,1,2,3,,1,1,2,1,7,1,1,1,1,2,2,1,1,2,10,16,1,1,996,,,6,,2,1,1,6,10,1,996,1,5,53,1,3,99,1324,11,2,1,18.11329782995410000000,2014-09-26,1
101642,1,2,UMF 1 Aguascalientes,26,9,2014,11,32,11,43,101,48004,1,1,1,10,3,,1,4,1,3,2,1,1,1,1,1,1,1,1,1,1,1,2,3,,1,2,,2,,1,1,1,1,1,1,1,1,1,10,2,1,1,996,,,1,1,2,11,,,10,1,996,2,2,64,1,5,3,1324,11,2,1,17.63776452653690000000,2014-09-26,1
1011131,1,2,UMF 1 Aguascalientes,2,10,2014,11,34,11,42,101,48005,1,2,2,4,1,,1,3,2,1,1,1,1,1,1,1,1,1,1,1,1,1,2,3,,1,2,,2,,1,1,2,1,2,2,2,,1,9,1,1,1,996,,,3,2,2,11,,,9,2,996,1,1,54,2,5,4,1324,11,2,1,18.75892154827240000000,2014-10-02,1
1011132,1,2,UMF 1 Aguascalientes,2,10,2014,12,46,12,56,101,48003,1,1,1,4,1,,1,2,3,4,3,1,2,1,1,1,2,1,1,1,1,1,2,3,,1,1,7,1,1,1,1,1,1,3,1,2,,1,10,2,1,1,996,,,6,,2,10,11,,10,1,996,1,2,67,1,7,3,1324,11,2,1,17.36993659782270000000,2014-10-02,1
1011136,1,2,UMF 1 Aguascalientes,2,10,2014,12,31,12,40,101,48004,1,1,1,4,1,,1,3,3,1,1,1,1,2,1,1,1,1,1,1,1,1,2,3,,1,1,3,1,2,1,1,1,2,1,2,2,,1,10,16,1,1,996,,,6,,2,998,,,10,1,996,1,2,68,2,3,5,1324,11,2,1,17.59663126113620000000,2014-10-02,1
1011137,1,2,UMF 1 Aguascalientes,2,10,2014,12,42,12,49,101,48004,1,2,2,7,3,,2,,,,1,1,1,2,1,1,1,1,1,2,1,1,2,3,,1,2,,2,,1,1,1,1,1,2,2,,1,10,1,1,1,996,,,6,,2,11,,,9,2,996,1,1,24,2,9,5,1324,11,2,1,18.09998777841760000000,2014-10-02,1
1011138,1,2,UMF 1 Aguascalientes,2,10,2014,13,5,13,12,101,48004,1,1,1,4,1,,1,1,,1,1,1,2,2,2,1,2,1,1,1,2,1,1,3,,1,1,6,2,,1,1,1,1,2,2,2,,2,10,1,1,2,996,,,6,,2,3,8,,10,1,996,1,1,60,1,2,99,1324,11,2,1,17.63776452653690000000,2014-10-02,1
1011139,1,2,UMF 1 Aguascalientes,2,10,2014,13,27,13,38,101,48004,1,1,2,10,3,,1,2,4,1,2,2,2,2,1,1,2,1,1,1,2,1,1,3,,2,2,,2,,1,2,1,2,1,4,2,,2,10,2,1,1,996,,,6,,2,2,11,1,8,1,996,1,5,78,1,2,99,1324,11,2,1,17.36993659782270000000,2014-10-02,1
1011143,1,2,UMF 1 Aguascalientes,2,10,2014,12,58,13,4,101,48002,1,3,3,39,6,,1,2,2,1,1,1,2,2,2,1,2,1,1,1,2,1,2,3,,2,2,,2,,1,2,2,2,2,3,2,,2,8,1,1,1,996,,,6,,2,11,,,9,2,996,1,1,57,2,3,3,1324,11,2,1,18.07523648727020000000,2014-10-02,1
1011145,1,2,UMF 1 Aguascalientes,2,10,2014,13,20,13,25,101,48002,1,2,2,4,1,,1,1,,1,1,1,1,1,1,1,1,1,1,1,1,1,2,3,,1,2,,2,,1,1,1,1,1,1,2,,2,10,3,1,1,996,,,6,,2,11,,,10,1,996,1,2,70,1,5,4,1324,11,2,1,17.36993659782270000000,2014-10-02,1
1011173,1,2,UMF 1 Aguascalientes,29,9,2014,9,57,10,2,101,48002,1,1,1,17,1,,1,1,,1,1,1,1,1,1,1,1,1,1,1,1,1,2,3,,1,2,,2,,1,1,1,1,1,2,2,,2,9,2,1,1,996,,,2,1,2,11,,,9,1,996,1,5,29,1,5,4,1324,11,2,1,18.21985513968660000000,2014-09-29,1
101471,1,2,UMF 1 Aguascalientes,2,10,2014,12,46,12,55,101,48005,1,3,3,27,1,,1,2,2,3,1,1,1,2,1,1,1,2,1,2,1,1,2,2,1,1,2,,2,,1,1,1,1,1,1,2,,2,8,2,1,1,996,,,6,,3,1,10,9,7,2,1,1,2,52,1,7,1,1324,11,2,1,18.11329782995410000000,2014-10-02,1
101492,1,2,UMF 1 Aguascalientes,26,9,2014,14,39,14,49,101,48004,1,1,1,39,6,,2,,,,1,1,1,1,2,1,1,1,1,1,97,1,2,2,1,2,2,,2,,1,1,1,1,2,2,2,,2,10,1,1,2,996,,,6,,2,11,,,9,2,996,2,5,25,1,4,99,1324,11,2,1,17.52683581305740000000,2014-09-26,1
101554,1,2,UMF 1 Aguascalientes,26,9,2014,16,1,16,11,101,48005,1,1,2,18,4,,2,,,,5,1,1,1,1,1,1,1,1,1,1,1,2,2,1,1,2,,1,1,1,1,1,1,2,2,2,,1,10,2,1,1,996,,,6,,2,11,,,10,1,996,2,5,41,1,5,99,1324,11,2,1,18.52694274878500000000,2014-09-26,1
101558,1,2,UMF 1 Aguascalientes,26,9,2014,16,7,16,30,101,48004,1,3,4,4,1,,1,3,2,3,1,1,1,2,2,1,1,1,1,1,1,1,2,2,1,1,2,,2,,1,2,2,1,1,1,1,2,2,8,1,2,1,3,2,2,1,2,2,8,2,4,8,3,996,2,2,60,2,3,2,1324,11,2,1,18.07523648727020000000,2014-09-26,1
101561,1,2,UMF 1 Aguascalientes,26,9,2014,9,11,9,19,101,48002,1,2,1,27,1,,1,3,5,1,1,1,1,2,1,1,1,1,1,1,1,1,2,2,1,1,2,,2,,1,1,1,1,2,3,2,,2,9,2,1,1,9,2,2,6,,3,6,3,1,8,1,996,1,5,37,1,5,4,1324,11,2,1,18.52694274878500000000,2014-09-26,1
101603,1,2,UMF 1 Aguascalientes,26,9,2014,18,14,18,24,101,48004,1,2,2,4,1,,1,3,2,1,1,1,1,1,1,1,1,1,1,1,1,1,2,2,1,1,1,3,1,3,1,1,1,1,2,1,2,,1,9,2,1,1,996,,,6,,2,11,,,9,1,996,2,1,53,2,7,5,1324,11,2,1,18.75892154827240000000,2014-09-26,1
101542,1,2,UMF 1 Aguascalientes,26,9,2014,9,11,9,22,101,48003,1,2,2,27,1,,2,,,,3,1,1,2,1,1,1,1,1,1,1,1,2,2,2,2,1,4,2,,1,1,1,1,1,2,1,1,2,10,2,1,1,1,1,99,6,,4,1,6,,5,2,996,1,1,63,1,2,3,1324,11,2,1,17.63776452653690000000,2014-09-26,1
101567,1,2,UMF 1 Aguascalientes,26,9,2014,10,5,10,11,101,48003,1,2,2,6,4,,2,,,,3,1,1,2,2,1,1,1,1,1,1,1,1,2,2,1,2,,2,,1,1,1,1,2,2,2,,2,8,2,1,1,996,,,6,,2,11,,,8,2,996,1,5,45,1,7,4,1324,11,2,1,18.11329782995410000000,2014-09-26,1
101598,1,2,UMF 1 Aguascalientes,26,9,2014,17,58,18,14,101,48004,1,4,5,4,1,,1,2,2,3,2,2,2,2,2,1,97,2,2,2,2,2,2,1,2,1,1,2,2,,2,,,,,,2,,1,7,1,1,1,996,,,4,2,2,10,8,1,7,4,996,2,1,34,1,6,3,1324,11,2,1,18.21985513968660000000,2014-09-26,1
101604,1,2,UMF 1 Aguascalientes,26,9,2014,19,7,19,15,101,48005,1,2,2,4,1,,1,1,,4,3,1,1,2,1,1,1,2,1,2,2,2,1,2,2,1,2,,2,,1,2,1,1,2,2,2,,2,8,1,1,1,2,2,2,5,2,5,4,11,,8,2,996,2,1,56,1,3,99,1324,11,2,1,17.63776452653690000000,2014-09-26,1
101624,1,2,UMF 1 Aguascalientes,26,9,2014,19,48,19,54,101,48005,1,2,3,4,1,,1,1,,1,2,1,1,2,1,1,2,1,1,1,2,1,2,2,2,1,2,,1,3,1,1,1,1,2,2,2,,2,8,2,1,1,996,,,2,1,2,8,9,3,8,1,996,2,2,65,2,3,3,1324,11,2,1,17.59663126113620000000,2014-09-26,1
101503,1,2,UMF 1 Aguascalientes,26,9,2014,15,18,15,35,101,48005,1,1,1,27,1,,1,1,,1,1,1,2,2,1,1,1,1,1,1,1,1,2,2,3,1,1,3,1,1,1,1,1,2,1,2,2,,2,10,2,1,1,996,,,6,,1,9,2,1,8,1,7,2,5,57,1,9,99,1324,11,2,1,17.63776452653690000000,2014-09-26,1
101468,1,2,UMF 1 Aguascalientes,2,10,2014,12,36,12,44,101,48005,1,2,2,27,1,,1,3,3,1,2,1,2,1,1,1,1,1,1,1,1,1,2,2,4,1,2,,2,,1,1,1,1,2,2,2,,1,10,999,,,996,,,4,2,3,4,11,,5,2,996,1,6,63,1,2,2,1324,11,2,1,17.63776452653690000000,2014-10-02,1
101474,1,2,UMF 1 Aguascalientes,2,10,2014,13,15,13,20,101,48005,1,2,2,10,3,,2,,,,4,1,1,2,1,1,1,1,1,2,1,1,2,2,4,1,2,,1,2,1,1,1,1,2,2,2,,2,9,2,1,1,996,,,4,2,2,9,11,,9,2,996,1,1,32,2,7,4,1324,11,2,1,18.71311325765940000000,2014-10-02,1
101479,1,2,UMF 1 Aguascalientes,26,9,2014,14,15,14,23,101,48005,1,2,2,18,4,,2,,,,4,1,2,2,2,1,1,1,1,1,1,1,2,2,4,1,2,,2,,1,1,2,1,2,2,2,,2,9,2,1,1,998,2,1,2,1,2,8,9,3,8,2,996,1,1,28,2,7,4,1324,11,2,1,18.71311325765940000000,2014-09-26,1
101487,1,2,UMF 1 Aguascalientes,26,9,2014,14,26,14,39,101,48004,1,2,2,9,1,,1,3,3,1,1,1,1,1,2,1,2,1,1,1,1,1,2,2,4,1,2,,2,,1,1,2,2,2,2,2,,2,10,2,1,1,996,,,2,2,2,2,11,,10,2,996,2,6,59,1,3,99,1324,11,2,1,17.63776452653690000000,2014-09-26,1
101497,1,2,UMF 1 Aguascalientes,26,9,2014,14,49,15,4,101,48004,1,2,2,26,7,,2,,,,1,1,1,1,1,1,1,1,1,1,1,1,2,2,4,2,2,,2,,1,1,1,1,2,2,2,,2,9,4,1,1,996,,,2,99,2,5,1,10,10,1,996,2,1,35,2,5,3,1324,11,2,1,19.14220673916310000000,2014-09-26,1
101548,1,2,UMF 1 Aguascalientes,26,9,2014,15,34,15,44,101,48004,1,1,1,27,1,,1,3,2,1,1,1,1,2,1,1,1,1,1,1,1,2,2,2,4,1,2,,2,,1,1,1,1,2,2,2,,2,9,996,,,996,,,4,2,2,8,11,,9,1,996,2,2,76,2,1,99,1324,11,2,1,17.59663126113620000000,2014-09-26,1
101552,1,2,UMF 1 Aguascalientes,26,9,2014,9,26,9,36,101,48003,1,2,2,12,2,,2,,,,3,1,1,1,2,1,1,1,1,1,1,1,2,2,4,2,2,,2,,1,1,1,1,2,2,2,,2,9,16,1,1,996,,,6,,2,2,11,,9,2,996,1,5,34,1,5,3,1324,11,2,1,18.21985513968660000000,2014-09-26,1
101569,1,2,UMF 1 Aguascalientes,26,9,2014,12,56,13,6,101,48005,1,2,2,44,1,,1,2,2,1,1,1,2,2,1,1,1,1,1,1,1,1,2,2,4,1,1,3,2,,1,1,1,1,4,3,2,,2,9,2,1,1,9,2,2,2,2,1,9,8,1,7,2,5,2,5,22,1,8,3,1324,11,2,1,17.52683581305740000000,2014-09-26,1
101578,1,2,UMF 1 Aguascalientes,26,9,2014,16,55,17,4,101,48004,1,2,2,27,1,,1,2,3,4,3,1,2,2,1,1,2,1,1,1,1,1,2,2,4,1,2,,2,,1,1,2,1,2,2,1,999,2,8,2,1,1,996,,,6,,4,8,4,5,8,2,996,2,6,58,1,7,99,1324,11,2,1,17.63776452653690000000,2014-09-26,1
101583,1,2,UMF 1 Aguascalientes,26,9,2014,17,13,17,25,101,48004,1,5,5,14,2,,2,,,,3,1,2,2,2,1,1,2,1,1,1,1,2,2,4,1,1,3,1,4,1,2,3,1,3,3,2,,5,2,2,1,2,1,1,1,4,2,3,6,3,,2,4,996,1,1,23,2,7,3,1324,11,2,1,18.09998777841760000000,2014-09-26,1
101592,1,2,UMF 1 Aguascalientes,26,9,2014,11,31,11,46,101,48003,1,2,2,27,1,,2,,,,2,1,2,1,1,1,2,1,1,1,1,1,2,2,4,2,2,,1,3,1,1,1,1,2,1,1,2,2,10,16,1,1,996,,,6,,2,4,11,,10,1,996,1,5,64,1,3,3,1324,11,2,1,17.63776452653690000000,2014-09-26,1
101599,1,2,UMF 1 Aguascalientes,26,9,2014,18,24,18,47,101,48005,1,2,2,27,1,,1,2,3,2,1,1,1,1,1,1,1,1,1,1,1,1,2,2,4,1,2,,2,,1,1,1,1,1,2,2,,2,10,999,,,996,,,2,1,2,2,11,,8,2,996,2,2,62,2,5,2,1324,11,2,1,18.07523648727020000000,2014-09-26,1
1011133,1,2,UMF 1 Aguascalientes,2,10,2014,13,3,13,11,101,48003,1,2,1,4,1,,1,2,2,2,1,1,2,1,1,1,1,1,1,1,1,1,2,2,4,2,1,1,2,,1,1,1,1,4,1,2,,1,9,2,1,1,9,2,2,6,,2,1,6,11,9,1,996,1,5,53,1,3,99,1324,11,2,1,18.11329782995410000000,2014-10-02,1
1011134,1,2,UMF 1 Aguascalientes,2,10,2014,13,16,13,25,101,48003,1,2,3,11,1,,1,2,3,3,1,1,1,2,1,1,1,1,1,1,1,1,2,2,4,1,2,,2,,1,1,2,1,2,2,2,,2,8,996,,,996,,,6,,3,7,4,,8,1,5,1,5,70,1,5,99,1324,11,2,1,17.36993659782270000000,2014-10-02,1
101469,1,2,UMF 1 Aguascalientes,2,10,2014,13,11,13,26,101,48001,1,2,2,8,1,,1,1,,1,1,1,1,2,1,1,1,1,1,1,1,1,2,2,5,2,1,3,1,3,1,1,1,2,2,2,2,,2,10,2,1,1,996,,,2,1,2,11,,,10,1,996,1,5,54,1,3,99,1324,11,2,1,18.11329782995410000000,2014-10-02,1
101472,1,2,UMF 1 Aguascalientes,2,10,2014,13,26,13,35,101,48001,1,2,2,41,8,,2,,,,2,1,1,2,2,97,2,1,1,1,1,1,2,2,5,1,1,3,1,1,1,1,1,1,2,2,2,,2,9,9,1,1,2,1,2,6,,2,3,2,1,8,1,996,1,1,35,1,7,4,1324,11,2,1,18.52694274878500000000,2014-10-02,1
101475,1,2,UMF 1 Aguascalientes,2,10,2014,13,39,13,50,101,48001,1,1,1,27,1,,1,1,,1,1,1,1,1,1,1,1,1,1,1,1,1,2,2,5,1,1,4,1,4,1,1,1,1,2,2,1,998,1,10,2,1,1,996,,,3,2,1,5,8,5,10,2,996,1,6,60,2,3,2,1324,11,2,1,18.07523648727020000000,2014-10-02,1
101478,1,2,UMF 1 Aguascalientes,26,9,2014,14,9,14,18,101,48004,1,1,1,7,3,,1,3,2,1,1,1,1,99,1,1,2,1,1,97,1,2,2,2,998,1,2,,2,,1,1,1,1,1,2,2,,2,10,16,1,1,996,,,6,,2,3,9,,9,1,996,2,1,21,2,7,4,1324,11,2,1,18.09998777841760000000,2014-09-26,1
101496,1,2,UMF 1 Aguascalientes,26,9,2014,8,47,8,56,101,48003,1,2,2,999,999,,1,2,3,3,2,1,2,2,1,1,2,1,1,1,1,1,2,2,5,2,1,7,1,4,1,1,1,1,2,2,2,,1,10,16,1,1,996,,,6,,2,11,,,10,1,996,1,5,61,1,2,99,1324,11,2,1,17.63776452653690000000,2014-09-26,1
101498,1,2,UMF 1 Aguascalientes,26,9,2014,15,2,15,18,101,48005,1,3,2,20,4,,1,2,2,1,1,1,1,2,1,1,1,1,1,1,1,1,2,2,5,1,2,,2,,1,1,1,1,2,2,2,,2,10,2,1,1,996,,,6,,2,7,4,,8,2,6,2,1,53,1,9,4,1324,11,2,1,18.11329782995410000000,2014-09-26,1
101501,1,2,UMF 1 Aguascalientes,26,9,2014,8,56,9,5,101,48003,1,2,2,4,1,,1,1,,3,1,1,1,2,1,1,1,1,1,1,1,1,2,2,5,2,1,4,2,,1,1,1,1,2,2,2,,2,10,16,1,1,996,,,6,,2,7,8,,8,1,5,1,1,48,2,4,4,1324,11,2,1,18.75892154827240000000,2014-09-26,1
101502,1,2,UMF 1 Aguascalientes,26,9,2014,15,4,15,17,101,48004,1,1,1,23,1,,1,2,1,1,1,1,1,1,2,1,1,1,1,1,1,1,2,2,998,2,2,,2,,1,1,1,1,2,2,2,,2,9,16,1,1,996,,,6,,2,11,,,10,1,996,2,1,65,2,2,99,1324,11,2,1,17.59663126113620000000,2014-09-26,1
101543,1,2,UMF 1 Aguascalientes,26,9,2014,15,17,15,34,101,48004,1,2,2,27,1,,1,3,2,1,2,1,1,1,1,1,1,1,1,1,1,1,2,2,5,1,1,3,2,,1,1,1,1,2,2,2,,2,10,2,1,1,996,,,3,2,2,4,11,,9,2,3,2,2,71,2,3,99,1324,11,2,1,17.59663126113620000000,2014-09-26,1
101544,1,2,UMF 1 Aguascalientes,26,9,2014,14,30,14,42,101,48005,1,2,2,4,1,,1,1,,1,1,1,2,2,1,1,1,1,1,1,1,2,2,2,5,1,2,,2,,1,1,1,1,2,2,2,,2,8,2,1,1,996,,,3,2,2,11,,,8,2,996,2,1,39,2,5,2,1324,11,2,1,19.14220673916310000000,2014-09-26,1
101553,1,2,UMF 1 Aguascalientes,26,9,2014,15,49,16,3,101,48004,1,1,1,10,3,,1,2,3,1,1,1,1,1,1,1,1,1,1,1,1,1,2,2,5,1,1,2,1,1,1,1,1,1,2,2,2,,1,10,1,1,1,996,,,6,,1,1,1,,2,1,996,2,1,52,2,3,1,1324,11,2,1,18.75892154827240000000,2014-09-26,1
101563,1,2,UMF 1 Aguascalientes,26,9,2014,16,30,16,40,101,48004,2,2,2,4,1,,1,3,2,1,4,1,1,1,1,1,2,1,1,1,1,1,2,2,5,1,1,1,1,3,1,1,2,2,2,2,2,,2,10,2,1,1,996,,,2,2,2,11,,,10,1,3,2,2,67,1,2,99,1324,11,2,1,17.36993659782270000000,2014-09-26,1
101566,1,2,UMF 1 Aguascalientes,26,9,2014,9,25,9,42,101,48002,1,1,1,4,1,,1,1,,1,1,1,1,1,1,1,1,1,1,1,1,1,2,2,5,1,1,1,1,2,1,1,1,1,2,2,1,1,2,10,2,1,1,996,,,6,,3,4,3,1,9,2,996,1,5,60,1,3,4,1324,11,2,1,17.63776452653690000000,2014-09-26,1
101570,1,2,UMF 1 Aguascalientes,26,9,2014,10,56,11,8,101,48001,1,2,2,8,1,,1,3,2,3,1,1,2,2,1,1,1,1,1,2,1,1,2,2,5,1,2,,2,,1,1,1,1,2,2,1,1,2,9,1,1,1,996,,,2,1,2,8,9,1,9,1,996,1,5,49,1,5,3,1324,11,2,1,18.11329782995410000000,2014-09-26,1
101573,1,2,UMF 1 Aguascalientes,26,9,2014,16,43,16,55,101,48004,1,1,1,4,1,,1,2,2,1,2,1,2,2,1,1,2,1,1,1,1,1,2,2,5,1,1,3,1,3,1,1,1,1,2,1,2,,1,10,16,1,2,996,,,2,1,1,6,11,,10,1,996,2,2,63,2,3,2,1324,11,2,1,18.07523648727020000000,2014-09-26,1
101582,1,2,UMF 1 Aguascalientes,26,9,2014,11,9,11,21,101,48003,1,2,2,6,4,,2,,,,5,2,2,2,1,1,2,1,1,1,1,1,2,2,5,1,1,1,2,,1,1,1,1,2,2,1,1,2,10,2,1,1,1,2,2,6,,2,1,10,,10,2,996,1,5,58,1,99,99,1324,11,2,1,17.63776452653690000000,2014-09-26,1
101591,1,2,UMF 1 Aguascalientes,26,9,2014,10,30,10,37,101,48002,1,2,2,1,5,1,1,1,,1,1,1,1,1,1,1,1,1,1,1,2,1,2,2,5,1,1,1,2,,1,1,1,1,2,2,2,,2,9,2,1,1,996,,,6,,2,4,3,6,9,1,996,1,5,28,1,6,4,1324,11,2,1,18.21985513968660000000,2014-09-26,1
101595,1,2,UMF 1 Aguascalientes,26,9,2014,12,18,12,26,101,48001,1,2,2,4,1,,1,1,,1,1,1,1,2,2,1,1,1,1,1,1,1,2,2,5,2,1,3,2,,1,1,1,1,1,1,2,,1,10,2,1,1,996,,,6,,1,11,,,10,1,996,1,1,30,1,1,3,1324,11,2,1,18.21985513968660000000,2014-09-26,1
101602,1,2,UMF 1 Aguascalientes,26,9,2014,12,13,12,21,101,48003,1,1,1,8,1,,1,2,2,1,2,1,1,2,1,1,2,1,1,1,1,1,2,2,5,1,1,2,1,1,1,1,1,1,2,2,2,,1,10,2,1,1,996,,,6,,1,1,10,,10,1,996,1,1,50,1,3,3,1324,11,2,1,18.11329782995410000000,2014-09-26,1