Folio,Deleg,Unidmed,Id_Unid,Fecha_D,Fecha_M,Fecha_A,Hr_Ini_H,Hr_Ini_M,Hr_Fin_H,Hr_Fin_M,Lugaraplic,Edoproc,Id_Unidproc,Tipopac,Edad,Sexo,Escolar,Ocupa1,Identif_Enc,Parent_Pacm,Sexo_Pacm,Edad_Pacm,Escolar2,Ocupa2,Tipodhu,Discap_A,Discap_B,Discap_C,Discap_D,Discap_E,Discap_F,Fig_Corp,Act_Fis_Mod,Act_Fis_Vig,Tmp_Actfis_Mod_H,Tmp_Actfis_Mod_M,Tmp_Actfis_Vig_H,Tmp_Actfis_Vig_M,Fuma100,Fuma_Act,Frec_Alcohol,Exc_Alcohol,Estres,Sat1,Sat3,Sat3_Mot1,Sat3_Mot2,Sat3_Mot3,Probsal_Urg1,Probsal_Urg2,Probsal_Urg3,Calgrav,Mot_Urg,Tiempollegar,Tmllegarcalif,Tespurg,Colestsa,Tespatn,Calteurg,Tram_Urg,Servurg,Usoserv,Tobscama,Pres_Med,Pregurg,Durasis_C,Durasis_C1_A,Durasis_C1_B,Durasis_C1_C,Durasis_C1_D,Durasis_R1_A,Durasis_R1_B,Durasis_R1_C,Durasis_R1_D,Durasis_R1_E,Durasis_R1_F,Durasis_R1_G,Mexapriv,Infoenferm,Infotratam,Infotratam2,Expurg,Clarurg,Infofamur,Expseg,Califurg,Motcalifurg1,Motcalifurg2,Motcalifurg3,Btratou,Btratou_Mot1,Btratou_Mot2,Btratou_Mot3,Calfatna_A,Calfatnb_A,Calfatna_C,Calfatnb_C,Calfatna_C2,Calfatnb_C2,Calfatna_E,Calfatnb_E,Calfatna_I,Calfatnb_I,Calfatna_K,Calfatnb_K,Calfatna_L,Calfatnb_L,Calfatna_J,Calfatnb_J,Calfatna_F,Calfatnb_F,Mottratot1,Mottratot2,Mottratot3,Mottratot4,Mottratot5,Saludar,Escuchar,Responder,Amable,Comincom,Comincom_Mot,Confmed_A,Confmed_B,Confmed_D,Confmed_E,Confmed_F,Confmed_G,Calfinmb_K1,Calfinmb_C3,Calfinmb_C2,Calfinmb_I,Calfinmb_J,Calfinmb_B1,Limp2,Gasto_Bolsilloa1,Gasto_Bolsillob1,Gasto_Bolsilloa2,Gasto_Bolsillob2,Gasto_Bolsilloa3,Gasto_Bolsillob3,Gasto_Bolsilloa4,Gasto_Bolsillob4,Cal1,Recomej_A,Recomej_B,Recomej_C,Id_Unidad,Cve_Delegaci�N,Delegaci�N,Nivel,Unidad,Promedio_Diario2018,Estrato,Moscondia,Fe_Finalnr,Fecha,Entidad
115391379,1,HGZ 1 Aguascalientes,11,12,11,2019,10,4,10,18,1,1,2,2,30,1,7,5,2,1,2,10,2,,5,2,2,2,2,2,2,,,,,,,,,,,,,2,2,,,,31,,,10,3,15,4,180,1,60,4,7,6,,,1,1,1,1,1,1,1,1,2,2,1,2,1,2,1,1,1,1,1,2,1,1,2,,,,2,,,,1,8,1,10,1,10,1,10,1,10,2,,1,6,1,10,2,,,,,,,1,1,1,1,2,,1,1,1,1,1,2,10,10,10,10,10,10,1,2,,2,,2,,2,,2,995,,,11,1,Aguascalientes,2,HGZ 1 Aguascalientes,706,1,1,6.715701947,2019-11-12,1
115391380,1,HGZ 1 Aguascalientes,11,12,11,2019,10,34,10,47,1,1,2,1,34,1,6,2,1,,,,,,1,2,2,2,2,2,2,5,2,97,999,999,,,2,2,13,,2,2,2,,,,64,,,5,3,15,3,30,1,1,2,7,2,4,99997,1,1,1,1,1,1,1,2,1,1,1,1,2,2,1,1,1,1,1,1,1,1,2,,,,2,,,,2,,1,9,2,,1,8,2,,2,,2,,1,8,2,,,,,,,1,1,1,1,2,,1,1,1,1,1,2,9,9,9,10,10,7,2,2,,2,,1,200,2,,2,1,,,11,1,Aguascalientes,2,HGZ 1 Aguascalientes,706,1,1,6.715701947,2019-11-12,1
115394860,1,HGZ 1 Aguascalientes,11,12,11,2019,11,7,11,23,1,1,2,1,32,2,7,2,1,,,,,,1,2,2,2,2,2,2,4,7,7,2,0,2,0,1,2,11,96,2,2,2,,,,31,,,5,5,5,2,15,1,10,2,2,4,,,1,1,1,1,1,1,1,1,2,2,1,1,1,1,1,1,1,1,1,2,1,1,2,,,,2,,,,1,2,1,10,2,,1,10,1,10,2,,2,,2,,2,,,,,,,1,1,1,1,2,,1,1,1,1,1,2,9,7,6,8,9,4,2,2,,2,,2,,2,,2,21,23,,11,1,Aguascalientes,2,HGZ 1 Aguascalientes,706,1,1,11.23404726,2019-11-12,1
115396098,1,HGZ 1 Aguascalientes,11,12,11,2019,11,24,11,36,1,1,4,1,49,2,7,2,1,,,,,,1,2,2,2,2,2,2,5,97,7,,,1,0,2,2,7,6,2,2,2,,,,31,,,3,5,5,2,30,2,,2,4,9,,,1,1,1,2,2,2,2,2,2,2,2,2,2,2,99,1,1,1,1,2,2,1,2,,,,2,,,,1,10,1,10,1,10,1,10,1,10,1,10,1,10,2,,2,,,,,,,1,1,1,1,2,,1,1,1,1,1,2,10,10,10,99,10,97,,2,,2,,2,,2,,1,995,,,11,1,Aguascalientes,2,HGZ 1 Aguascalientes,706,1,1,13.56642047,2019-11-12,1
115406029,1,HGZ 1 Aguascalientes,11,12,11,2019,12,51,13,4,1,1,2,1,30,2,5,5,1,,,,,,5,2,2,2,2,2,2,3,97,97,,,,,2,2,13,,5,2,2,,,,1,,,5,3,30,3,15,1,15,2,1,2,2,99997,1,1,1,1,1,2,2,2,2,2,1,2,2,2,2,1,1,1,1,2,1,1,1,,,,2,,,,1,9,1,10,2,,1,10,2,,2,,2,,2,,2,,,,,,,1,1,1,1,2,,1,1,1,1,1,2,8,10,10,10,10,8,2,2,,2,,2,,2,,1,21,,,11,1,Aguascalientes,2,HGZ 1 Aguascalientes,706,1,1,11.23404726,2019-11-12,1
115411032,1,HGZ 1 Aguascalientes,11,12,11,2019,13,28,13,44,1,1,2,1,25,1,7,4,1,,,,,,1,2,2,2,2,2,2,4,97,97,,,,,1,1,8,6,1,4,2,,,,19,,,8,4,1,4,180,2,,5,4,2,2,1440,2,1,1,1,1,2,2,2,2,2,2,1,2,2,2,2,2,,2,,2,1,2,,,,2,,,,1,7,1,6,2,,1,8,2,,2,,2,,2,,2,,,,,,,2,1,1,1,2,,2,1,1,1,1,1,7,7,5,97,5,4,2,2,,2,,2,,2,,2,1,22,23,11,1,Aguascalientes,2,HGZ 1 Aguascalientes,706,1,1,13.5890219,2019-11-12,1
115418881,1,HGZ 1 Aguascalientes,11,12,11,2019,14,16,14,31,1,1,2041,1,22,2,7,2,1,,,,,,1,2,2,2,2,2,2,6,97,6,,,1,0,1,2,8,96,1,4,4,8,14,,32,,,6,5,60,4,3,2,,4,1,2,8,99997,2,1,1,1,1,2,2,2,2,2,1,2,2,2,2,1,2,,1,2,1,1,2,,,,3,4,8,,99,,1,9,1,10,1,10,1,8,1,7,1,3,2,,2,,,,,,,1,1,1,1,2,,1,1,99,1,1,2,5,3,4,99,5,4,2,2,,2,,2,,2,,2,1,,,11,1,Aguascalientes,2,HGZ 1 Aguascalientes,706,1,1,22.73175841,2019-11-12,1
115434064,1,HGZ 1 Aguascalientes,11,12,11,2019,16,26,16,40,1,1,2,1,73,2,7,9,1,,,,,,2,2,2,2,2,2,2,6,97,97,,,,,1,2,7,96,4,2,2,,,,52,,,2,5,5,3,120,1,30,3,4,2,2,99997,2,2,2,,,,,,,,,,,,,1,1,1,1,1,97,1,1,,,,1,,,,2,,1,10,2,,1,10,2,,2,,1,3,2,,2,,,,,,,1,1,1,1,2,,1,1,1,1,1,2,10,10,10,10,6,9,1,2,,2,,2,,2,,2,17,,,11,1,Aguascalientes,2,HGZ 1 Aguascalientes,706,1,1,18.61005557,2019-11-12,1
115436258,1,HGZ 1 Aguascalientes,11,12,11,2019,16,45,16,58,1,1,2,2,39,1,5,5,2,1,2,0,,,5,97,97,97,97,97,97,,,,,,,,,,,,,2,2,,,,78,,,5,3,25,2,3,2,,1,4,4,,,1,1,1,2,1,1,2,2,2,2,2,2,2,2,2,2,1,1,2,,97,1,2,,,,2,,,,2,,1,10,2,,1,10,2,,2,,2,,2,,2,,,,,,,1,1,1,1,2,,1,1,2,1,1,1,10,8,10,10,10,97,,2,,2,,2,,2,,2,1,1,,11,1,Aguascalientes,2,HGZ 1 Aguascalientes,706,1,1,4.94641227,2019-11-12,1
115438006,1,HGZ 1 Aguascalientes,11,12,11,2019,14,15,14,32,1,1,5,1,56,1,3,5,1,,,,,,5,2,2,2,2,2,2,6,6,6,0,30,0,30,2,2,10,11,3,2,2,,,,1,26,,5,4,20,2,30,2,,4,1,8,,,1,1,2,,,,,,,,,,,,,1,1,1,1,1,2,1,2,,,,2,,,,2,,1,8,1,8,1,8,2,,2,,1,8,2,,2,,,,,,,1,2,1,1,2,,1,1,1,1,1,1,8,8,8,8,99,8,2,2,,2,,2,,2,,1,27,21,32,11,1,Aguascalientes,2,HGZ 1 Aguascalientes,706,1,1,10.70286841,2019-11-12,1
115439371,1,HGZ 1 Aguascalientes,11,12,11,2019,17,3,17,20,1,1,2041,1,24,1,9,10,1,,,,,,1,2,2,2,2,2,2,4,97,97,,,,,2,2,8,11,2,2,4,14,15,,53,,,7,4,15,3,30,2,,2,4,2,2,99997,1,1,1,1,1,1,1,2,2,2,2,1,2,2,2,1,1,1,1,2,2,1,2,,,,2,,,,2,,1,8,2,,1,7,1,8,1,8,1,6,2,,2,,,,,,,1,2,2,1,2,,2,1,1,2,1,1,1,6,1,5,1,1,2,2,,2,,2,,2,,4,1,21,23,11,1,Aguascalientes,2,HGZ 1 Aguascalientes,706,1,1,13.5890219,2019-11-12,1
115441116,1,HGZ 1 Aguascalientes,11,12,11,2019,17,24,17,37,1,1,2,2,48,1,5,2,2,12,2,13,4,,5,2,2,2,2,2,2,,,,,,,,,,,,,2,2,,,,31,,,8,5,30,2,30,1,30,2,4,4,,,1,1,1,1,2,2,2,2,2,2,2,2,2,2,1,2,1,1,1,2,1,1,2,,,,2,,,,1,9,1,9,1,10,1,10,2,,2,,1,1,2,,2,,,,,,,2,1,1,1,2,,1,1,1,1,1,2,10,10,10,99,10,5,2,2,,2,,2,,2,,2,3,44,,11,1,Aguascalientes,2,HGZ 1 Aguascalientes,706,1,1,8.10999226,2019-11-12,1
115441921,1,HGZ 1 Aguascalientes,11,12,11,2019,17,31,17,44,1,1,2,1,58,1,3,5,1,,,,,,5,2,2,2,2,2,2,5,97,97,,,,,2,2,13,,4,2,2,,,,1,,,5,3,25,3,45,2,,4,4,2,2,99997,1,1,1,1,1,1,2,2,2,1,1,2,2,2,1,1,1,1,1,3,1,1,2,,,,2,,,,2,,1,8,2,,1,10,2,,2,,1,6,2,,2,,,,,,,1,1,1,1,2,,1,1,1,1,1,2,8,9,9,99,9,7,2,2,,2,,2,,2,,2,13,,,11,1,Aguascalientes,2,HGZ 1 Aguascalientes,706,1,1,10.70286841,2019-11-12,1
115443544,1,HGZ 1 Aguascalientes,11,12,11,2019,17,44,17,57,1,1,5,1,22,1,7,2,1,,,,,,1,2,2,2,2,2,2,4,5,97,0,20,,,2,2,8,96,3,2,2,,,,31,,,9,4,99999,,10,1,15,2,4,6,,,1,1,1,1,1,2,2,1,1,1,1,2,1,1,1,1,1,1,1,2,2,1,2,,,,2,,,,2,,1,9,1,9,2,,2,,2,,1,9,2,,2,,,,,,,1,1,1,1,2,,1,1,1,1,1,2,8,10,10,97,10,97,,2,,2,,2,,2,,2,17,,,11,1,Aguascalientes,2,HGZ 1 Aguascalientes,706,1,1,13.5890219,2019-11-12,1
115447259,1,HGZ 1 Aguascalientes,11,12,11,2019,17,51,18,12,1,1,1,1,55,2,4,2,1,,,,,,1,1,2,2,2,2,2,3,3,97,0,1,,,2,2,12,96,1,4,2,,,,12,13,69,9,4,45,3,300,2,,5,3,2,7,1440,1,1,1,1,1,1,1,2,2,2,2,2,2,2,3,1,1,1,1,2,2,1,5,1,2,14,3,2,,,1,10,1,10,1,10,1,10,2,,2,,1,1,1,10,2,,,,,,,1,1,1,1,2,,1,1,1,1,1,1,10,9,10,10,99,10,2,2,,2,,2,,2,,2,1,28,1,11,1,Aguascalientes,2,HGZ 1 Aguascalientes,706,1,1,17.90379182,2019-11-12,1
115691203,1,HGZ 1 Aguascalientes,11,14,11,2019,15,54,16,7,1,1,2,1,64,2,3,9,1,,,,,,2,1,2,2,2,2,2,5,97,97,,,,,1,2,13,,2,2,2,,,,52,,,5,3,30,3,5,1,5,2,4,4,,,2,1,1,1,1,1,1,2,2,2,2,2,2,2,1,1,1,1,1,2,2,1,2,,,,2,,,,1,8,1,8,2,,2,,2,,2,,2,,2,,2,,,,,,,1,1,1,1,2,,1,1,1,1,1,2,8,10,10,97,99,8,1,2,,2,,2,,2,,2,995,,,11,1,Aguascalientes,2,HGZ 1 Aguascalientes,706,1,1,17.90379182,2019-11-14,1
115693194,1,HGZ 1 Aguascalientes,11,14,11,2019,16,11,16,24,1,1,2041,2,60,2,5,9,2,1,2,14,4,,5,2,2,2,2,2,2,,,,,,,,,,,,,2,1,,,,31,,,5,4,10,3,60,2,,2,4,97,,,1,1,1,1,1,1,1,2,2,2,1,2,1,2,1,1,2,,1,1,2,1,2,,,,2,,,,2,,1,10,2,,2,,2,,2,,1,10,2,,2,,,,,,,1,1,1,1,2,,1,1,1,1,1,2,10,10,10,6,8,97,,2,,2,,2,,2,,1,13,,,11,1,Aguascalientes,2,HGZ 1 Aguascalientes,706,1,1,17.90379182,2019-11-14,1
115698896,1,HGZ 1 Aguascalientes,11,14,11,2019,16,56,17,9,1,1,2041,1,22,2,6,2,1,,,,,,1,2,2,2,2,2,2,3,97,97,,,,,2,2,13,,4,2,2,,,,31,,,5,1,25,2,25,1,40,4,4,4,,,1,1,1,1,1,1,1,2,2,2,2,2,2,1,1,1,1,1,1,2,99,1,2,,,,2,,,,2,,1,10,2,,1,9,2,,2,,2,,2,,2,,,,,,,1,1,1,1,2,,2,1,1,1,1,2,10,9,9,97,9,7,2,2,,2,,2,,2,,2,995,,,11,1,Aguascalientes,2,HGZ 1 Aguascalientes,706,1,1,22.73175841,2019-11-14,1
115701183,1,HGZ 1 Aguascalientes,11,14,11,2019,16,12,16,26,1,1,2,2,24,1,5,5,2,2,2,4,,,5,2,2,2,2,2,2,,,,,,,,,,,,,3,3,15,15,,1,4,,1,2,60,3,20,2,,3,1,9,,,2,1,1,2,1,1,2,2,2,1,2,2,2,1,1,1,1,1,1,2,2,2,3,2,,,3,4,,,2,,1,5,2,,2,,2,,2,,2,,2,,2,,,,,,,2,1,1,1,2,,1,1,1,99,1,1,4,8,5,8,5,5,2,2,,2,,2,,2,,3,1,18,13,11,1,Aguascalientes,2,HGZ 1 Aguascalientes,706,1,1,13.5890219,2019-11-14,1
115714754,1,HGZ 1 Aguascalientes,11,14,11,2019,18,36,18,53,1,1,2,1,82,1,3,5,1,,,,,,6,1,1,2,1,2,1,5,97,97,,,,,2,2,13,,3,2,2,,,,109,,,5,4,5,2,30,1,30,2,4,4,,,2,1,1,1,1,1,1,2,2,2,1,1,1,1,1,1,1,1,1,1,2,1,2,,,,1,,,,1,8,1,8,1,8,2,,2,,2,,1,8,2,,2,,,,,,,2,2,1,1,2,,1,1,1,1,1,2,8,8,7,7,7,97,,2,,2,,2,,2,,2,23,39,31,11,1,Aguascalientes,2,HGZ 1 Aguascalientes,706,1,1,11.12507216,2019-11-14,1
115719429,1,HGZ 1 Aguascalientes,11,14,11,2019,19,10,19,28,1,32,1795,1,48,2,3,5,1,,,,,,5,1,1,2,2,2,2,5,97,97,,,,,2,2,13,,1,2,2,,,,49,,,8,5,120,4,99999,99,,99,4,1,,840,1,2,1,1,1,2,2,2,2,2,2,2,2,2,1,1,1,1,1,2,1,1,1,,,,1,,,,2,,1,10,1,10,1,10,2,,1,9,1,1,2,,2,,,,,,,1,1,1,1,2,,1,1,1,1,1,2,10,8,8,97,99,10,1,2,,2,,2,,2,,1,32,,,11,1,Aguascalientes,2,HGZ 1 Aguascalientes,706,1,1,13.56642047,2019-11-14,1
115720052,1,HGZ 1 Aguascalientes,11,14,11,2019,17,40,17,57,1,32,1795,1,41,2,5,9,1,,,,,,2,2,2,2,2,2,2,7,97,97,,,,,2,2,13,,4,2,2,,,,10,,,7,4,180,3,99999,99,,99,1,1,,2160,99,99,99,,,,,,,,,,,,,1,1,1,1,2,1,1,2,,,,2,,,,1,10,1,10,1,10,1,10,1,10,1,10,1,5,1,7,2,,,,,,,1,2,1,1,2,,1,1,1,1,1,2,8,4,99,99,6,8,1,2,,2,,2,,2,,2,22,,,11,1,Aguascalientes,2,HGZ 1 Aguascalientes,706,1,1,8.274373946,2019-11-14,1
115720053,1,HGZ 1 Aguascalientes,11,14,11,2019,18,37,18,53,1,1,2,1,66,1,1,5,1,,,,,,5,1,2,2,2,2,2,6,97,97,,,,,2,2,13,,4,2,2,,,,64,,,5,3,25,2,30,2,,2,2,2,2,2160,1,1,1,1,1,1,2,1,2,1,1,1,2,2,1,2,1,1,1,2,1,1,2,,,,2,,,,2,,1,8,1,8,1,10,2,,1,9,1,7,2,,2,,,,,,,1,1,1,1,2,,1,2,1,1,1,1,6,7,7,99,5,3,1,2,,2,,2,,2,,2,1,1,,11,1,Aguascalientes,2,HGZ 1 Aguascalientes,706,1,1,11.12507216,2019-11-14,1
115514556,1,HGZ 2 Aguascalientes,12,13,11,2019,9,10,9,28,1,1,1,1,43,1,2,10,1,,,,,,1,2,2,2,2,2,2,7,97,5,,,5,0,2,2,7,4,3,1,1,,,,64,,,7,4,5,1,3,2,,1,7,5,,,1,1,1,1,1,1,1,1,1,1,1,1,1,1,1,1,1,1,1,1,1,1,1,,,,1,,,,1,10,1,10,1,10,1,10,1,10,2,,1,10,1,10,2,,,,,,,1,1,1,1,2,,1,1,1,1,1,2,10,10,10,10,10,10,1,2,,2,,2,,2,,1,995,,,12,1,Aguascalientes,2,HGZ 2 Aguascalientes,520,2,1,41.89737305,2019-11-13,1
115588694,1,HGZ 2 Aguascalientes,12,13,11,2019,16,57,17,13,1,1,1,1,31,1,9,4,1,,,,,,6,2,2,1,2,2,2,5,97,97,,,,,1,2,13,,1,2,2,,,,31,,,4,5,99999,,60,1,30,2,1,2,997,99997,1,1,1,1,1,1,1,1,1,1,1,1,1,1,1,1,1,1,1,2,1,1,3,14,,,2,,,,1,10,1,9,2,,1,10,2,,2,,1,10,2,,2,,,,,,,99,1,1,1,2,,1,1,1,1,1,2,9,10,10,10,10,97,,2,,2,,2,,2,,3,1,,,12,1,Aguascalientes,2,HGZ 2 Aguascalientes,520,2,1,56.88370771,2019-11-13,1
115263066,1,HGZ 3 Aguascalientes,2093,11,11,2019,8,14,8,41,2,1,2134,1,54,2,5,9,1,,,,,,2,2,2,2,2,2,2,6,97,97,,,,,1,2,7,96,5,2,2,,,,1,,,9,4,10,2,45,2,,3,2,1,,99999,1,1,1,1,1,1,1,2,2,1,1,1,2,2,1,1,1,1,1,1,1,1,1,,,,2,,,,1,10,1,10,1,10,1,10,2,,2,,1,5,1,10,2,,,,,,,1,1,1,1,2,,1,1,1,1,1,1,10,7,10,8,8,8,1,2,,2,,2,,2,,1,1,,,2093,1,Aguascalientes,2,HGZ 3 Aguascalientes,496,3,1,31.31641536,2019-11-11,1
115267424,1,HGZ 3 Aguascalientes,2093,11,11,2019,9,14,9,29,1,1,2134,1,58,1,2,5,1,,,,,,2,2,1,2,2,2,2,5,5,97,0,30,,,2,2,13,,3,2,2,,,,40,,,3,5,30,2,5,1,3,1,2,2,13,3,1,1,1,1,1,1,1,99,99,99,99,99,99,99,99,1,1,1,1,1,1,2,2,,,,2,,,,1,9,2,,2,,1,9,2,,2,,2,,2,,2,,,,,,,2,1,1,1,2,,1,1,1,1,2,99,10,9,9,8,99,9,1,2,,2,,2,,2,,2,33,,,2093,1,Aguascalientes,2,HGZ 3 Aguascalientes,496,3,1,24.70625715,2019-11-11,1
115280833,1,HGZ 3 Aguascalientes,2093,11,11,2019,11,32,11,46,1,1,2041,1,75,1,1,5,1,,,,,,6,1,1,2,2,2,2,6,97,97,,,,,1,2,13,,5,2,2,,,,51,,,1,2,35,4,30,1,20,2,2,8,,,1,1,1,1,2,2,2,2,2,2,2,2,2,2,1,1,1,1,1,1,1,1,1,,,,1,,,,1,10,99,,1,10,1,10,2,,2,,2,,2,,2,,,,,,,1,1,1,1,2,,1,1,1,1,1,2,10,10,10,10,10,10,1,2,,2,,2,,2,,1,995,,,2093,1,Aguascalientes,2,HGZ 3 Aguascalientes,496,3,1,25.68086265,2019-11-11,1
115296120,1,HGZ 3 Aguascalientes,2093,11,11,2019,13,55,14,9,1,1,6,2,33,2,5,1,2,4,1,13,4,,5,2,2,2,2,2,1,,,,,,,,,,,,,4,3,11,15,,31,,,5,5,25,3,150,1,120,5,5,9,,,1,1,2,,,,,,,,,,,,,1,1,1,1,2,1,2,3,9,,,3,26,,,2,,1,9,2,,1,5,2,,2,,1,4,1,9,2,,,,,,,1,1,1,1,2,,1,1,1,2,1,2,10,6,5,9,5,9,1,2,,1,350,2,,2,,2,13,,,2093,1,Aguascalientes,2,HGZ 3 Aguascalientes,496,3,1,25.93241829,2019-11-11,1
115317959,1,HGZ 3 Aguascalientes,2093,11,11,2019,16,46,16,58,1,1,7,1,38,1,7,5,1,,,,,,5,2,2,2,2,2,2,5,5,3,0,40,0,30,2,2,13,,4,1,1,,,,91,,,3,4,60,4,60,1,30,3,998,97,,,1,1,1,1,1,1,1,2,2,2,1,2,2,2,3,1,1,1,1,1,2,1,2,,,,2,,,,1,9,2,,2,,1,8,2,,1,9,1,10,1,7,1,8,,,,,,1,1,1,1,2,,1,1,1,1,1,1,8,7,9,7,9,8,1,2,,2,,2,,2,,2,995,,,2093,1,Aguascalientes,2,HGZ 3 Aguascalientes,496,3,1,11.41818518,2019-11-11,1
115329216,1,HGZ 3 Aguascalientes,2093,11,11,2019,18,2,18,22,1,1,3,1,33,1,7,10,1,,,,,,1,1,1,1,1,1,1,8,1,97,0,10,,,1,1,13,,1,4,4,1,8,12,13,78,,9,4,20,2,240,2,,5,7,998,,,2,2,1,1,2,2,2,2,2,2,2,1,2,2,2,2,1,1,2,,2,1,5,1,4,,5,2,3,4,2,,1,1,2,,1,9,1,9,2,,1,1,1,7,2,,,,,,,2,2,2,2,1,8,1,2,1,2,2,1,7,7,5,5,8,8,2,2,,2,,2,,2,,4,1,4,13,2093,1,Aguascalientes,2,HGZ 3 Aguascalientes,496,3,1,15.50237309,2019-11-11,1
115339938,1,HGZ 3 Aguascalientes,2093,11,11,2019,19,42,19,58,1,1,8,1,27,1,5,4,1,,,,,,1,2,2,2,2,2,2,4,97,97,,,,,2,2,13,,1,1,2,,,,42,,,10,5,60,4,60,2,,2,4,8,,,2,1,1,1,2,2,2,2,2,2,2,1,2,2,1,1,1,1,1,2,2,1,2,,,,2,,,,1,9,1,10,2,,1,8,2,,2,,2,,2,,2,,,,,,,2,1,1,1,2,,1,1,1,1,1,2,10,10,10,10,10,5,2,2,,2,,2,,2,,2,998,,,2093,1,Aguascalientes,2,HGZ 3 Aguascalientes,496,3,1,15.50237309,2019-11-11,1
114856122,2,HGR 20 Tijuana,49,7,11,2019,12,0,12,17,1,2,27,1,65,1,4,5,1,,,,,,6,2,2,2,1,2,2,6,7,97,0,30,,,2,2,13,,5,2,2,,,,10,,,8,4,30,2,5,99,,2,1,99,,,2,1,1,1,1,2,2,2,2,2,1,2,2,1,1,2,1,1,1,2,97,1,2,,,,2,,,,2,,1,9,2,,1,9,2,,2,,2,,2,,2,,,,,,,1,1,1,1,2,,1,1,1,1,1,1,9,8,7,9,6,9,99,2,,2,,2,,2,,2,3,27,,49,2,Baja California,2,HGR 20 Tijuana,728,1,0.289348172,21.30148252,2019-11-07,2
114863139,2,HGR 20 Tijuana,49,7,11,2019,12,49,13,2,1,2,20,1,23,1,6,5,1,,,,,,5,2,2,2,2,2,2,4,2,97,0,30,,,2,2,8,96,5,1,1,,,,48,,,6,2,30,2,120,1,120,4,1,9,,,1,1,1,1,1,1,1,2,2,2,2,2,2,1,1,2,1,1,2,,2,1,2,,,,1,,,,2,,1,9,1,9,1,10,2,,2,,2,,2,,2,,,,,,,2,2,1,1,2,,1,1,1,1,1,1,10,10,8,10,8,5,2,2,,2,,2,,2,,2,1,,,49,2,Baja California,2,HGR 20 Tijuana,728,1,0.289348172,22.24396777,2019-11-07,2
114886284,2,HGR 20 Tijuana,49,7,11,2019,15,32,15,45,1,2,28,1,34,1,5,2,1,,,,,,1,2,2,2,2,2,2,6,97,97,,,,,1,1,13,,5,1,1,,,,31,,,8,2,90,5,5,1,5,1,1,4,,,1,1,2,,,,,,,,,,,,,1,1,1,1,1,97,1,1,,,,1,,,,1,10,1,10,1,10,1,10,2,,2,,2,,2,,2,,,,,,,1,1,1,1,2,,1,1,1,1,1,2,10,10,8,9,5,97,,2,,2,,2,,2,,1,3,,,49,2,Baja California,2,HGR 20 Tijuana,728,1,0.289348172,22.24434113,2019-11-07,2
114886545,2,HGR 20 Tijuana,49,7,11,2019,15,33,15,46,1,2,20,1,45,1,5,2,1,,,,,,1,2,2,2,2,2,2,6,97,97,,,,,1,1,13,,2,2,2,,,,64,64,,5,2,5,1,10,2,,2,4,5,,,1,1,1,1,1,2,2,2,2,2,1,1,1,2,1,1,1,1,1,2,1,1,2,,,,2,,,,1,9,1,9,1,10,1,10,2,,2,,2,,2,,2,,,,,,,1,1,1,1,2,,1,1,1,1,1,1,9,8,5,99,9,9,1,2,,2,,2,,2,,2,3,,,49,2,Baja California,2,HGR 20 Tijuana,728,1,0.289348172,33.0706293,2019-11-07,2
114898515,2,HGR 20 Tijuana,49,7,11,2019,17,2,17,15,1,2,20,1,66,2,9,999,1,,,,,,5,2,2,2,2,2,2,4,97,97,,,,,1,2,13,,4,2,1,,,,2,,,3,5,15,2,2,1,2,1,1,6,,,1,1,1,1,1,2,2,2,2,2,2,2,2,2,2,1,1,1,1,1,97,1,1,,,,1,,,,1,10,1,10,2,,1,10,2,,2,,2,,2,,2,,,,,,,1,1,1,1,2,,1,1,1,1,1,2,8,8,7,97,8,97,,2,,2,,2,,2,,1,31,,,49,2,Baja California,2,HGR 20 Tijuana,728,1,0.289348172,18.55898535,2019-11-07,2
114905901,2,HGR 20 Tijuana,49,7,11,2019,18,38,18,52,1,2,20,1,58,2,7,2,1,,,,,,1,2,2,2,2,2,2,4,7,7,8,0,8,0,1,2,13,,4,2,2,,,,40,,,8,10,15,2,10,2,,1,4,99,,,1,1,2,,,,,,,,,,,,,1,1,1,1,2,2,1,2,,,,1,,,,1,10,1,7,2,,1,10,2,,2,,1,9,2,,2,,,,,,,1,1,1,1,1,999,1,1,1,1,1,1,9,9,9,9,99,9,2,2,,2,,2,,2,,1,995,,,49,2,Baja California,2,HGR 20 Tijuana,728,1,0.289348172,24.50054161,2019-11-07,2
114908019,2,HGR 20 Tijuana,49,7,11,2019,19,25,19,40,1,2,29,1,52,2,5,1,1,,,,,,5,2,2,2,2,2,2,6,97,97,,,,,1,1,7,9,3,2,2,,,,109,,,9,3,10,2,20,1,60,4,1,99,,,1,1,1,1,2,1,2,2,2,2,2,1,2,2,1,2,1,1,1,2,2,1,2,,,,2,,,,1,10,2,,2,,1,9,2,,1,9,1,10,1,9,1,10,,,,,,1,1,1,1,2,,1,1,1,1,1,1,8,8,1,10,3,8,2,2,,2,,2,,2,,2,1,,,49,2,Baja California,2,HGR 20 Tijuana,728,1,0.289348172,28.81289243,2019-11-07,2
114908040,2,HGR 20 Tijuana,49,7,11,2019,19,25,19,40,1,2,20,1,42,2,5,2,1,,,,,,1,2,2,2,2,2,2,6,97,97,,,,,2,2,7,5,3,1,2,,,,80,,,7,5,30,4,60,1,10,3,4,2,22,99997,1,1,1,1,1,1,1,1,1,1,1,1,1,1,1,1,1,1,1,1,1,1,1,,,,1,,,,1,10,1,9,1,9,1,10,1,10,1,10,2,,2,,2,,,,,,,1,1,1,1,2,,1,1,1,1,1,1,10,10,10,10,10,9,1,2,,2,,2,,2,,2,27,1,,49,2,Baja California,2,HGR 20 Tijuana,728,1,0.289348172,16.7796595,2019-11-07,2
114908763,2,HGR 20 Tijuana,49,7,11,2019,19,42,19,59,1,2,20,1,50,2,2,2,1,,,,,,1,1,1,2,2,1,2,6,97,97,,,,,2,2,3,4,3,2,2,,,,50,,,10,2,60,4,240,1,240,5,1,6,,,1,1,2,,,,,,,,,,,,,1,1,1,1,1,97,1,3,14,,,4,2,,,2,,1,7,1,9,1,8,2,,1,8,2,,2,,1,6,2,,,,,1,1,1,1,1,2,1,1,1,1,1,1,4,1,1,5,7,1,2,2,,2,,2,,2,,1,1,,,49,2,Baja California,2,HGR 20 Tijuana,728,1,0.289348172,28.81289243,2019-11-07,2
114908838,2,HGR 20 Tijuana,49,7,11,2019,19,48,20,1,1,2,20,1,33,1,7,2,1,,,,,,1,1,1,2,2,2,2,6,97,97,,,,,2,2,13,,2,2,2,,,,38,,,7,2,30,2,5,2,,1,4,2,997,120,2,1,1,1,1,2,2,2,2,2,2,2,2,2,1,1,2,,2,,1,1,1,,,,2,,,,2,,1,10,2,,2,,2,,2,,2,,2,,2,,,,,,,2,1,1,1,2,,2,1,1,1,2,1,9,9,9,8,9,97,,2,,2,,2,,2,,1,995,,,49,2,Baja California,2,HGR 20 Tijuana,728,1,0.289348172,22.24434113,2019-11-07,2
114909718,2,HGR 20 Tijuana,49,7,11,2019,20,3,20,18,1,2,20,1,50,2,3,5,1,,,,,,5,1,1,2,2,2,2,6,97,97,,,,,1,2,13,,2,1,1,,,,52,,,10,2,50,4,99999,1,240,5,1,4,,,1,1,2,,,,,,,,,,,,,1,1,1,1,1,1,1,1,,,,1,,,,1,10,1,10,1,10,1,10,2,,2,,2,,2,,2,,,,,,,1,1,1,1,2,,1,1,1,1,1,1,8,9,1,10,1,10,1,2,,2,,2,,2,,1,3,40,,49,2,Baja California,2,HGR 20 Tijuana,728,1,0.289348172,28.81289243,2019-11-07,2
114909724,2,HGR 20 Tijuana,49,7,11,2019,19,56,20,13,1,2,22,1,28,2,5,1,1,,,,,,5,2,2,2,2,2,2,4,3,97,0,30,,,2,2,6,6,5,2,2,,,,31,35,,7,3,40,4,15,99,,2,1,7,,,1,1,1,1,1,1,2,2,2,2,2,2,1,2,1,1,1,1,1,2,97,1,2,,,,2,,,,2,,1,9,2,,1,10,2,,2,,1,8,2,,2,,,,,,,1,1,1,1,2,,1,1,1,1,1,2,8,8,9,99,99,5,2,2,,2,,2,,2,,2,4,13,,49,2,Baja California,2,HGR 20 Tijuana,728,1,0.289348172,19.38045395,2019-11-07,2
114909802,2,HGR 20 Tijuana,49,7,11,2019,20,1,20,14,1,2,34,1,38,2,5,2,1,,,,,,1,1,2,2,2,2,2,6,5,97,0,30,,,1,1,7,5,3,2,2,,,,50,,,6,4,40,3,10,1,5,2,4,6,,,1,1,1,1,2,1,2,2,2,2,1,1,2,2,3,1,1,1,1,1,1,1,2,,,,2,,,,1,9,1,10,2,,1,10,1,10,2,,1,8,2,,2,,,,,,,1,1,1,1,2,,1,1,1,1,1,2,9,8,8,8,7,7,2,2,,2,,2,,2,,2,995,,,49,2,Baja California,2,HGR 20 Tijuana,728,1,0.289348172,16.7796595,2019-11-07,2
114910509,2,HGR 20 Tijuana,49,7,11,2019,20,37,20,54,1,2,34,1,28,2,7,4,1,,,,,,1,1,2,2,2,2,2,4,97,97,,,,,2,2,7,7,4,2,2,,,,31,,,6,10,40,2,10,2,,2,1,2,997,99997,1,1,1,2,2,2,2,2,2,2,2,2,2,1,1,1,1,1,1,2,1,1,2,,,,2,,,,1,9,1,9,2,,1,10,2,,2,,1,7,2,,2,,,,,,,1,1,1,1,2,,1,1,1,1,1,2,9,9,8,7,8,7,2,2,,2,,2,,2,,2,3,21,,49,2,Baja California,2,HGR 20 Tijuana,728,1,0.289348172,19.38045395,2019-11-07,2
114841614,2,HGZ 30 Mexicali,50,7,11,2019,10,15,10,28,1,2,23,1,39,2,7,2,1,,,,,,1,2,2,2,2,2,2,6,97,97,,,,,2,2,6,96,2,1,2,,,,109,,,2,998,210,4,30,1,20,4,4,7,,,1,1,2,,,,,,,,,,,,,1,1,1,1,2,1,1,1,,,,1,,,,1,9,1,8,2,,2,,2,,2,,2,,2,,2,,,,,,,1,1,1,1,2,,1,1,1,1,1,1,7,8,8,9,9,8,1,2,,2,,2,,2,,1,995,,,50,2,Baja California,2,HGZ 30 Mexicali,629,1,0.25,33.559319,2019-11-07,2
114860100,2,HGZ 30 Mexicali,50,7,11,2019,12,25,12,38,1,2,21,1,20,2,6,5,1,,,,,,5,1,2,2,2,1,2,3,97,97,,,,,2,2,13,,3,2,2,,,,31,,,10,2,10,2,10,1,5,1,1,3,,,1,1,1,1,1,1,1,1,1,1,1,1,1,1,1,1,1,1,1,1,1,1,1,,,,2,,,,1,9,1,8,1,7,1,7,1,7,1,7,1,7,1,7,2,,,,,,,1,2,1,1,2,,1,1,1,1,1,1,8,6,8,8,8,5,2,2,,2,,2,,2,,2,1,,,50,2,Baja California,2,HGZ 30 Mexicali,629,1,0.25,38.76025733,2019-11-07,2
114865864,2,HGZ 30 Mexicali,50,7,11,2019,13,9,13,21,1,2,35,1,36,1,5,1,1,,,,,,1,2,2,2,2,2,2,6,97,2,,,2,0,2,2,13,,3,2,2,,,,22,,,8,1,120,5,240,1,240,5,1,2,22,99997,1,1,1,1,1,2,2,1,1,1,1,2,2,2,1,1,1,1,1,2,97,1,2,,,,2,,,,1,7,1,8,2,,1,6,2,,1,3,2,,2,,2,,,,,,,1,1,1,1,2,,1,1,1,1,1,1,3,5,3,5,5,97,,2,,2,,2,,2,,3,1,,,50,2,Baja California,2,HGZ 30 Mexicali,629,1,0.25,38.5184445,2019-11-07,2
114875941,2,HGZ 30 Mexicali,50,7,11,2019,14,16,14,29,1,2,21,1,39,2,5,2,1,,,,,,1,1,2,2,2,2,2,4,97,97,,,,,1,1,6,4,4,2,1,,,,31,,,10,4,99999,,1,97,,3,999,2,2,99999,1,1,1,1,1,1,2,1,1,1,1,1,1,1,4,1,1,2,1,2,99,1,2,,,,2,,,,2,,1,9,1,10,1,10,1,10,2,,2,,2,,2,,,,,,,1,1,1,1,1,8,1,1,1,1,1,1,8,9,6,6,9,7,2,2,,2,,2,,2,,2,21,18,16,50,2,Baja California,2,HGZ 30 Mexicali,629,1,0.25,33.559319,2019-11-07,2
114875942,2,HGZ 30 Mexicali,50,7,11,2019,14,28,14,41,1,2,19,1,30,2,5,2,1,,,,,,1,1,2,2,2,2,2,5,2,97,0,50,,,2,2,13,,2,2,2,,,,5,,,10,5,35,2,25,1,40,4,4,4,,,1,1,2,,,,,,,,,,,,,1,1,1,1,1,99,1,2,,,,2,,,,2,,1,10,2,,1,10,1,9,2,,2,,2,,2,,,,,,,1,1,1,1,2,,1,1,1,1,1,1,9,4,4,99,4,2,2,2,,1,500,2,,2,,2,995,,,50,2,Baja California,2,HGZ 30 Mexicali,629,1,0.25,38.7609079,2019-11-07,2
114908882,2,HGZ 30 Mexicali,50,7,11,2019,19,49,20,2,1,2,19,1,42,2,5,2,1,,,,,,1,2,2,2,2,2,2,4,97,97,,,,,1,1,6,4,4,2,4,2,3,8,18,,,8,1,120,5,45,1,120,5,4,7,,,1,1,1,1,1,1,2,1,1,1,1,2,2,2,3,1,1,1,1,2,2,1,2,,,,2,,,,2,,1,7,2,,1,8,1,8,2,,2,,2,,2,,,,,,,1,1,1,1,2,,1,1,1,1,1,1,5,4,3,97,4,97,,2,,2,,2,,2,,2,1,2,,50,2,Baja California,2,HGZ 30 Mexicali,629,1,0.25,33.559319,2019-11-07,2
114909598,2,HGZ 30 Mexicali,50,7,11,2019,19,59,20,12,1,2,39,1,25,1,5,2,1,,,,,,1,2,2,2,2,2,2,5,97,97,,,,,2,2,13,,2,2,2,,,,118,,,10,5,30,4,99999,1,30,4,4,99,,,1,1,2,,,,,,,,,,,,,1,1,1,1,1,1,1,2,,,,2,,,,2,,1,9,2,,1,10,1,7,2,,2,,1,9,2,,,,,,,1,1,1,1,2,,1,1,1,1,1,1,6,3,4,97,5,97,,2,,2,,2,,2,,1,27,23,11,50,2,Baja California,2,HGZ 30 Mexicali,629,1,0.25,44.48793555,2019-11-07,2
115393498,2,HGS 12 San Luis R�o Colorado,53,12,11,2019,9,28,9,41,1,2,21,1,54,1,3,5,1,,,,,,5,1,1,2,2,1,2,4,97,97,,,,,2,2,13,,3,2,2,,,,11,,,9,5,30,4,30,1,60,4,1,2,2,60,1,1,2,,,,,,,,,,,,,1,1,1,1,1,1,1,2,,,,2,,,,1,8,1,9,2,,2,,2,,2,,2,,2,,2,,,,,,,1,1,1,1,2,,1,1,1,1,1,2,7,9,6,4,8,5,2,2,,2,,2,,2,,2,1,23,,53,2,Baja California,2,HGS 12 San Luis R�o Colorado,183,2,0.180473373,20.73267327,2019-11-12,2
115393499,2,HGS 12 San Luis R�o Colorado,53,12,11,2019,9,36,9,49,1,2,24,1,45,1,3,5,1,,,,,,5,2,2,2,2,2,2,6,97,97,,,,,2,2,13,,4,2,2,,,,12,13,,9,5,99999,,99999,1,99999,2,1,2,2,60,1,1,1,2,2,2,2,1,1,1,2,1,1,2,1,1,1,1,1,1,1,2,2,,,,2,,,,2,,1,9,2,,2,,2,,1,8,2,,2,,2,,,,,,,2,2,2,2,2,,2,2,1,1,1,2,7,8,5,9,6,6,2,2,,2,,2,,2,,2,1,,,53,2,Baja California,2,HGS 12 San Luis R�o Colorado,183,2,0.180473373,20.73267327,2019-11-12,2
115408017,2,HGS 12 San Luis R�o Colorado,53,12,11,2019,11,51,12,4,1,2,24,1,47,1,4,5,1,,,,,,6,1,2,2,2,2,2,7,97,97,,,,,2,2,13,,3,2,2,,,,12,13,,7,5,20,2,20,1,60,5,1,2,2,60,1,2,2,,,,,,,,,,,,,2,2,,2,,2,2,2,,,,2,,,,2,,1,8,2,,2,,2,,2,,1,8,2,,2,,,,,,,1,1,1,1,2,,1,1,1,1,1,1,9,8,8,8,9,7,2,2,,2,,2,,2,,2,17,,,53,2,Baja California,2,HGS 12 San Luis R�o Colorado,183,2,0.180473373,20.73267327,2019-11-12,2
115441722,2,HGS 12 San Luis R�o Colorado,53,12,11,2019,16,17,16,30,1,2,36,1,48,2,5,3,1,,,,,,1,2,2,2,2,2,2,7,4,97,0,30,,,2,2,5,4,2,2,4,1,8,,32,,,8,4,60,5,30,1,60,5,2,2,2,45,1,1,1,1,1,1,1,1,1,2,1,1,1,1,1,1,1,1,1,2,99,1,2,,,,2,,,,2,,1,9,1,10,1,6,2,,2,,99,,2,,2,,,,,,,1,1,1,1,2,,1,2,1,1,1,1,6,7,9,7,8,8,1,1,700,2,,2,,2,,2,995,,,53,2,Baja California,2,HGS 12 San Luis R�o Colorado,183,2,0.180473373,18.06340845,2019-11-12,2