Folio,Deleg,Unidmed,Id_Unid,Fecha_D,Fecha_M,Fecha_A,Hr_Ini_H,Hr_Ini_M,Hr_Fin_H,Hr_Fin_M,Delegad_Edo,Delegad_Mun,Edad,Sexo,Edocivi,Escolar,Ocupa,Ingreso,Sat1,Sat3,Motcons2,Motcons2_Umae,Probsal_G,Probsal,Tiem_Esp2,Retro,Caqod,Filtroch,Consulta,Preosad,Tmsalud,Mhclinc,Expclaa_A,Expclaa_B,Expclaa_C,Expclaa_D,Expclab_A,Expclab_B,Expclab_C,Expclab_D,Mopin,Explora,Prevenf_A,Prevenf_B,Prevenf_C,Prevenf_D,Filtrourg,Calteurg,Mottesp,Tespurg,Servurg,Tobscama,Expurg,Clarurg,Califurg,Filtrocir,Progciru,Topera,Fechaop,Suspop3,Suspop1,Suspop4,Motoper,Motoper1,Infofam,Calciru,Filtrohos,Nochesh,Frecrevm,Asisenf,Infamho,Calhosp,Filtrosaux,Saduni,Temsad,Satlarx,Btratou,Calfatna_A,Calfatna_B,Calfatna_C,Calfatna_D,Calfatna_E,Calfatna_F,Calfatna_G,Calfatna_H,Calfatna_I,Calfatna_J,Calfatna_K,Calfatna_L,Calfatna_M,Calfatna_N,Calfatnb_A,Calfatnb_B,Calfatnb_C,Calfatnb_D,Calfatnb_E,Calfatnb_F,Calfatnb_G,Calfatnb_H,Calfatnb_I,Calfatnb_J,Calfatnb_K,Calfatnb_L,Calfatnb_M,Calfatnb_N,Calfinma_A,Calfinmb_A1,Calfinma_B,Calfinmb_B1,Calfinmb_B2,Calfinmb_B3,Calfinma_C,Calfinmb_C1,Calfinmb_C2,Calfinma_D,Calfinmb_D1,Calfinma_E,Calfinmb_E1,Calfinmb_F,Calfinmb_G,Calfinmb_H,Calfinmb_I,Calfinmb_J,Recomuni,Norecom,Corrup,Atn1fam,Filtrofarm,Tfarsurt,Totmed,Acnomed,Versurt,Versurt2,Farm1,Farm2,Farm5,Farm6_R,Farm6,Satmed,Sat2,Opelec_B,Opelec_C,Prefeserv,Filtroaten,Otroserv,Mot_Otro,Probsal2,Probsal2_G,Trato_Otro,Tmp_Otro,Sat_Otro,Mej_Serv,Info_Sp,Sat_Sp,Trato_Sp,Tmed_Sp,Prep_Sp,Inst_Sp,Hosp_Sp,Med_Sp,Coment,Coment_T,Edad_Fin,Id_Unidad,Cve_Delegaci�N,Delegaci�N,Nivel,Unidad,Promedio_Diario2012,Estrato,Moscondia,Fe_Finalnr,Fecha,Entidad
3157,10,Hospital de Especialidades Siglo XXI,3006,25,7,13,12,35,12,55,9,271,57,1,1,3,5,99,2,2,4,,1,1,7,1,1,1,2,1,1,1,1,1,1,1,1,2,1,2,1,2,1,1,1,2,2,,,,,,,,,2,,,,,,,,,,,2,,,,,,2,,,,1,1,2,1,2,2,2,2,2,2,2,2,2,2,2,1,,1,,,,,,,,,,,,1,2,1,4,4,4,1,2,1,2,,2,,2,1,1,2,99,1,,2,1,1,6,,,,,2,,,,,4,10,2,2,1,2,,,,,,,,,2,,,,,,,,,SIN COMENTARIO,5,3006,10,D.F. Sur,3,Hospital de Especialidades Siglo XXI,704,1,1,2.15350452183707000000,2013-07-25,9
2652,10,Hospital de Gineco-Obstetricia No. 4 San Angel,3008,25,7,13,16,40,16,59,9,267,29,1,2,5,2,2,3,3,4,,5,3,1,1,1,1,1,1,1,1,1,1,1,2,2,2,3,,1,1,1,1,1,1,2,,,,,,,,,2,,,,,,,,,,,2,,,,,,1,2,2,2,2,1,2,1,2,1,2,2,2,2,2,2,2,2,2,2,,2,,2,,,,,,,,,,1,2,1,3,3,3,1,2,2,2,,2,,2,2,2,2,2,1,,2,2,2,,,,,,1,1,,,,2,8,2,2,1,2,,,,,,,,,2,,,,,,,,,SIN COMENTARIO,2,3008,10,D.F. Sur,3,Hospital de Gineco-Obstetricia No. 4 San Angel,406,1,1,2.23636056073851000000,2013-07-25,9
675,14,Hospital de Gineco-Pediatr�a No. 48 Le�n,3012,17,7,13,13,43,13,56,14,0,25,1,2,5,6,3,2,2,4,,5,3,2,2,2,1,2,1,1,1,1,1,1,1,1,2,1,2,1,1,1,1,1,2,2,,,,,,,,,2,,,,,,,,,,,2,,,,,,1,1,1,2,1,1,2,1,2,1,1,2,2,2,2,2,2,2,2,2,,2,,2,2,,,,,,,,,1,2,1,4,4,3,1,2,2,2,,2,,3,2,2,99,1,1,,2,2,2,,,,,,2,,,,,2,7,2,2,1,2,,,,,,,,,2,,,,,,,,,SIN COMENTARIO,1,3012,14,Guanajuato,3,Hospital de Gineco-Pediatr�a No. 48 Le�n,296,1,1,1.47166958135023000000,2013-07-17,11
340,23,Hospital de Especialidades Puebla,3019,16,7,13,9,15,9,30,23,0,43,1,1,5,4,1,3,4,8,,1,4,2,99,2,2,,,,,,,,,,,,,,,,,,,2,,,,,,,,,2,,,,,,,,,,,2,,,,,,1,1,5,3,2,1,2,1,2,1,2,2,2,2,2,2,2,2,1,3,,3,,2,,,,,,,,,2,1,2,2,,,,1,3,3,2,,2,,2,2,2,2,3,1,,2,1,1,1,1,,1,1,1,1,,,,2,8,1,2,1,2,,,,,,,,,1,3,3,3,99,3,3,3,,SIN COMENTARIO,3,3019,23,Puebla,3,Hospital de Especialidades Puebla,611,1,1,2.46691423618400000000,2013-07-16,21
3314,10,Hospital de Especialidades Siglo XXI,3006,25,7,13,13,59,14,9,10,0,29,1,1,7,2,3,2,1,6,,1,8,6,2,1,1,2,1,1,1,1,1,1,2,2,2,2,,1,1,1,1,2,2,2,,,,,,,,,2,,,,,,,,,,,2,,,,,,1,1,4,2,2,1,1,1,2,1,2,1,1,2,2,2,1,1,1,2,2,2,,2,,2,4,,,,2,2,2,1,2,2,,,,1,2,2,1,2,1,2,1,2,2,99,2,1,,2,2,1,1,2,2,1,2,2,,,,,1,10,2,2,1,2,,,,,,,,,2,,,,,,,,1,ESTA MUY BUENO EL SERVICIO,2,3006,10,D.F. Sur,3,Hospital de Especialidades Siglo XXI,704,1,1,3.95406975949957000000,2013-07-25,9
1593,32,Hospital de Especialidades No. 14 Veracruz,3022,18,7,13,13,24,13,44,30,2273,48,1,1,5,7,2,4,4,2,,1,8,1,3,3,1,1,1,1,1,1,1,1,1,2,2,2,3,1,2,2,2,2,2,2,,,,,,,,,2,,,,,,,,,,,2,,,,,,2,,,,2,1,2,1,2,2,2,2,2,2,2,2,2,2,2,2,,2,,,,,,,,,,,,1,2,1,5,5,5,1,2,2,2,,2,,5,4,2,2,2,1,,2,99,2,,,,,,2,,,,,2,5,1,1,1,2,,,,,,,,,1,2,1,1,3,1,1,1,2,"QUE TENGAN PACIENCIA LOS DOCTORES, SON MUY  GROSEROS NOSABEN TRATAR A UNA, LES FALTA MUCHA PACIENCIA O HUMILDAD",4,3022,32,Veracruz Norte,3,Hospital de Especialidades No. 14 Veracruz,613,1,1,3.18712569533913000000,2013-07-18,30
942,23,Hospital de Traumatolog�a y Ortopedia Puebla,3020,17,7,13,8,32,8,48,21,1682,56,2,2,4,10,3,4,4,2,,3,12,3,3,2,1,2,2,3,2,1,2,2,2,4,,,,4,2,2,2,2,2,2,,,,,,,,,2,,,,,,,,,,,2,,,,,,2,,,,2,1,1,2,2,1,1,1,2,2,2,2,2,2,2,2,2,,,1,1,2,,,,,,,,1,2,2,,,,1,2,2,1,99,2,,2,4,4,2,2,1,,2,1,2,,,,,,2,,,,,3,5,2,2,1,2,,,,,,,,,1,4,99,3,99,99,99,99,,SIN COMENTARIO,5,3020,23,Puebla,3,Hospital de Traumatolog�a y Ortopedia Puebla,401,1,1,1.52968522294744000000,2013-07-17,21
1075,23,Hospital de Traumatolog�a y Ortopedia Puebla,3020,17,7,13,13,44,14,2,21,1676,59,1,2,5,4,3,4,4,7,999,3,13,3,1,3,1,2,2,1,1,2,2,2,1,,,,2,3,1,2,2,1,1,2,,,,,,,,,2,,,,,,,,,,,2,,,,,,1,2,3,2,2,2,2,2,1,2,2,2,2,2,2,2,2,2,2,,,,2,,,,,,,,,,,2,,1,2,2,4,1,2,2,2,,2,,2,2,2,2,2,1,,2,99,2,,,,,,1,1,,,,1,5,1,1,1,2,,,,,,,,,1,2,2,3,3,3,3,3,,SIN COMENTARIO,5,3020,23,Puebla,3,Hospital de Traumatolog�a y Ortopedia Puebla,401,1,1,1.83270627057108000000,2013-07-17,21
251,14,Hospital de Especialidades No. 1 Le�n,3011,16,7,13,17,2,17,24,14,0,47,1,2,5,4,1,3,3,3,,3,13,5,1,2,1,1,4,,1,2,2,2,2,,,,,2,2,2,2,2,2,2,,,,,,,,,2,,,,,,,,,,,2,,,,,,1,1,9,2,1,2,2,1,2,2,2,2,2,2,2,2,2,2,2,,,2,,,,,,,,,,,,2,,1,3,2,4,1,3,2,2,,2,,2,2,2,99,2,1,,2,1,2,,,,,,2,,,,,99,6,2,2,1,2,,,,,,,,,1,3,2,3,2,3,3,3,2,"PORQUE NO PERMITEN TRAER COMIDA A LOS DERECHOHABIENTES Y LOS MEDICOS SI PUEDEN, Y LOS BA�OS ESTAN MUY SUCIOS",4,3011,14,Guanajuato,3,Hospital de Especialidades No. 1 Le�n,744,1,1,2.87263788707359000000,2013-07-16,11
4081,9,Hospital de Traumatolog�a y Ortopedia Magdalena de la Salinas,3004,29,7,13,14,17,14,26,15,760,78,1,4,1,5,3,2,2,6,,3,14,3,2,2,1,2,2,3,1,2,2,2,2,,,,,2,1,1,1,1,1,2,,,,,,,,,2,,,,,,,,,,,2,,,,,,1,2,6,4,4,2,2,1,2,2,2,2,2,2,2,2,2,2,2,,,2,,,,,,,,,,,,1,2,2,,,,1,2,2,2,,2,,2,2,2,99,2,1,,2,1,2,,,,,,2,,,,,4,9,2,2,1,2,,,,,,,,,2,,,,,,,,,SIN COMENTARIO,6,3004,9,D.F. Norte,3,Hospital de Traumatolog�a y Ortopedia Magdalena de la Salinas,924,1,1,2.38043838223635000000,2013-07-29,9
2814,21,Hospital de Traumatolog�a y Ortopedia No. 21 Monterrey,3016,23,7,13,19,9,19,28,19,953,36,2,2,5,4,2,1,1,6,,3,14,2,1,1,1,2,2,1,1,1,2,1,1,2,,2,2,1,1,1,1,2,2,2,,,,,,,,,2,,,,,,,,,,,2,,,,,,2,,,,2,1,1,1,2,1,2,2,2,2,2,2,2,2,2,1,1,1,,1,,,,,,,,,,1,2,1,4,3,3,1,1,1,2,,2,,2,1,2,2,2,1,,2,2,2,,,,,,2,,,,,4,4,2,2,1,2,,,,,,,,,1,1,1,1,3,1,1,1,,SIN COMENTARIO,3,3016,21,Nuevo Le�n,3,Hospital de Traumatolog�a y Ortopedia No. 21 Monterrey,572,1,1,3.00906473052653000000,2013-07-23,19
983,23,Hospital de Traumatolog�a y Ortopedia Puebla,3020,17,7,13,10,35,10,47,21,1682,22,1,2,9,6,3,2,2,6,,3,14,2,1,3,1,1,1,1,1,1,1,1,1,2,2,2,2,1,1,2,2,2,2,2,,,,,,,,,2,,,,,,,,,,,2,,,,,,2,,,,2,1,2,1,2,2,2,2,2,2,2,2,2,2,1,2,,2,,,,,,,,,,,2,1,1,2,,,,1,2,2,2,,2,,2,3,2,4,2,1,,2,1,1,1,1,,1,1,2,,,,,2,7,2,2,1,2,,,,,,,,,1,2,3,3,3,3,1,3,,SIN COMENTARIO,1,3020,23,Puebla,3,Hospital de Traumatolog�a y Ortopedia Puebla,401,1,1,1.54008868839455000000,2013-07-17,21
3404,13,Hospital de Traumatolog�a y Ortopedia Lomas Verdes,3010,25,7,13,12,6,12,22,13,0,34,1,2,3,5,1,2,1,2,,3,14,1,1,2,1,1,1,1,1,1,2,1,1,2,,2,2,1,99,2,2,2,2,2,,,,,,,,,2,,,,,,,,,,,2,,,,,,1,1,3,3,2,2,2,1,2,2,1,2,2,2,2,2,2,2,2,,,1,,,2,,,,,,,,,1,2,2,,,,2,,,2,,2,,2,2,2,2,2,1,,2,2,2,,,,,,2,,,,,99,10,2,2,1,2,,,,,,,,,2,,,,,,,,,SIN COMENTARIO,2,3010,13,M�xico Poniente,3,Hospital de Traumatolog�a y Ortopedia Lomas Verdes,404,1,1,1.80068918714236000000,2013-07-25,15
3573,13,Hospital de Traumatolog�a y Ortopedia Lomas Verdes,3010,25,7,13,18,48,19,3,15,760,34,1,2,5,5,1,4,2,2,,3,14,1,3,99,1,1,1,1,2,1,1,1,1,2,2,2,2,1,2,2,2,2,2,2,,,,,,,,,2,,,,,,,,,,,2,,,,,,2,,,,2,1,2,1,2,1,2,2,2,2,2,2,2,2,2,2,,2,,1,,,,,,,,,,1,2,2,,,,1,1,1,2,,2,,2,2,2,99,99,1,,2,2,1,1,1,,1,1,2,,,,,99,4,2,2,1,2,,,,,,,,,2,,,,,,,,,SIN COMENTARIO,2,3010,13,M�xico Poniente,3,Hospital de Traumatolog�a y Ortopedia Lomas Verdes,404,1,1,1.80068918714236000000,2013-07-25,15
121,14,Hospital de Especialidades No. 1 Le�n,3011,16,7,13,17,0,17,17,14,0,31,2,2,5,2,3,2,2,2,,3,14,6,1,1,1,1,2,1,1,1,1,1,1,2,2,2,2,2,1,2,2,2,2,2,,,,,,,,,2,,,,,,,,,,,2,,,,,,1,1,1,2,1,2,1,1,2,2,1,1,2,2,2,2,1,2,2,,2,2,,,2,1,,,,,4,,,1,2,1,5,5,3,1,2,2,2,,2,,2,2,2,3,2,1,,2,1,2,,,,,,2,,,,,2,8,2,2,1,2,,,,,,,,,1,2,2,2,2,1,1,2,,SIN COMENTARIO,2,3011,14,Guanajuato,3,Hospital de Especialidades No. 1 Le�n,744,1,1,2.69660312299732000000,2013-07-16,11
4141,9,Hospital de Traumatolog�a y Ortopedia Magdalena de la Salinas,3004,29,7,13,12,36,12,49,9,269,29,1,6,9,2,4,3,3,3,,3,14,1,2,2,1,1,1,1,1,1,1,1,1,2,2,1,1,1,1,2,2,2,2,2,,,,,,,,,2,,,,,,,,,,,2,,,,,,1,2,1,99,3,1,2,1,2,2,2,2,1,2,2,2,2,2,2,3,,2,,,,,3,,,,,,,1,2,2,,,,1,2,2,2,,1,2,2,2,2,2,4,99,,2,1,2,,,,,,2,,,,,99,5,1,2,1,2,,,,,,,,,2,,,,,,,,2,QUE MEJOREN TODO EL HOSPITAL,2,3004,9,D.F. Norte,3,Hospital de Traumatolog�a y Ortopedia Magdalena de la Salinas,924,1,1,3.25803465624653000000,2013-07-29,9
2736,21,Hospital de Traumatolog�a y Ortopedia No. 21 Monterrey,3016,23,7,13,13,40,14,0,19,986,42,1,2,5,5,99,2,2,4,,3,14,3,1,1,1,2,1,1,1,1,2,1,1,2,,2,2,99,2,2,2,2,2,2,,,,,,,,,2,,,,,,,,,,,2,,,,,,1,1,3,1,2,2,2,1,1,2,2,2,2,2,2,2,2,2,2,,,2,2,,,,,,,,,,,1,3,1,3,3,2,1,2,99,2,,2,,3,3,2,2,2,1,,2,99,2,,,,,,1,1,,,,2,8,2,2,1,2,,,,,,,,,1,3,99,99,3,99,99,3,,SIN COMENTARIO,3,3016,21,Nuevo Le�n,3,Hospital de Traumatolog�a y Ortopedia No. 21 Monterrey,572,1,1,3.06441574055238000000,2013-07-23,19
2825,21,Hospital de Traumatolog�a y Ortopedia No. 21 Monterrey,3016,23,7,13,15,20,15,42,19,986,43,1,1,5,2,3,2,2,4,,3,14,1,1,1,1,2,1,1,1,1,1,1,1,2,2,2,2,1,2,2,2,2,2,2,,,,,,,,,2,,,,,,,,,,,2,,,,,,1,1,2,2,2,1,2,1,2,2,2,2,2,2,2,2,2,2,2,2,,2,,,,,,,,,,,,1,4,1,4,4,4,1,4,4,2,,2,,4,2,99,99,99,1,,2,2,2,,,,,,1,2,1,2,300,4,5,1,2,1,2,,,,,,,,,1,2,1,1,1,1,1,1,,SIN COMENTARIO,3,3016,21,Nuevo Le�n,3,Hospital de Traumatolog�a y Ortopedia No. 21 Monterrey,572,1,1,3.06441574055238000000,2013-07-23,19
2857,21,Hospital de Traumatolog�a y Ortopedia No. 21 Monterrey,3016,23,7,13,12,0,12,21,19,986,21,2,1,5,2,3,2,2,4,,3,14,1,1,1,1,2,1,1,1,1,2,1,1,2,,2,2,1,1,1,2,2,2,2,,,,,,,,,2,,,,,,,,,,,2,,,,,,1,1,1,2,2,1,2,1,2,2,2,2,2,2,2,2,2,2,2,2,,2,,,,,,,,,,,,1,2,2,,,,1,2,2,2,,2,,2,1,1,2,2,1,,2,1,2,,,,,,2,,,,,3,8,2,2,1,2,,,,,,,,,1,2,1,1,2,2,1,3,,SIN COMENTARIO,1,3016,21,Nuevo Le�n,3,Hospital de Traumatolog�a y Ortopedia No. 21 Monterrey,572,1,1,2.97098094062054000000,2013-07-23,19
2860,21,Hospital de Traumatolog�a y Ortopedia No. 21 Monterrey,3016,23,7,13,10,46,11,8,19,986,22,2,1,7,2,4,2,2,4,,3,14,1,1,1,1,2,1,1,1,1,1,1,1,2,1,1,2,1,1,1,1,1,2,2,,,,,,,,,2,,,,,,,,,,,2,,,,,,1,1,1,2,2,1,2,1,2,2,2,2,2,2,2,2,2,2,2,1,,1,,,,,,,,,,,,1,2,2,,,,1,2,2,2,,2,,1,2,1,1,1,1,,2,2,2,,,,,,2,,,,,2,9,2,2,1,2,,,,,,,,,2,,,,,,,,,SIN COMENTARIO,1,3016,21,Nuevo Le�n,3,Hospital de Traumatolog�a y Ortopedia No. 21 Monterrey,572,1,1,2.97098094062054000000,2013-07-23,19
976,23,Hospital de Traumatolog�a y Ortopedia Puebla,3020,17,7,13,10,50,11,4,21,1682,38,2,4,7,2,99,5,3,4,,3,14,1,97,,1,1,2,3,2,2,1,1,2,,2,2,,1,2,2,2,2,2,2,,,,,,,,,2,,,,,,,,,,,2,,,,,,1,2,1,2,2,2,1,1,2,2,1,1,2,2,2,2,1,1,2,,2,2,,,2,2,,,,,2,2,,1,2,2,,,,1,2,2,2,,2,,2,99,2,5,2,1,,2,99,2,,,,,,1,1,,,,2,8,2,99,1,2,,,,,,,,,1,2,1,2,99,2,2,3,,SIN COMENTARIO,3,3020,23,Puebla,3,Hospital de Traumatolog�a y Ortopedia Puebla,401,1,1,1.84752577031339000000,2013-07-17,21
4213,9,Hospital de Traumatolog�a y Ortopedia Magdalena de la Salinas,3004,29,7,13,10,14,10,26,9,269,29,1,2,5,3,3,2,3,5,,3,14,1,1,1,1,1,1,1,2,1,1,1,1,2,2,2,2,3,1,1,1,1,1,2,,,,,,,,,2,,,,,,,,,,,2,,,,,,1,1,1,3,3,1,1,1,1,1,1,2,1,2,2,2,1,2,1,2,2,2,2,1,1,,1,,,,2,,1,1,99,2,,,,1,2,2,2,,2,,2,2,4,4,3,1,,2,2,1,1,1,,2,,2,,,,,99,8,1,2,1,2,,,,,,,,,2,,,,,,,,2,HAY MUCHA GENTE MUY PREPOTENTE. NO ATIENDEN LOS MEDICOS COMO DEBE DE SER,2,3004,9,D.F. Norte,3,Hospital de Traumatolog�a y Ortopedia Magdalena de la Salinas,924,1,1,3.25803465624653000000,2013-07-29,9
4412,21,Hospital de Especialidades No. 34 Lincoln,3018,25,7,13,15,4,15,25,19,0,50,1,2,3,5,2,2,2,6,,1,15,1,1,1,1,1,2,1,1,1,1,1,1,2,2,2,2,2,1,1,2,2,2,2,,,,,,,,,2,,,,,,,,,,,2,,,,,,1,2,4,2,4,1,1,1,2,1,2,2,2,2,2,2,2,2,2,2,3,2,,1,,,,,,,,,,1,2,1,1,1,1,1,1,1,2,,2,,1,4,1,1,1,1,,2,2,2,,,,,,2,,,,,2,6,1,2,1,2,,,,,,,,,1,2,1,3,3,3,3,3,,SIN COMENTARIO,4,3018,21,Nuevo Le�n,3,Hospital de Especialidades No. 34 Lincoln,116,1,1,2.27520944984873000000,2013-07-25,19
149,14,Hospital de Especialidades No. 1 Le�n,3011,16,7,13,10,18,10,34,14,0,84,1,4,2,5,2,2,1,7,999,1,15,5,1,1,1,2,1,1,2,2,1,2,2,,2,,,4,1,1,1,1,1,2,,,,,,,,,2,,,,,,,,,,,2,,,,,,1,1,5,2,1,2,2,1,2,1,2,2,2,2,2,2,2,2,2,,,1,,1,,,,,,,,,,1,2,2,,,,1,4,4,2,,2,,3,3,2,99,3,1,,2,2,2,,,,,,1,99,,,,4,9,2,2,1,2,,,,,,,,,1,2,3,3,3,99,99,3,,SIN COMENTARIO,6,3011,14,Guanajuato,3,Hospital de Especialidades No. 1 Le�n,744,1,1,1.82404486242160000000,2013-07-16,11
469,23,Hospital de Especialidades Puebla,3019,16,7,13,9,46,9,59,23,0,28,2,1,8,7,3,2,2,8,,5,17,5,1,2,2,,,,,,,,,,,,,,,,,,,2,,,,,,,,,2,,,,,,,,,,,2,,,,,,1,1,3,2,2,2,1,2,2,2,2,1,2,2,2,1,2,2,2,,2,,,,,2,,,,2,,,,1,4,1,5,5,5,1,4,2,1,4,2,,4,3,3,4,3,1,,2,1,2,,,,,,2,,,,,2,2,2,1,1,2,,,,,,,,,1,5,3,3,2,4,3,3,,SIN COMENTARIO,2,3019,23,Puebla,3,Hospital de Especialidades Puebla,611,1,1,1.90680542497711000000,2013-07-16,21
3633,17,Hospital de Gineco-Obstetricia Oblatos,3014,24,7,13,8,42,8,57,14,594,39,1,2,3,11,2,2,2,6,,8,23,4,2,2,2,,,,,,,,,,,,,,,,,,,2,,,,,,,,,2,,,,,,,,,,,2,,,,,,1,1,3,2,1,1,2,2,2,1,2,1,2,2,2,2,1,1,2,2,,,,2,,2,,,,,2,2,,2,,2,,,,1,2,2,1,2,2,,2,2,2,2,2,1,,2,2,2,,,,,,1,1,,,,2,10,2,2,1,2,,,,,,,,,2,,,,,,,,,SIN COMENTARIO,3,3014,17,Jalisco,3,Hospital de Gineco-Obstetricia Oblatos,262,1,1,2.25332243802772000000,2013-07-24,14
4755,7,Hospital de Especialidades No. 71 Torre�n,3001,24,7,13,13,22,13,40,5,67,60,2,2,2,2,4,3,1,6,,1,29,2,2,1,1,1,3,,99,99,99,99,99,,,,,99,99,99,99,99,99,2,,,,,,,,,2,,,,,,,,,,,2,,,,,,1,1,1,1,1,1,2,2,1,2,2,2,2,2,2,2,2,1,2,1,,,2,,,,,,,,,2,,1,1,2,,,,1,1,2,2,,2,,2,3,1,1,1,1,,2,99,2,,,,,,1,1,,,,1,9,2,2,1,2,,,,,,,,,2,,,,,,,,,SIN COMENTARIO,5,3001,7,Coahuila,3,Hospital de Especialidades No. 71 Torre�n,272,1,1,1.43617166709403000000,2013-07-24,5
4743,7,Hospital de Especialidades No. 71 Torre�n,3001,24,7,13,10,45,11,3,7,0,47,1,2,5,5,3,3,3,4,,1,29,6,3,3,1,2,3,,2,1,1,1,1,1,2,2,1,3,1,1,1,1,1,2,,,,,,,,,2,,,,,,,,,,,2,,,,,,1,1,1,2,1,2,2,1,2,2,2,2,2,2,2,2,2,2,2,,,2,,,,,,,,,,,,2,,2,,,,1,2,2,2,,2,,3,2,2,3,3,1,,2,1,2,,,,,,1,2,2,,,4,6,2,2,1,99,,,,,,,,,1,4,3,1,3,3,3,1,2,"YO VENGO A QUE ME INTERNEN PARA OPERACI�N Y RESULTA QUE HASTA QUE ESTOY AQU� ME DICEN QUE EL APARATO EST� DESCOMPUESTO, FALTA DE RESPETO PARA EL DERECHOHABIENTE",4,3001,7,Coahuila,3,Hospital de Especialidades No. 71 Torre�n,272,1,1,1.97091798492653000000,2013-07-24,5
3850,17,Hospital de Especialidades Oblatos,3013,26,7,13,10,28,10,38,14,570,72,1,4,1,9,3,2,3,4,,1,29,1,2,2,1,2,1,1,1,1,1,1,2,2,2,2,,1,2,2,2,1,2,2,,,,,,,,,2,,,,,,,,,,,2,,,,,,1,1,1,2,2,1,1,1,2,1,2,2,2,2,2,2,2,2,1,3,3,2,,3,,,,,,,,,2,1,2,1,2,2,2,1,2,2,2,,2,,2,2,2,2,2,1,,2,99,1,1,2,1,1,2,1,2,1,1,100,4,8,2,2,1,2,,,,,,,,,2,,,,,,,,,SIN COMENTARIO,6,3013,17,Jalisco,3,Hospital de Especialidades Oblatos,666,1,1,1.71452676134707000000,2013-07-26,14
1644,32,Hospital de Especialidades No. 14 Veracruz,3022,18,7,13,16,59,17,18,30,2167,43,1,2,99,5,99,2,2,4,,1,29,1,2,2,1,2,2,2,1,1,2,1,1,2,,2,2,1,1,2,2,2,2,2,,,,,,,,,2,,,,,,,,,,,2,,,,,,2,,,,2,1,2,1,2,2,2,2,2,2,2,2,2,2,1,2,,2,,,,,,,,,,,4,1,2,1,3,3,4,1,2,4,2,,2,,2,2,2,2,4,1,,2,2,1,4,1,,1,1,1,1,,,,2,8,2,1,1,2,,,,,,,,,1,2,2,2,2,2,2,3,,SIN COMENTARIO,3,3022,32,Veracruz Norte,3,Hospital de Especialidades No. 14 Veracruz,613,1,1,3.44532505839143000000,2013-07-18,30
4679,7,Hospital de Especialidades No. 71 Torre�n,3001,24,7,13,10,40,11,1,7,0,63,1,4,3,5,99,2,2,6,,16,39,3,1,1,1,2,2,1,1,1,2,1,1,2,,1,1,3,1,2,2,2,2,2,,,,,,,,,2,,,,,,,,,,,2,,,,,,1,2,2,2,2,1,2,1,2,1,2,2,2,2,2,2,2,2,2,2,,2,,1,,,,,,,,,,1,2,1,5,5,5,1,5,5,2,,2,,4,2,2,2,2,1,,2,2,2,,,,,,1,1,,,,2,8,2,2,1,2,,,,,,,,,2,,,,,,,,2,LA LIMPIEZA DE LAS INSTALACIONES Y EL BA�O SON P�CIMOS LAS REPORTE CON EL ENCARGADO DE INTENDENCIA Y NO LIMPIARON,5,3001,7,Coahuila,3,Hospital de Especialidades No. 71 Torre�n,272,1,1,1.39769161022835000000,2013-07-24,5
450,23,Hospital de Especialidades Puebla,3019,16,7,13,12,11,12,35,23,0,40,2,2,5,2,4,2,2,6,,16,39,4,1,1,1,2,1,1,1,2,1,1,2,,4,1,,4,2,2,2,2,2,2,,,,,,,,,2,,,,,,,,,,,2,,,,,,1,1,4,2,1,1,2,1,2,1,2,2,1,2,2,2,2,2,2,1,,1,,1,,,2,,,,,,,2,,2,,,,1,3,3,1,4,2,,3,4,2,4,2,1,,2,1,2,,,,,,1,1,,,,3,8,1,1,1,2,,,,,,,,,1,2,1,1,3,1,3,3,,SIN COMENTARIO,3,3019,23,Puebla,3,Hospital de Especialidades Puebla,611,1,1,2.05434859056906000000,2013-07-16,21
346,23,Hospital de Especialidades Puebla,3019,16,7,13,17,10,17,29,23,0,79,1,2,1,5,1,3,3,7,999,16,39,4,1,1,1,2,1,1,1,1,2,1,1,1,,1,1,1,1,2,2,2,2,2,,,,,,,,,2,,,,,,,,,,,2,,,,,,2,,,,1,2,2,1,2,2,2,2,2,2,2,2,1,2,2,,,1,,,,,,,,,1,,,1,1,1,1,2,1,1,1,1,2,,2,,1,1,1,1,1,1,,2,1,2,,,,,,1,99,,,,99,8,2,2,1,2,,,,,,,,,2,,,,,,,,,SIN COMENTARIO,6,3019,23,Puebla,3,Hospital de Especialidades Puebla,611,1,1,2.38382878208429000000,2013-07-16,21
2995,21,Hospital de Especialidades No. 25 Monterrey,3015,19,7,13,18,41,19,1,19,986,55,2,2,3,2,3,5,4,8,,16,39,4,2,2,1,2,1,2,1,1,1,1,1,2,2,2,2,1,1,2,2,2,2,2,,,,,,,,,2,,,,,,,,,,,2,,,,,,1,1,1,2,4,1,2,1,2,1,2,2,2,2,2,2,2,2,2,2,,3,,2,,,,,,,,,,1,2,1,2,3,3,1,2,2,2,,2,,3,2,2,2,2,2,2,2,2,2,,,,,,2,,,,,99,6,1,1,1,2,,,,,,,,,1,3,2,2,2,3,2,3,2,QUE NO POSTERGEN TANTO LAS OPERACIONES Y QUE ATIENDAN BIEN AL DERECHOHABIENTE,5,3015,21,Nuevo Le�n,3,Hospital de Especialidades No. 25 Monterrey,551,1,1,2.69393779166806000000,2013-07-19,19
297,14,Hospital de Especialidades No. 1 Le�n,3011,16,7,13,11,1,11,12,14,0,20,1,1,5,5,99,2,2,6,,1,40,3,1,1,1,2,1,1,1,1,1,1,1,2,2,2,2,1,1,1,1,1,1,2,,,,,,,,,2,,,,,,,,,,,2,,,,,,1,1,1,2,1,1,2,1,2,2,2,2,2,2,2,2,2,2,2,2,,1,,,,,,,,,,,,1,1,2,,,,1,1,2,2,,2,,2,2,2,1,1,1,,2,1,2,,,,,,2,,,,,1,10,2,2,1,2,,,,,,,,,2,,,,,,,,,SIN COMENTARIO,1,3011,14,Guanajuato,3,Hospital de Especialidades No. 1 Le�n,744,1,1,2.14027405348292000000,2013-07-16,11
3700,17,Hospital de Gineco-Obstetricia Oblatos,3014,24,7,13,18,21,18,30,14,570,51,1,2,5,5,4,4,2,6,,5,41,4,1,1,1,1,1,1,1,1,1,2,2,1,1,,,1,1,2,2,2,2,2,,,,,,,,,2,,,,,,,,,,,2,,,,,,1,2,3,2,1,1,2,1,2,2,2,2,1,2,2,2,1,2,2,2,,1,,,,,2,,,,2,,,1,1,2,,,,1,2,2,2,,2,,2,4,2,4,2,1,,2,1,2,,,,,,2,,,,,4,8,2,1,1,2,,,,,,,,,1,2,3,3,3,3,3,3,,SIN COMENTARIO,4,3014,17,Jalisco,3,Hospital de Gineco-Obstetricia Oblatos,262,1,1,2.33925603964800000000,2013-07-24,14
3206,10,Hospital de Especialidades Siglo XXI,3006,25,7,13,11,58,12,20,9,275,38,1,1,5,4,2,4,2,3,,2,43,7,2,2,1,2,2,3,1,1,1,1,1,2,2,2,2,1,1,2,2,2,2,2,,,,,,,,,2,,,,,,,,,,,2,,,,,,1,1,4,2,2,2,2,1,1,1,2,2,2,2,2,2,1,2,2,,,1,2,4,,,,,,,4,,,1,4,1,4,4,5,1,5,4,2,,2,,5,2,2,2,4,1,,2,1,1,1,1,,1,1,1,2,2,,,2,0,1,1,1,2,,,,,,,,,1,1,1,99,3,3,2,3,,SIN COMENTARIO,3,3006,10,D.F. Sur,3,Hospital de Especialidades Siglo XXI,704,1,1,3.74595031060608000000,2013-07-25,9
429,23,Hospital de Especialidades Puebla,3019,16,7,13,13,54,14,9,23,0,58,1,1,3,2,2,4,5,8,,1,48,1,3,97,1,1,1,3,1,2,2,2,2,,,,,3,2,2,2,1,1,2,,,,,,,,,2,,,,,,,,,,,2,,,,,,2,,,,5,1,1,1,2,1,2,2,2,1,2,1,1,2,1,4,4,5,,2,,,,2,,2,5,,2,1,2,1,4,2,4,1,2,2,2,,2,,4,4,4,2,2,2,4,2,1,1,1,1,,1,1,2,,,,,2,1,1,1,1,2,,,,,,,,,1,4,3,3,3,1,3,3,,SIN COMENTARIO,5,3019,23,Puebla,3,Hospital de Especialidades Puebla,611,1,1,1.96978565886058000000,2013-07-16,21
1989,34,Hospital de Especialidades No. 1 M�rida,3023,22,7,13,13,16,13,35,31,2342,73,2,2,3,9,3,2,2,4,,1,49,1,1,1,1,2,1,1,1,1,1,1,1,2,2,2,2,1,1,1,1,1,1,2,,,,,,,,,2,,,,,,,,,,,2,,,,,,1,1,2,2,2,1,2,1,2,2,2,2,2,2,2,2,2,2,2,2,,2,,,,,,,,,,,,1,2,1,2,1,2,2,,,2,,2,,2,2,2,2,2,1,,2,2,2,,,,,,1,2,2,,,2,8,1,1,1,2,,,,,,,,,1,4,99,3,2,3,3,3,2,HAY DESABASTO DE MEDICAMENTOS TE DICEN QUE TODO MEDICAMENTO ES IMPORTANTE EN LA FARMACIA PERO NO TE DAN SOLUCION AL PROBLEMA SOBRE TODO EN LA FARMACIA DEL UMAE,6,3023,34,Yucat�n,3,Hospital de Especialidades No. 1 M�rida,146,1,1,1.68416919849849000000,2013-07-22,31
772,14,Hospital de Gineco-Pediatr�a No. 48 Le�n,3012,17,7,13,8,58,9,17,14,0,29,1,2,5,5,2,2,2,4,,5,3,2,1,1,1,1,1,1,1,1,1,1,1,2,2,2,2,1,1,1,1,1,2,2,,,,,,,,,2,,,,,,,,,,,2,,,,,,1,2,2,2,2,1,1,1,2,2,2,2,2,2,1,2,1,2,2,1,2,2,,,,,,,1,,2,,,1,2,1,2,2,2,1,2,2,2,,2,,2,1,2,2,2,1,,2,1,2,,,,,,2,,,,,99,8,2,2,2,2,,,,,,,,,1,1,1,3,3,2,99,99,,SIN COMENTARIO,2,3012,14,Guanajuato,3,Hospital de Gineco-Pediatr�a No. 48 Le�n,296,1,1,1.35880941768528000000,2013-07-17,11
4476,21,Hospital de Gineco-Obstetricia No. 23 Monterrey,3017,24,7,13,8,0,8,23,19,986,31,1,2,5,5,4,3,2,6,,5,3,3,2,1,1,1,1,1,1,1,2,1,1,2,,2,1,1,2,1,1,1,2,2,,,,,,,,,2,,,,,,,,,,,2,,,,,,1,1,3,2,2,2,2,1,2,1,2,2,2,2,2,1,2,2,2,,,2,,2,,,,,,2,,,,1,3,1,5,2,4,1,2,2,2,,2,,3,2,2,2,99,2,999,2,1,1,6,,,,,2,,,,,99,2,2,2,2,2,,,,,,,,,1,1,2,3,3,2,3,3,,SIN COMENTARIO,2,3017,21,Nuevo Le�n,3,Hospital de Gineco-Obstetricia No. 23 Monterrey,544,1,1,2.57746681114823000000,2013-07-24,19
4230,9,Hospital de Traumatolog�a y Ortopedia Magdalena de la Salinas,3004,29,7,13,10,47,11,1,9,269,30,2,6,4,4,2,3,3,5,,1,6,1,97,,1,2,1,1,2,1,1,1,1,2,2,2,2,1,1,2,2,2,2,2,,,,,,,,,2,,,,,,,,,,,2,,,,,,1,1,1,3,3,1,2,1,2,1,1,2,1,2,2,2,2,2,2,2,,2,,1,2,,1,,,,,,,1,2,2,,,,1,3,3,2,,1,1,2,2,2,2,2,1,,2,2,2,,,,,,2,,,,,99,9,1,1,2,2,,,,,,,,,2,,,,,,,,,SIN COMENTARIO,2,3004,9,D.F. Norte,3,Hospital de Traumatolog�a y Ortopedia Magdalena de la Salinas,924,1,1,3.10850844224707000000,2013-07-29,9
2326,9,Hospital de Especialidades La Raza,3003,24,7,13,10,10,10,25,9,280,41,1,2,9,10,99,5,5,8,,1,6,3,3,3,1,2,4,,1,1,1,1,2,3,4,4,,4,1,2,2,1,2,2,,,,,,,,,2,,,,,,,,,,,2,,,,,,1,1,9,5,4,2,2,2,1,2,2,2,1,2,2,2,1,2,2,,,,3,,,,5,,,,2,,,1,2,1,5,5,5,1,3,3,2,,1,3,3,3,3,99,4,2,1,2,1,2,,,,,,2,,,,,99,5,1,1,2,2,,,,,,,,,1,5,3,3,3,3,3,3,2,ESTAN SUCIOS LOS BA�OS NO HAY NI PAPEL LAS INSTALACIONES EN GENERAL ESTAN VIEJAS,3,3003,9,D.F. Norte,3,Hospital de Especialidades La Raza,471,1,1,1.93015553848716000000,2013-07-24,9
1548,9,Hospital General La Raza,3002,19,7,13,17,15,17,26,15,681,51,1,1,3,5,3,1,1,6,,1,15,3,1,1,1,2,1,1,1,1,97,1,1,2,,2,2,2,1,1,1,1,2,2,,,,,,,,,2,,,,,,,,,,,2,,,,,,1,2,99,2,2,1,2,1,2,2,2,2,2,2,2,2,2,1,2,1,,1,,,,,,,,,,2,,1,2,1,2,2,4,1,2,2,2,,2,,2,2,2,2,2,1,,2,2,2,,,,,,2,,,,,2,10,2,2,2,2,,,,,,,,,2,,,,,,,,,SIN COMENTARIO,4,3002,9,D.F. Norte,3,Hospital General La Raza,580,1,1,2.41665669495581000000,2013-07-19,9
2197,9,Hospital de Gineco-Obstetricia La Raza,3005,23,7,13,12,17,12,30,15,713,44,1,1,7,2,3,4,4,2,,10,21,6,2,2,2,,,,,,,,,,,,,,,,,,,2,,,,,,,,,2,,,,,,,,,,,2,,,,,,1,1,6,2,2,1,1,2,2,1,2,1,1,2,2,2,2,2,2,2,2,,,2,,2,1,,,,,,,2,,1,2,5,4,1,2,2,1,2,1,2,2,4,2,2,2,2,2,2,2,2,,,,,,1,2,1,5,1200,5,9,1,2,2,2,,,,,,,,,2,,,,,,,,2,EN EL HOSPITAL DE ZONA LAS CITAS SON MUY LARGAS.LOS MEDICAMENTOS NO HAY  Y LO TENGO QUE COMPRAR ES MUY CARO.SE SOLICITA INFORMACION Y NO ME LA PROPORCIONAN PARA TOMAR OTRA OPINION,3,3005,9,D.F. Norte,3,Hospital de Gineco-Obstetricia La Raza,317,1,1,1.79453856765228000000,2013-07-23,9
2189,9,Hospital de Gineco-Obstetricia La Raza,3005,23,7,13,15,53,16,16,15,689,52,2,1,5,5,2,2,1,6,,1,29,1,2,2,2,,,,,,,,,,,,,,,,,,,2,,,,,,,,,2,,,,,,,,,,,2,,,,,,1,1,1,1,1,2,2,1,2,2,2,1,1,2,2,2,2,2,2,,,2,,,,1,1,,,,,,,2,,1,3,3,3,2,,,1,2,1,3,2,2,3,3,3,1,,2,1,2,,,,,,1,1,,,,1,9,2,2,2,2,,,,,,,,,2,,,,,,,,,SIN COMENTARIO,4,3005,9,D.F. Norte,3,Hospital de Gineco-Obstetricia La Raza,317,1,1,2.10932094751030000000,2013-07-23,9
1263,10,Hospital de Oncolog�a Siglo XXI,3007,19,7,13,10,55,11,15,15,669,68,1,2,4,5,99,1,1,2,,1,29,2,1,1,1,2,1,1,1,1,1,1,1,2,2,2,2,4,1,1,1,1,2,2,,,,,,,,,2,,,,,,,,,,,2,,,,,,1,1,3,2,2,2,2,1,2,1,2,2,2,2,2,2,2,2,1,,,2,,2,,,,,,,,,2,1,2,1,4,2,4,1,2,2,2,,2,,2,2,2,99,99,1,,2,1,1,1,1,,1,1,1,1,,,,4,7,2,2,2,2,,,,,,,,,1,4,3,99,99,99,3,3,1,FELICITO A LOS DOCTORES DE HEMATOLOGIA POR EL TRATO Y SEGIMIENTO,6,3007,10,D.F. Sur,3,Hospital de Oncolog�a Siglo XXI,490,1,1,1.62608855998486000000,2013-07-19,9